continuum-dev mailing list archives

Site index · List index
Message view « Date » · « Thread »
Top « Date » · « Thread »
From "Emmanuel Venisse (JIRA)" <j...@codehaus.org>
Subject [jira] Closed: (CONTINUUM-430) build failure emails should ideally include a URL link so we can click on the failed build and see the details
Date Wed, 09 Nov 2005 12:53:06 GMT
     [ http://jira.codehaus.org/browse/CONTINUUM-430?page=all ]
     
Emmanuel Venisse closed CONTINUUM-430:
--------------------------------------

      Assign To: Emmanuel Venisse
     Resolution: Fixed
    Fix Version: 1.0.1

already fixed. I always add now url of build result

In 1.0, you can obtain it (without build result) if you modifify the configuration of MailContinuumNotifier
in $CONTINUUM_HOME/apps/continuum/conf/application.xml, set the value of includeBuildResult
property to false.


> build failure emails should ideally include a URL link so we can click on the failed
build and see the details
> --------------------------------------------------------------------------------------------------------------
>
>          Key: CONTINUUM-430
>          URL: http://jira.codehaus.org/browse/CONTINUUM-430
>      Project: Continuum
>         Type: Improvement
>     Reporter: james strachan
>     Assignee: Emmanuel Venisse
>      Fix For: 1.0.1

>
>
> We've got lots of CI installs on different boxes and different projects; it'd be nice
to be able to click on the URL on a first line to take us to the detail of the build rather
than having to read the email (example below) and deduce where to go to see more info...
> Build statistics:
>   State: Failed
>   Previous State: Failed
>   Started at: Wed, 9 Nov 2005 03:00:08 -0800
>   Finished at: Wed, 9 Nov 2005 03:03:19 -0800
>   Total time: 3m 11s
>   Build Trigger: Schedule
>   Exit code: 70
>   Building machine hostname: aladdin
>   Operating system : Linux(unknown)
>   Java version : 1.5.0_03(Sun Microsystems Inc.)
> Changes
>                             activemq-web/project.xml
>             activemq-web/src/test/log4j.properties
>             activemq-web/src/webapp/WEB-INF/web.xml
>             maven.xml
> ****************************************************************************
> Output:
> ****************************************************************************
>  __  __
> |  \/  |__ _Apache__ ___
> | |\/| / _` \ V / -_) ' \  ~ intelligent projects ~
> |_|  |_\__,_|\_/\___|_||_|  v. 1.0.2
> Tag library requested that is not present: 'local:modules' in plugin: 'null'
> build:start:
> init:
> default:
> multiproject:projects-init:
>     [echo] Gathering project list
> Starting the reactor...
> Our processing order:
> ActiveMQ :: JAAS
> ActiveMQ :: Core
> ActiveMQ :: Assembly
> ActiveMQ :: Web
> ActiveMQ :: Resource Adapter
> +----------------------------------------
> | Gathering project list ActiveMQ :: JAAS
> | Memory: 11M/23M
> +----------------------------------------
> +----------------------------------------
> | Gathering project list ActiveMQ :: Core
> | Memory: 11M/23M
> +----------------------------------------
> +----------------------------------------
> | Gathering project list ActiveMQ :: Assembly
> | Memory: 11M/23M
> +----------------------------------------
> +----------------------------------------
> | Gathering project list ActiveMQ :: Web
> | Memory: 11M/23M
> +----------------------------------------
> +----------------------------------------
> | Gathering project list ActiveMQ :: Resource Adapter
> | Memory: 11M/23M
> +----------------------------------------
> Starting the reactor...
> Our processing order:
> ActiveMQ :: JAAS
> ActiveMQ :: Core
> ActiveMQ :: Assembly
> ActiveMQ :: Web
> ActiveMQ :: Resource Adapter
> +----------------------------------------
> | Executing default ActiveMQ :: JAAS
> | Memory: 12M/23M
> +----------------------------------------
> multiproject:goal:
> build:start:
> java:prepare-filesystem:
> java:compile:
>     [depend] Deleted 0 out of date files in 0 seconds
>     [echo] Compiling to /home/continuum/continuum-1.0/apps/continuum/working-directory/3/activemq-jaas/target/classes
> java:jar-resources:
> test:prepare-filesystem:
> test:test-resources:
> test:compile:
> test:test:
>     [echo] NOTICE: Skipping tests; they seem to have passed already
>     [echo] No tests to run.
> Copying: from '/home/continuum/continuum-1.0/apps/continuum/working-directory/3/activemq-jaas/target/activemq-jaas-4.0-SNAPSHOT.jar'
to: '/home/continuum/maven/.maven/repository/activemq/jars/activemq-jaas-4.0-SNAPSHOT.jar'
> Copying: from '/home/continuum/continuum-1.0/apps/continuum/working-directory/3/activemq-jaas/project.xml'
to: '/home/continuum/maven/.maven/repository/activemq/poms/activemq-jaas-4.0-SNAPSHOT.pom'
> +----------------------------------------
> | Executing default ActiveMQ :: Core
> | Memory: 16M/24M
> +----------------------------------------
> Attempting to download activemq-jaas-4.0-SNAPSHOT.jar.
> Attempting to download activecluster-1.1-SNAPSHOT.jar.
> Attempting to download activeio-2.1-SNAPSHOT.jar.
> Attempting to download xbean-spring-2.0-SNAPSHOT.jar.
> Attempting to download gram-1.1-SNAPSHOT.jar.
> jar:jar:
> jar:install:
> default:
> build:end:
> build:start:
> java:prepare-filesystem:
> java:compile:
> selector:generate:
>     [depend] Deleted 0 out of date files in 0 seconds
>     [echo] Compiling to /home/continuum/continuum-1.0/apps/continuum/working-directory/3/activemq-core/target/classes
> xbean:generate:
>     [xsdGenerate] Generating META-INF properties file: /home/continuum/continuum-1.0/apps/continuum/working-directory/3/activemq-core/target/generated/META-INF/services/org/xbean/spring/http/activemq.org/config/1.0
for namespace: http://activemq.org/config/1.0
>     [xsdGenerate] Generating HTML documentation file: /home/continuum/continuum-1.0/apps/continuum/working-directory/3/activemq-core/target/activemq.xsd.html
for namespace: http://activemq.org/config/1.0
>     [xsdGenerate] Generating XSD file: /home/continuum/continuum-1.0/apps/continuum/working-directory/3/activemq-core/target/activemq.xsd
for namespace: http://activemq.org/config/1.0
>     [xsdGenerate] ...done.
> java:jar-resources:
> Copying 1 file to /home/continuum/continuum-1.0/apps/continuum/working-directory/3/activemq-core/target/classes
> test:prepare-filesystem:
> test:test-resources:
> test:compile:
> test:test:
>     [echo] NOTICE: Skipping tests; they seem to have passed already
>     [echo] No tests to run.
> jar:jar:
>     [jar] Building jar: /home/continuum/continuum-1.0/apps/continuum/working-directory/3/activemq-core/target/activemq-core-4.0-SNAPSHOT.jar
> Copying: from '/home/continuum/continuum-1.0/apps/continuum/working-directory/3/activemq-core/target/activemq-core-4.0-SNAPSHOT.jar'
to: '/home/continuum/maven/.maven/repository/activemq/jars/activemq-core-4.0-SNAPSHOT.jar'
> Copying: from '/home/continuum/continuum-1.0/apps/continuum/working-directory/3/activemq-core/project.xml'
to: '/home/continuum/maven/.maven/repository/activemq/poms/activemq-core-4.0-SNAPSHOT.pom'
> +----------------------------------------
> | Executing default ActiveMQ :: Assembly
> | Memory: 24M/37M
> +----------------------------------------
> Attempting to download activemq-core-4.0-SNAPSHOT.jar.
> Attempting to download activemq-core-test-4.0-SNAPSHOT.jar.
> Attempting to download activesoap-1.0-SNAPSHOT.jar.
> Attempting to download org.mortbay.jetty-5.1-SNAPSHOT.jar.
> Artifact /jetty/jars/org.mortbay.jetty-5.1-SNAPSHOT.jar doesn't exists in remote repository,
but it exists locally
> Attempting to download activecluster-1.1-SNAPSHOT.jar.
> Attempting to download xbean-spring-2.0-SNAPSHOT.jar.
> jar:install:
> default:
> build:end:
> build:start:
> default:
> dist:build-setup:
>     [delete] Deleting directory /home/continuum/continuum-1.0/apps/continuum/working-directory/3/assembly/target/distributions
>     [mkdir] Created dir: /home/continuum/continuum-1.0/apps/continuum/working-directory/3/assembly/target/distributions
> java:prepare-filesystem:
> java:compile:
>     [echo] Compiling to /home/continuum/continuum-1.0/apps/continuum/working-directory/3/assembly/target/classes
>     [echo] No java source files to compile.
> java:jar-resources:
> test:prepare-filesystem:
> test:test-resources:
> test:compile:
> test:test:
>     [junit] Running org.activemq.usecases.PublishOnDurableTopicConsumedMessageTest
>     [junit] Tests run: 1, Failures: 0, Errors: 0, Time elapsed: 0.686 sec
>     [junit] Running org.activemq.usecases.ChangeSentMessageTest
>     [junit] Tests run: 1, Failures: 0, Errors: 0, Time elapsed: 0.804 sec
>     [junit] Running org.activemq.usecases.TransactionTest
>     [junit] Tests run: 1, Failures: 0, Errors: 0, Time elapsed: 3.124 sec
>     [junit] Running org.activemq.usecases.ConsumeTopicPrefetchTest
>     [junit] Tests run: 3, Failures: 0, Errors: 0, Time elapsed: 7.573 sec
>     [junit] Running org.activemq.usecases.ConsumeQueuePrefetchTest
>     [junit] Tests run: 3, Failures: 0, Errors: 0, Time elapsed: 4.786 sec
>     [junit] Running org.activemq.usecases.StartAndStopBrokerTest
>     [junit] Tests run: 1, Failures: 0, Errors: 0, Time elapsed: 4.706 sec
>     [junit] Running org.activemq.usecases.PublishOnQueueConsumedMessageTest
>     [junit] Tests run: 1, Failures: 0, Errors: 0, Time elapsed: 0.732 sec
>     [junit] Running org.activemq.usecases.CompositePublishTest
>     [junit] Tests run: 1, Failures: 0, Errors: 0, Time elapsed: 33.796 sec
>     [junit] Running org.activemq.usecases.SubscribeClosePublishThenConsumeTest
>     [junit] Tests run: 1, Failures: 0, Errors: 0, Time elapsed: 5.196 sec
>     [junit] Running org.activemq.usecases.QueueDuplicatesTest
>     [junit] Tests run: 1, Failures: 0, Errors: 1, Time elapsed: 0.698 sec
>     [junit] [ERROR] TEST org.activemq.usecases.QueueDuplicatesTest FAILED
>     [junit] Running org.activemq.usecases.TopicRedeliverTest
>     [junit] Tests run: 3, Failures: 0, Errors: 0, Time elapsed: 12.679 sec
>     [junit] Running org.activemq.usecases.QueueRedeliverTest
>     [junit] Tests run: 3, Failures: 0, Errors: 0, Time elapsed: 12.774 sec
>     [junit] Running org.activemq.usecases.PublishOnTopicConsumedMessageTest
>     [junit] Tests run: 1, Failures: 0, Errors: 0, Time elapsed: 0.8 sec
>     [junit] Running org.activemq.usecases.CompositeConsumeTest
>     [junit] Tests run: 1, Failures: 0, Errors: 0, Time elapsed: 0.755 sec
>     [junit] Running org.activemq.usecases.CreateTemporaryQueueBeforeStartTest
>     [junit] Tests run: 3, Failures: 0, Errors: 0, Time elapsed: 1.21 sec
>     [junit] Running org.activemq.usecases.PublishOnTemporaryQueueConsumedMessageTest
>     [junit] Tests run: 1, Failures: 0, Errors: 0, Time elapsed: 0.702 sec
>     [junit] Running org.activemq.usecases.TransactionRollbackOrderTest
>     [junit] Tests run: 1, Failures: 0, Errors: 0, Time elapsed: 0.898 sec
>     [junit] Running org.activemq.usecases.ExceptionListenerTest
>     [junit] Tests run: 1, Failures: 0, Errors: 0, Time elapsed: 0.233 sec
>     [junit] Running org.activemq.usecases.TransientQueueRedeliverTest
>     [junit] Tests run: 3, Failures: 0, Errors: 0, Time elapsed: 12.637 sec
>     [junit] Running org.activemq.config.ConfigTest
>     [junit] Tests run: 6, Failures: 0, Errors: 0, Time elapsed: 17.429 sec
>     [junit] Running org.activemq.config.BrokerXmlConfigTest
>     [junit] Tests run: 1, Failures: 0, Errors: 0, Time elapsed: 3.496 sec
>     [junit] Running org.activemq.config.BrokerXmlConfigFromJNDITest
>     [junit] Tests run: 1, Failures: 0, Errors: 0, Time elapsed: 3.499 sec
>     [junit] Running org.activemq.transport.QueueClusterTest
>     [junit] Tests run: 1, Failures: 0, Errors: 0, Time elapsed: 10.814 sec
>     [junit] Running org.activemq.transport.TopicClusterTest
>     [junit] Tests run: 1, Failures: 0, Errors: 0, Time elapsed: 10.702 sec
> BUILD FAILED
> File...... /home/continuum/maven/.maven/cache/maven-multiproject-plugin-1.3.1/plugin.jelly
> Element... maven:reactor
> Line...... 217
> Column.... 9
> Unable to obtain goal [default] -- /home/continuum/maven/.maven/cache/maven-test-plugin-1.6.2/plugin.jelly:181:54:
<fail> There were test failures.
> Total time: 3 minutes 10 seconds
> Finished at: Wed Nov 09 03:03:19 PST 2005
> ****************************************************************************

-- 
This message is automatically generated by JIRA.
-
If you think it was sent incorrectly contact one of the administrators:
   http://jira.codehaus.org/secure/Administrators.jspa
-
For more information on JIRA, see:
   http://www.atlassian.com/software/jira


Mime
View raw message