continuum-dev mailing list archives

Site index · List index
Message view « Date » · « Thread »
Top « Date » · « Thread »
From Emmanuel Venisse <emman...@venisse.net>
Subject Re: [continuum build - SUCCESS - update] Tue Aug 23 22:30:00 GMT 2005
Date Thu, 25 Aug 2005 10:33:23 GMT
Hi,

it's what I found in your logs :

2005-08-25 19:53:56,546 [Thread-29] WARN  ContinuumBuildExecutor:ant 
  - Could not find the executable 'ant' in the path '[]'.
2005-08-25 19:53:56,546 [Thread-29] WARN  ContinuumBuildExecutor:maven-1 
- Could not find the executable 'maven' in the path '[]'.
2005-08-25 19:53:56,546 [Thread-29] WARN  ContinuumBuildExecutor:maven2 
  - Could not find the executable 'm2' in the path '[]'.

You need to have ant, maven, m2, cvs and svn in your path. Do you have 
all of them?

Emmanuel

Rinku wrote:
> Hi Emmanuel,
> 
> Please find attached the logs with the latest snapshot build rev. 
> 240015.  I
> have copied only the relevant exceptions and messages (no such logger) to
> the build log, the other 2 are test reports.
> 
> Please let me know in case you'd need full build output.
> 
> Cheers,
> 
> Rahul
> 
> 
> ----- Original Message ----- From: "Emmanuel Venisse" 
> <emmanuel@venisse.net>
> To: <continuum-dev@maven.apache.org>
> Sent: Thursday, August 25, 2005 8:46 AM
> Subject: Re: [continuum build - SUCCESS - update] Tue Aug 23 22:30:00 GMT
> 2005
> 
> 
>> I think brett run it on cygwin.
>> Personally, I run it withoutout cygwin.
>>
>> Can you send us the output?
>>
>> Emmanuel
>>
>> Rinku wrote:
>>
>>>
>>> Yes, I get a failure for Integration tests (ShellIntegrationTest 
>>> failure)
>>> and couple of exceptions. I can confirm all the environment variables
>>> below are set.
>>>
>>> Are you running your builds on cygwin?
>>>
>>> Thanks for the help.
>>>
>>> Cheers,
>>>
>>> Rahul
>>>
>>>
>>>
>>> ----- Original Message ----- From: "Brett Porter" <brett@apache.org>
>>> To: <continuum-dev@maven.apache.org>
>>> Sent: Thursday, August 25, 2005 12:01 AM
>>> Subject: Re: [continuum build - SUCCESS - update] Tue Aug 23 22:30:00 
>>> GMT
>>> 2005
>>>
>>>
>>>> Works for me. I assume it is the integration tests that fail? Make sure
>>>> you have Ant, Maven and M2 installed, with ANT_HOME, MAVEN_HOME and
>>>> M2_HOME set.
>>>>
>>>> - Brett
>>>>
>>>> Rinku wrote:
>>>>
>>>>> Hi,
>>>>>
>>>>> What platform are Continuum builds succeeding on?
>>>>>
>>>>> I am using XP and update and build M2 prior to updating and building
>>>>> Continuum, but never get a successful build :-(
>>>>>
>>>>> Anyone building on XP ? or is it known that build still has errors on
>>>>> XP.
>>>>>
>>>>> Cheers,
>>>>>
>>>>> Rahul
>>>>>
>>>>> ----- Original Message ----- From: <continuum@maven.zones.apache.org>
>>>>> To: <continuum-dev@maven.apache.org>
>>>>> Sent: Wednesday, August 24, 2005 10:37 AM
>>>>> Subject: [continuum build - SUCCESS - update] Tue Aug 23 22:30:00 GMT
>>>>> 2005
>>>>>
>>>>>
>>>>>> Distribution:
>>>>>> http://maven.zones.apache.org/~continuum/builds/continuum-20050823.223000.tar.gz 
>>>>>>
>>>>>>
>>>>>>
>>>>>> Log:
>>>>>> http://maven.zones.apache.org/~continuum/logs/continuum-build-log-20050823.223000.txt 
>>>>>>
>>>>>
>>>>>
>>>>>
>>>>>
>>>>>
>>>>>
>>>>
>>>
>>>
>>>
>>
> [2005.08.25 19:53:45] Removing all existing projects from Continuum.
> [2005.08.25 19:53:45] Initializing Ant CVS project
> 2005-08-25 19:53:46,140 [main] WARN  ContinuumBuildExecutor:ant     - 
> Could not find the executable 'ant' in the pa
> th '[]'.
> 2005-08-25 19:53:46,140 [main] WARN  ContinuumBuildExecutor:maven-1 - 
> Could not find the executable 'maven' in the
> path '[]'.
> 2005-08-25 19:53:46,140 [main] DEBUG MavenSettingsBuilder           - 
> Building Maven global-level settings from: 'D
> :\rnd\apps\m2\conf\settings.xml'
> 2005-08-25 19:53:46,140 [main] DEBUG MavenSettingsBuilder           - 
> Building Maven user-level settings from: 'C:\
> Documents and Settings\Arnold.NONE-C03D6244FF\.m2\settings.xml'
> 2005-08-25 19:53:46,140 [main] WARN  ContinuumBuildExecutor:maven2  - 
> Could not find the executable 'm2' in the pat
> h '[]'.
> 2005-08-25 19:53:46,140 [main] INFO  BuildExecutorManager           - 
> Build executors:
> 2005-08-25 19:53:46,140 [main] INFO  BuildExecutorManager           -   
> maven-1
> 2005-08-25 19:53:46,140 [main] INFO  BuildExecutorManager           -   ant
> 2005-08-25 19:53:46,140 [main] INFO  BuildExecutorManager           -   
> maven2
> 2005-08-25 19:53:46,140 [main] INFO  BuildExecutorManager           -   
> shell
> 2005-08-25 19:53:46,234 [Thread-18] INFO  ContinuumScm                   
> - Checking out project: 'Ant CVS Project',
> id: '6' to 'D:\continuum\continuum-core-it\target\working-directory\6'.
> 2005-08-25 19:53:48,031 [Thread-18] INFO  ContinuumScm                   
> - Checked out 2 files.
> [2005.08.25 19:53:48] Building CVS Ant project
> 2005-08-25 19:53:48,140 [main] INFO  Continuum                      - 
> Enqueuing 'Ant CVS Project'.
> 2005-08-25 19:53:48,265 [Thread-17] INFO  ContinuumScm                   
> - Updating project: id: '6', name 'Ant CVS
> Project'.
> 2005-08-25 19:53:48,578 [Thread-17] INFO  
> Action:update-project-from-working-directory - Updating project 'Ant CVS
> Project' from checkout.
> 2005-08-25 19:53:48,703 [Thread-17] WARN  ContinuumBuildExecutor:ant     
> - Could not find the executable 'ant' in t
> his path:
> 2005-08-25 19:53:48,703 [Thread-17] WARN  ContinuumBuildExecutor:ant     
> - Executable 'ant'.
> 2005-08-25 19:53:48,703 [Thread-17] INFO  ContinuumBuildExecutor:ant     
> - Arguments: -debug clean build
> 2005-08-25 19:53:48,703 [Thread-17] INFO  ContinuumBuildExecutor:ant     
> - Working directory: D:\continuum\continuu
> m-core-it\target\working-directory\6
> 2005-08-25 19:53:52,031 [Thread-17] INFO  ContinuumBuildExecutor:ant     
> - Exit code: 0
> 2005-08-25 19:53:52,171 [main] WARN  SQL                            - 
> Object with id "6" not found !
> [2005.08.25 19:53:52] Tearing down test - ignore any interrupted exceptions
> 2005-08-25 19:53:52,171 [main] INFO  TaskQueueExecutor:check-out-project 
> - Executor thread got shutdown signal.
> 2005-08-25 19:53:52,171 [main] INFO  TaskQueueExecutor:check-out-project 
> - Waiting until task executor 'check-out-p
> roject' is idling...
> 2005-08-25 19:53:52,171 [Thread-18] INFO  
> TaskQueueExecutor:check-out-project - Executor thread 'check-out-project'
> exited.
> 2005-08-25 19:53:52,171 [main] INFO  Continuum                      - 
> Stopping Continuum.
> 2005-08-25 19:53:52,171 [main] INFO  Continuum                      - 
> Continuum stopped.
> There was no such logger 
> 'org.codehaus.plexus.action.Action:update-working-directory-from-scm' 
> 26016149.
> There was no such logger 'org.apache.maven.plugin.MavenPluginCollector' 
> 26016149.
> There was no such logger 
> 'org.apache.maven.continuum.execution.maven.m2.MavenBuilderHelper' 
> 26016149.2005-08-25 19:
> 53:52,171 [Thread-17] WARN  SQL                            - Object with 
> id "6" not found !
> 2005-08-25 19:53:52,171 [Thread-17] ERROR BuildController                
> - Error while building project.
> org.apache.maven.continuum.store.ContinuumObjectNotFoundException: Could 
> not find object. Type 'org.apache.maven.co
> ntinuum.model.project.BuildResult'. Id: '6'.
>        at 
> org.apache.maven.continuum.store.JdoContinuumStore.getObjectById(JdoContinuumStore.java:415) 
> 
>        at 
> org.apache.maven.continuum.store.JdoContinuumStore.getBuildResult(JdoContinuumStore.java:600) 
> 
>        at 
> org.apache.maven.continuum.buildcontroller.DefaultBuildController.build(DefaultBuildController.java:165) 
> 
> 
>        at 
> org.apache.maven.continuum.buildcontroller.BuildProjectTaskExecutor.executeTask(BuildProjectTaskExecutor 
> 
> .java:53)
>        at 
> org.codehaus.plexus.taskqueue.execution.ThreadedTaskQueueExecutor$ExecutorRunnable.run(ThreadedTaskQueue 
> 
> Executor.java:103)
>        at java.lang.Thread.run(Thread.java:595)
> 2005-08-25 19:53:52,187 [Thread-17] WARN  SQL                            
> - Object with id "6" not found !
> 2005-08-25 19:53:52,187 [Thread-17] ERROR BuildController                
> - Internal error while building the projec
> t.
> org.apache.maven.continuum.store.ContinuumObjectNotFoundException: Could 
> not find object. Type 'org.apache.maven.co
> ntinuum.model.project.BuildResult'. Id: '6'.
>        at 
> org.apache.maven.continuum.store.JdoContinuumStore.getObjectById(JdoContinuumStore.java:415) 
> 
>        at 
> org.apache.maven.continuum.store.JdoContinuumStore.getBuildResult(JdoContinuumStore.java:600) 
> 
>        at 
> org.apache.maven.continuum.buildcontroller.DefaultBuildController.build(DefaultBuildController.java:175) 
> 
> 
>        at 
> org.apache.maven.continuum.buildcontroller.BuildProjectTaskExecutor.executeTask(BuildProjectTaskExecutor 
> 
> .java:53)
>        at 
> org.codehaus.plexus.taskqueue.execution.ThreadedTaskQueueExecutor$ExecutorRunnable.run(ThreadedTaskQueue 
> 
> Executor.java:103)
>        at java.lang.Thread.run(Thread.java:595)
> 2005-08-25 19:53:52,187 [Thread-17] WARN  SQL                            
> - Object with id "6" not found !
> 2005-08-25 19:53:52,187 [Thread-17] ERROR 
> ContinuumNotificationDispatcher - Error while population the notification
> context.
> org.apache.maven.continuum.store.ContinuumObjectNotFoundException: Could 
> not find object. Type 'org.apache.maven.co
> ntinuum.model.project.Project'. Id: '6'.
>        at 
> org.apache.maven.continuum.store.JdoContinuumStore.getObjectById(JdoContinuumStore.java:415) 
> 
>        at 
> org.apache.maven.continuum.store.JdoContinuumStore.getProjectWithAllDetails(JdoContinuumStore.java:632) 
> 
>        at 
> org.apache.maven.continuum.notification.DefaultContinuumNotificationDispatcher.sendNotification(DefaultC 
> 
> ontinuumNotificationDispatcher.java:112)
>        at 
> org.apache.maven.continuum.notification.DefaultContinuumNotificationDispatcher.buildComplete(DefaultCont 
> 
> inuumNotificationDispatcher.java:89)
>        at 
> org.apache.maven.continuum.buildcontroller.DefaultBuildController.build(DefaultBuildController.java:226) 
> 
> 
>        at 
> org.apache.maven.continuum.buildcontroller.BuildProjectTaskExecutor.executeTask(BuildProjectTaskExecutor 
> 
> .java:53)
>        at 
> org.codehaus.plexus.taskqueue.execution.ThreadedTaskQueueExecutor$ExecutorRunnable.run(ThreadedTaskQueue 
> 
> Executor.java:103)
>        at java.lang.Thread.run(Thread.java:595)
> 
> 
> -------------------------- snip 8< 
> ------------------------------------------------
> 
> 2005-08-25 19:55:16,531 [scheduler1_Worker-9] DEBUG 
> SimpleThreadPool               - WorkerThread is shutting down
> 2005-08-25 19:55:16,531 [scheduler1_Worker-8] DEBUG 
> SimpleThreadPool               - WorkerThread is shutting down
> 2005-08-25 19:55:16,531 [scheduler1_Worker-7] DEBUG 
> SimpleThreadPool               - WorkerThread is shutting down
> 2005-08-25 19:55:16,531 [scheduler1_Worker-6] DEBUG 
> SimpleThreadPool               - WorkerThread is shutting down
> 2005-08-25 19:55:16,531 [scheduler1_Worker-5] DEBUG 
> SimpleThreadPool               - WorkerThread is shutting down
> 2005-08-25 19:55:16,531 [scheduler1_Worker-4] DEBUG 
> SimpleThreadPool               - WorkerThread is shutting down
> 2005-08-25 19:55:16,531 [scheduler1_Worker-3] DEBUG 
> SimpleThreadPool               - WorkerThread is shutting down
> 2005-08-25 19:55:16,531 [scheduler1_Worker-2] DEBUG 
> SimpleThreadPool               - WorkerThread is shutting down
> 2005-08-25 19:55:16,531 [scheduler1_Worker-0] DEBUG 
> SimpleThreadPool               - WorkerThread is shutting down
> 2005-08-25 19:55:16,531 [main] INFO  QuartzScheduler                - 
> Scheduler scheduler1_$_NON_CLUSTERED shutdown
> complete.
> There was no such logger 
> 'org.apache.maven.continuum.scheduler.ContinuumScheduler' 24041479.
> There was no such logger 'org.codehaus.plexus.action.ActionManager' 
> 24041479.
> There was no such logger 'org.codehaus.plexus.mailsender.MailSender' 
> 24041479.
> There was no such logger 
> 'org.apache.maven.continuum.execution.ContinuumBuildExecutor:maven2' 
> 24041479.
> There was no such logger 
> 'org.apache.maven.project.interpolation.ModelInterpolator' 24041479.
> There was no such logger 
> 'org.codehaus.plexus.notification.notifier.Notifier:console' 24041479.
> There was no such logger 
> 'org.apache.maven.continuum.execution.manager.BuildExecutorManager' 
> 24041479.
> There was no such logger 
> 'org.apache.maven.continuum.utils.shell.ShellCommandHelper' 24041479.
> There was no such logger 
> 'org.codehaus.plexus.taskqueue.execution.TaskExecutor:build-project' 
> 24041479.
> There was no such logger 
> 'org.codehaus.plexus.notification.RecipientSource' 24041479.
> There was no such logger 
> 'org.apache.maven.continuum.initialization.ContinuumInitializer' 24041479.
> There was no such logger 
> 'org.apache.maven.continuum.build.settings.SchedulesActivator' 24041479.
> There was no such logger 
> 'org.apache.maven.continuum.execution.ContinuumBuildExecutor:maven-1' 
> 24041479.
> There was no such logger 'org.codehaus.plexus.jdo.JdoFactory' 24041479.
> There was no such logger 
> 'org.codehaus.plexus.action.Action:store-checkout-scm-result' 24041479.
> There was no such logger 
> 'org.codehaus.plexus.notification.notifier.Notifier:jabber' 24041479.
> There was no such logger 
> 'org.apache.maven.continuum.execution.maven.m1.MavenOneMetadataHelper' 
> 24041479.
> There was no such logger 
> 'org.codehaus.plexus.action.Action:execute-builder' 24041479.
> There was no such logger 
> 'org.apache.maven.artifact.transform.ArtifactTransformation:release' 
> 24041479.
> There was no such logger 'org.codehaus.plexus.jabber.JabberClient' 
> 24041479.
> There was no such logger 
> 'org.codehaus.plexus.action.Action:store-project' 24041479.
> There was no such logger 
> 'org.codehaus.plexus.taskqueue.TaskViabilityEvaluator:build-project' 
> 24041479.
> There was no such logger 
> 'org.codehaus.plexus.notification.notifier.Notifier:mail' 24041479.
> There was no such logger 
> 'org.apache.maven.continuum.notification.ContinuumNotificationDispatcher' 
> 24041479.
> There was no such logger 'org.apache.maven.project.MavenProjectBuilder' 
> 24041479.
> There was no such logger 'org.codehaus.plexus.msn.MsnClient' 24041479.
> There was no such logger 
> 'org.apache.maven.artifact.transform.ArtifactTransformation:snapshot' 
> 24041479.
> There was no such logger 
> 'org.codehaus.plexus.action.Action:validate-project' 24041479.
> There was no such logger 'org.apache.maven.scm.manager.ScmManager' 
> 24041479.
> There was no such logger 
> 'org.codehaus.plexus.notification.notifier.Notifier:msn' 24041479.
> There was no such logger 
> 'org.apache.maven.artifact.manager.WagonManager' 24041479.
> 2005-08-25 19:55:16,546 [main] INFO  TaskQueueExecutor:build-project - 
> Executor thread got shutdown signal.
> 2005-08-25 19:55:16,546 [Thread-61] INFO  
> TaskQueueExecutor:build-project - Executor thread 'build-project' exited.
> 
> There was no such logger 
> 'org.codehaus.plexus.taskqueue.execution.TaskQueueExecutor:build-project' 
> 24041479.
> There was no such logger 
> 'org.codehaus.plexus.action.Action:update-project-from-working-directory' 
> 24041479.
> There was no such logger 
> 'org.codehaus.plexus.action.Action:check-working-directory' 24041479.
> There was no such logger 
> 'org.apache.maven.artifact.transform.ArtifactTransformation:latest' 
> 24041479.
> [2005.08.25 19:55:16] Used 16781ms
> [surefire] Running org.apache.maven.continuum.it.ShellIntegrationTest
> [surefire] Tests run: 1, Failures: 0, Errors: 1, Time elapsed: 16.796 
> sec <<<<<<<< FAILURE !!
> 
> Results :
> [surefire] Tests run: 5, Failures: 1, Errors: 1
> 
> [INFO] 
> ---------------------------------------------------------------------------- 
> 
> [INFO] BUILD FAILURE
> [INFO] 
> ---------------------------------------------------------------------------- 
> 
> [INFO] Reason: There are some test failure.
> [INFO] 
> ---------------------------------------------------------------------------- 
> 
> [INFO] Total time: 8 minutes 48 seconds
> [INFO] Finished at: Thu Aug 25 19:55:16 NZST 2005
> [INFO] Final Memory: 51M/63M
> [INFO] 
> ---------------------------------------------------------------------------- 
> 
> 
> 
> 
> 
> 
> 
> 
> ------------------------------------------------------------------------------- 
> 
> Battery: org.apache.maven.continuum.it.MavenOneIntegrationTest
> ------------------------------------------------------------------------------- 
> 
> testBasic(org.apache.maven.continuum.it.MavenOneIntegrationTest)
> 
> [ stdout ] ---------------------------------------------------------------
> 
> [WARNING] The specified JAR repository doesn't exist or is not a 
> directory: 
> 'D:\continuum\continuum-core-it\target\level1\level2\plexus-home\lib'.
> 2005-08-25 19:53:52,390 [main] DEBUG PlexusContainer                - 
> Found 3 components to load on start
> 2005-08-25 19:53:52,390 [main] INFO  PlexusContainer                - 
> Loading on start [role]: [org.apache.maven.continuum.Continuum]
> 2005-08-25 19:53:52,406 [main] INFO  JdoFactory                     - 
> Initializing JDO.
> 2005-08-25 19:53:52,406 [main] INFO  JDO                            - 
> PersistenceManagerFactory - Vendor: JPOX  Version: 1.1.0-beta-4-SNAPSHOT
> 2005-08-25 19:53:52,406 [main] INFO  JDO                            - 
> PersistenceManagerFactory initialised for datastore 
> URL=jdbc:derby:D:\continuum\continuum-core-it\target\level1\level2\plexus-home/database;create=true 
> driver=org.apache.derby.jdbc.EmbeddedDriver userName=sa
> 2005-08-25 19:53:52,406 [main] INFO  RAMJobStore                    - 
> RAMJobStore initialized.
> 2005-08-25 19:53:52,406 [main] INFO  StdSchedulerFactory            - 
> Quartz scheduler 'scheduler1' initialized from an externally provided 
> properties instance.
> 2005-08-25 19:53:52,421 [main] INFO  StdSchedulerFactory            - 
> Quartz scheduler version: 1.4.5
> 2005-08-25 19:53:52,421 [main] INFO  QuartzScheduler                - 
> Scheduler scheduler1_$_NON_CLUSTERED started.
> 2005-08-25 19:53:52,421 [main] INFO  Continuum                      - 
> Initializing Continuum.
> 2005-08-25 19:53:52,421 [main] INFO  Continuum                      - 
> Showing all projects: 2005-08-25 19:53:52,437 [main] INFO  
> RDBMS                          - RDBMS Adapter initialised : 
> CloudscapeAdapter : Apache Derby version=10.0.2.1, major=10, minor=0, 
> revision=2
> Identifier Names : UPPERCASE Driver name=Apache Derby Embedded JDBC 
> Driver, version=10.0.2.1, major=10, minor=0
> Identifier Max Lengths : Table=128  Column=30  Constraint=18  Index=18  
> Delimeters="
> Identifier Support in DDL : catalog=false  schema=true
> 2005-08-25 19:53:52,437 [main] INFO  SCHEMA                         - 
> Initialising Catalog "", Schema "SA" using "SchemaTable" auto-start option
> 2005-08-25 19:53:52,484 [main] INFO  JDO                            - 
> Managing Persistence of 
> org.apache.maven.continuum.model.project.ProjectDependency since it was 
> managed previously
> 2005-08-25 19:53:52,484 [main] INFO  JDO                            - 
> Managing Persistence of org.apache.maven.continuum.model.project.Profile 
> since it was managed previously
> 2005-08-25 19:53:52,484 [main] INFO  JDO                            - 
> Managing Persistence of 
> org.apache.maven.continuum.model.project.BuildResult since it was 
> managed previously
> 2005-08-25 19:53:52,484 [main] INFO  JDO                            - 
> Managing Persistence of org.apache.maven.continuum.model.scm.ChangeSet 
> since it was managed previously
> 2005-08-25 19:53:52,484 [main] INFO  JDO                            - 
> Managing Persistence of org.apache.maven.continuum.model.project.Project 
> since it was managed previously
> 2005-08-25 19:53:52,500 [main] INFO  JDO                            - 
> Managing Persistence of org.apache.maven.continuum.model.scm.ChangeFile 
> since it was managed previously
> 2005-08-25 19:53:52,500 [main] INFO  JDO                            - 
> Managing Persistence of 
> org.apache.maven.continuum.model.project.ProjectGroup since it was 
> managed previously
> 2005-08-25 19:53:52,500 [main] INFO  JDO                            - 
> Managing Persistence of 
> org.apache.maven.continuum.model.project.BuildDefinition since it was 
> managed previously
> 2005-08-25 19:53:52,500 [main] INFO  JDO                            - 
> Managing Persistence of 
> org.apache.maven.continuum.model.system.Installation since it was 
> managed previously
> 2005-08-25 19:53:52,500 [main] INFO  JDO                            - 
> Managing Persistence of 
> org.apache.maven.continuum.model.project.Schedule since it was managed 
> previously
> 2005-08-25 19:53:52,500 [main] INFO  JDO                            - 
> Managing Persistence of org.apache.maven.continuum.model.scm.ScmResult 
> since it was managed previously
> 2005-08-25 19:53:52,500 [main] INFO  JDO                            - 
> Managing Persistence of 
> org.apache.maven.continuum.model.project.ProjectNotifier since it was 
> managed previously
> 2005-08-25 19:53:52,500 [main] INFO  JDO                            - 
> Managing Persistence of 
> org.apache.maven.continuum.model.project.ProjectDeveloper since it was 
> managed previously
> 2005-08-25 19:53:52,531 [main] INFO  MetaData                       - 
> Parsing MetaData from file 
> "file:/D:/continuum/continuum-model/target/continuum-model-1.0-beta-1-SNAPSHOT.jar!/META-INF/package.jdo" 
> 
> 2005-08-25 19:53:52,687 [main] INFO  SCHEMA                         - 
> Managing Persistence of Class : 
> org.apache.maven.continuum.model.project.ProjectDependency [Table : 
> PROJECTDEPENDENCY, InheritanceStrategy : new-table]
> 2005-08-25 19:53:52,687 [main] INFO  SCHEMA                         - 
> Managing Persistence of Class : 
> org.apache.maven.continuum.model.system.Installation [Table : 
> INSTALLATION, InheritanceStrategy : new-table]
> 2005-08-25 19:53:52,687 [main] INFO  SCHEMA                         - 
> Managing Persistence of Class : 
> org.apache.maven.continuum.model.project.Profile [Table : PROFILE, 
> InheritanceStrategy : new-table]
> 2005-08-25 19:53:52,703 [main] INFO  SCHEMA                         - 
> Managing Persistence of Class : 
> org.apache.maven.continuum.model.project.Schedule [Table : SCHEDULE, 
> InheritanceStrategy : new-table]
> 2005-08-25 19:53:52,703 [main] INFO  SCHEMA                         - 
> Managing Persistence of Class : 
> org.apache.maven.continuum.model.project.BuildDefinition [Table : 
> BUILDDEFINITION, InheritanceStrategy : new-table]
> 2005-08-25 19:53:52,703 [main] INFO  SCHEMA                         - 
> Managing Persistence of Class : 
> org.apache.maven.continuum.model.scm.ChangeFile [Table : CHANGEFILE, 
> InheritanceStrategy : new-table]
> 2005-08-25 19:53:52,703 [main] INFO  SCHEMA                         - 
> Managing Persistence of Class : 
> org.apache.maven.continuum.model.scm.ChangeSet [Table : CHANGESET, 
> InheritanceStrategy : new-table]
> 2005-08-25 19:53:52,703 [main] INFO  SCHEMA                         - 
> Managing Persistence of Class : 
> org.apache.maven.continuum.model.scm.ScmResult [Table : SCMRESULT, 
> InheritanceStrategy : new-table]
> 2005-08-25 19:53:52,703 [main] INFO  SCHEMA                         - 
> Managing Persistence of Class : 
> org.apache.maven.continuum.model.project.ProjectDeveloper [Table : 
> PROJECTDEVELOPER, InheritanceStrategy : new-table]
> 2005-08-25 19:53:52,703 [main] INFO  SCHEMA                         - 
> Managing Persistence of Class : 
> org.apache.maven.continuum.model.project.ProjectNotifier [Table : 
> PROJECTNOTIFIER, InheritanceStrategy : new-table]
> 2005-08-25 19:53:52,703 [main] INFO  SCHEMA                         - 
> Managing Persistence of Class : 
> org.apache.maven.continuum.model.project.ProjectGroup [Table : 
> PROJECTGROUP, InheritanceStrategy : new-table]
> 2005-08-25 19:53:52,703 [main] INFO  SCHEMA                         - 
> Managing Persistence of Class : 
> org.apache.maven.continuum.model.project.Project [Table : PROJECT, 
> InheritanceStrategy : new-table]
> 2005-08-25 19:53:52,703 [main] INFO  SCHEMA                         - 
> Managing Persistence of Class : 
> org.apache.maven.continuum.model.project.BuildResult [Table : 
> BUILDRESULT, InheritanceStrategy : new-table]
> 2005-08-25 19:53:52,703 [main] INFO  SCHEMA                         - 
> Managing Persistence of Field : 
> org.apache.maven.continuum.model.project.ProjectNotifier.configuration 
> [Table : PROJECTNOTIFIER_CONFIGURATION]
> 2005-08-25 19:53:52,703 [main] INFO  SCHEMA                         - 
> Managing Persistence of Field : 
> org.apache.maven.continuum.model.project.ProjectGroup.buildDefinitions 
> [Table : PROJECTGROUP_BUILDDEFINITIONS]
> 2005-08-25 19:53:52,703 [main] INFO  SCHEMA                         - 
> Managing Persistence of Field : 
> org.apache.maven.continuum.model.project.ProjectGroup.notifiers [Table : 
> PROJECTGROUP_NOTIFIERS]
> 2005-08-25 19:53:52,703 [main] INFO  SCHEMA                         - 
> Managing Persistence of Field : 
> org.apache.maven.continuum.model.project.Project.buildDefinitions [Table 
> : PROJECT_BUILDDEFINITIONS]
> 2005-08-25 19:53:52,718 [main] INFO  SCHEMA                         - 
> Managing Persistence of Field : 
> org.apache.maven.continuum.model.project.Project.notifiers [Table : 
> PROJECT_NOTIFIERS]
> 2005-08-25 19:53:52,859 [main] INFO  RDBMS                          - 
> Validated 1 unique key(s) for table CHANGEFILE
> 2005-08-25 19:53:52,859 [main] INFO  RDBMS                          - 
> Validated 1 foreign key(s) for table CHANGEFILE
> 2005-08-25 19:53:52,859 [main] INFO  RDBMS                          - 
> Validated 1 unique key(s) for table BUILDDEFINITION
> 2005-08-25 19:53:52,875 [main] INFO  RDBMS                          - 
> Validated 2 foreign key(s) for table BUILDDEFINITION
> 2005-08-25 19:53:52,875 [main] INFO  RDBMS                          - 
> Validated 1 unique key(s) for table PROJECTNOTIFIER
> 2005-08-25 19:53:52,890 [main] INFO  RDBMS                          - 
> Validated 1 unique key(s) for table CHANGESET
> 2005-08-25 19:53:52,890 [main] INFO  RDBMS                          - 
> Validated 1 foreign key(s) for table CHANGESET
> 2005-08-25 19:53:52,890 [main] INFO  RDBMS                          - 
> Validated 1 unique key(s) for table PROJECTGROUP
> 2005-08-25 19:53:52,906 [main] INFO  RDBMS                          - 
> Validated 1 unique key(s) for table SCMRESULT
> 2005-08-25 19:53:52,906 [main] INFO  RDBMS                          - 
> Validated 1 unique key(s) for table BUILDRESULT
> 2005-08-25 19:53:52,906 [main] INFO  RDBMS                          - 
> Validated 2 foreign key(s) for table BUILDRESULT
> 2005-08-25 19:53:52,921 [main] INFO  RDBMS                          - 
> Validated 1 unique key(s) for table PROJECTDEVELOPER
> 2005-08-25 19:53:52,921 [main] INFO  RDBMS                          - 
> Validated 1 foreign key(s) for table PROJECTDEVELOPER
> 2005-08-25 19:53:52,937 [main] INFO  RDBMS                          - 
> Validated 1 unique key(s) for table SCHEDULE
> 2005-08-25 19:53:52,937 [main] INFO  RDBMS                          - 
> Validated 1 unique key(s) for table INSTALLATION
> 2005-08-25 19:53:52,984 [main] INFO  RDBMS                          - 
> Validated 1 unique key(s) for table PROJECT
> 2005-08-25 19:53:52,984 [main] INFO  RDBMS                          - 
> Validated 2 foreign key(s) for table PROJECT
> 2005-08-25 19:53:53,000 [main] INFO  RDBMS                          - 
> Validated 1 unique key(s) for table PROJECTDEPENDENCY
> 2005-08-25 19:53:53,000 [main] INFO  RDBMS                          - 
> Validated 1 foreign key(s) for table PROJECTDEPENDENCY
> 2005-08-25 19:53:53,000 [main] INFO  RDBMS                          - 
> Validated 1 unique key(s) for table PROFILE
> 2005-08-25 19:53:53,000 [main] INFO  RDBMS                          - 
> Validated 2 foreign key(s) for table PROFILE
> 2005-08-25 19:53:53,015 [main] INFO  RDBMS                          - 
> Validated 1 unique key(s) for table PROJECTNOTIFIER_CONFIGURATION
> 2005-08-25 19:53:53,015 [main] INFO  RDBMS                          - 
> Validated 1 foreign key(s) for table PROJECTNOTIFIER_CONFIGURATION
> 2005-08-25 19:53:53,015 [main] INFO  RDBMS                          - 
> Validated 1 unique key(s) for table PROJECTGROUP_BUILDDEFINITIONS
> 2005-08-25 19:53:53,031 [main] INFO  RDBMS                          - 
> Validated 2 foreign key(s) for table PROJECTGROUP_BUILDDEFINITIONS
> 2005-08-25 19:53:53,031 [main] INFO  RDBMS                          - 
> Validated 1 unique key(s) for table PROJECTGROUP_NOTIFIERS
> 2005-08-25 19:53:53,031 [main] INFO  RDBMS                          - 
> Validated 2 foreign key(s) for table PROJECTGROUP_NOTIFIERS
> 2005-08-25 19:53:53,046 [main] INFO  RDBMS                          - 
> Validated 1 unique key(s) for table PROJECT_NOTIFIERS
> 2005-08-25 19:53:53,046 [main] INFO  RDBMS                          - 
> Validated 2 foreign key(s) for table PROJECT_NOTIFIERS
> 2005-08-25 19:53:53,062 [main] INFO  RDBMS                          - 
> Validated 1 unique key(s) for table PROJECT_BUILDDEFINITIONS
> 2005-08-25 19:53:53,062 [main] INFO  RDBMS                          - 
> Validated 2 foreign key(s) for table PROJECT_BUILDDEFINITIONS
> 2005-08-25 19:53:53,062 [main] INFO  SCHEMA                         - 
> Catalog "", Schema "SA" initialised - managing 18 classes
> 2005-08-25 19:53:53,078 [main] INFO  Continuum                      - 
> Starting Continuum.
> 2005-08-25 19:53:53,078 [main] INFO  Continuum                      - 
> 2005-08-25 19:53:53,078 [main] INFO  Continuum                      - 
> 2005-08-25 19:53:53,078 [main] INFO  Continuum                      - < 
> Continuum 1.0-beta-1-20050825.074627-1 started! >
> 2005-08-25 19:53:53,078 [main] INFO  Continuum                      - 
> ---------------------------------------------------
> 2005-08-25 19:53:53,078 [main] INFO  Continuum                      
> -        \   ^__^
> 2005-08-25 19:53:53,078 [main] INFO  Continuum                      
> -         \  (oo)\_______
> 2005-08-25 19:53:53,078 [main] INFO  Continuum                      
> -            (__)\       )\/\
> 2005-08-25 19:53:53,078 [main] INFO  Continuum                      
> -                ||----w |
> 2005-08-25 19:53:53,078 [main] INFO  Continuum                      
> -                ||     ||
> 2005-08-25 19:53:53,078 [main] INFO  Continuum                      - 
> 2005-08-25 19:53:53,078 [main] INFO  Continuum                      - 
> 2005-08-25 19:53:53,078 [main] INFO  ContinuumInitializer           - 
> Continuum initializer running ...
> 2005-08-25 19:53:53,093 [main] INFO  SchedulesActivator             - 
> Activating build settings ...
> 2005-08-25 19:53:53,109 [main] INFO  SchedulesActivator             - 
> Thu Aug 25 19:54:00 NZST 2005
> 2005-08-25 19:53:53,109 [main] WARN  ContinuumScheduler             - 
> Will not schedule this job as a job {DEFAULT_BUILD_SETTINGS:DEFAULT} 
> already exists.
> 2005-08-25 19:53:53,109 [main] INFO  SchedulesActivator             - null
> 2005-08-25 19:53:53,109 [main] WARN  ContinuumScheduler             - 
> Will not schedule this job as a job {DEFAULT_BUILD_SETTINGS:DEFAULT} 
> already exists.
> 2005-08-25 19:53:53,109 [main] INFO  SchedulesActivator             - null
> 2005-08-25 19:53:53,109 [main] INFO  PlexusContainer                - 
> Loading on start [role,roleHint]: 
> [org.codehaus.plexus.taskqueue.execution.TaskQueueExecutor,build-project]
> 2005-08-25 19:53:53,781 [main] ERROR VelocityComponent              - 
> ResourceManager.getResource() parse exception: 
> org.apache.velocity.exception.ParseErrorException: Lexical error: 
> org.apache.velocity.runtime.parser.TokenMgrError: Lexical error at line 
> 110, column 17.  Encountered: <EOF> after : ""
> 2005-08-25 19:53:53,781 [main] INFO  Notifier:mail                  - 
> The from mailbox is not configured, will use the nag email address from 
> the project.
> 2005-08-25 19:53:53,781 [main] INFO  Notifier:mail                  - 
>  >From name: Continuum@192.168.1.64
> 2005-08-25 19:53:53,781 [main] INFO  Notifier:mail                  - 
> Build host name: 192.168.1.64
> 2005-08-25 19:53:53,781 [main] INFO  RecipientSource                - To 
> override address is not configured, will use the nag email address from 
> the project.
> 2005-08-25 19:53:53,781 [main] INFO  TaskQueueExecutor:build-project - 
> Starting task executor, thread name 'build-project'.
> 2005-08-25 19:53:53,781 [main] INFO  PlexusContainer                - 
> Loading on start [role,roleHint]: 
> [org.codehaus.plexus.taskqueue.execution.TaskQueueExecutor,check-out-project] 
> 
> 2005-08-25 19:53:53,781 [main] INFO  TaskQueueExecutor:check-out-project 
> - Starting task executor, thread name 'check-out-project'.
> [2005.08.25 19:53:53] Integration test settings
> [2005.08.25 19:53:53] IT root: D:\continuum\continuum-core-it\target\it
> [2005.08.25 19:53:53] Remoting method: jvm
> [2005.08.25 19:53:53] Store implementation: class 
> org.apache.maven.continuum.store.JdoContinuumStore
> [2005.08.25 19:53:54] Connecting to and starting Continuum
> [2005.08.25 19:53:54] Removing all existing projects from Continuum.
> [2005.08.25 19:53:54] Initializing Maven 1 CVS project
> [2005.08.25 19:53:54] Adding Maven 1 project
> 2005-08-25 19:53:54,421 [main] DEBUG MavenSettingsBuilder           - 
> Building Maven global-level settings from: 
> 'D:\rnd\apps\m2\conf\settings.xml'
> 2005-08-25 19:53:54,421 [main] DEBUG MavenSettingsBuilder           - 
> Building Maven user-level settings from: 'C:\Documents and 
> Settings\Arnold.NONE-C03D6244FF\.m2\settings.xml'
> 2005-08-25 19:53:54,421 [main] INFO  
> ContinuumProjectBuilder:maven-one-builder - Downloading 
> file:/D:/continuum/continuum-core-it/target/it/maven-1/project.xml
> 2005-08-25 19:53:54,437 [main] INFO  Continuum                      - 
> Created 1 projects.
> 2005-08-25 19:53:54,437 [main] INFO  Continuum                      - 
> Created 1 project groups.
> 2005-08-25 19:53:54,437 [main] INFO  Continuum                      - 0 
> warnings.
> 2005-08-25 19:53:54,437 [main] INFO  Continuum                      - 
> Creating project group with the group id: 'dummy'.
> 2005-08-25 19:53:55,265 [Thread-30] INFO  ContinuumScm                   
> - Checking out project: 'Maven 1 Project', id: '11' to 
> 'D:\continuum\continuum-core-it\target\working-directory\11'.
> 2005-08-25 19:53:56,046 [Thread-30] INFO  ContinuumScm                   
> - Checked out 2 files.
> [2005.08.25 19:53:56] Building Maven 1 project
> 2005-08-25 19:53:56,218 [main] INFO  Continuum                      - 
> Enqueuing 'Maven 1 Project'.
> 2005-08-25 19:53:56,343 [Thread-29] INFO  ContinuumScm                   
> - Updating project: id: '11', name 'Maven 1 Project'.
> 2005-08-25 19:53:56,546 [Thread-29] WARN  ContinuumBuildExecutor:ant     
> - Could not find the executable 'ant' in the path '[]'.
> 2005-08-25 19:53:56,546 [Thread-29] WARN  ContinuumBuildExecutor:maven-1 
> - Could not find the executable 'maven' in the path '[]'.
> 2005-08-25 19:53:56,546 [Thread-29] WARN  ContinuumBuildExecutor:maven2  
> - Could not find the executable 'm2' in the path '[]'.
> 2005-08-25 19:53:56,546 [Thread-29] INFO  BuildExecutorManager           
> - Build executors:
> 2005-08-25 19:53:56,546 [Thread-29] INFO  BuildExecutorManager           
> -   maven-1
> 2005-08-25 19:53:56,546 [Thread-29] INFO  BuildExecutorManager           
> -   ant
> 2005-08-25 19:53:56,546 [Thread-29] INFO  BuildExecutorManager           
> -   maven2
> 2005-08-25 19:53:56,546 [Thread-29] INFO  BuildExecutorManager           
> -   shell
> 2005-08-25 19:53:56,593 [Thread-29] INFO  
> Action:update-project-from-working-directory - Updating project 'Maven 1 
> Project' from checkout.
> 2005-08-25 19:53:56,906 [Thread-29] WARN  ContinuumBuildExecutor:maven-1 
> - Could not find the executable 'maven' in this path: 2005-08-25 
> 19:53:56,921 [Thread-29] WARN  ContinuumBuildExecutor:maven-1 - 
> Executable 'maven'.
> 2005-08-25 19:53:56,921 [Thread-29] INFO  ContinuumBuildExecutor:maven-1 
> - Arguments:  clean:clean jar:install
> 2005-08-25 19:53:56,921 [Thread-29] INFO  ContinuumBuildExecutor:maven-1 
> - Working directory: 
> D:\continuum\continuum-core-it\target\working-directory\11
> 2005-08-25 19:54:00,015 [scheduler1_Worker-1] INFO  
> SchedulesActivator             - >>>>>>>>>>>>>>>>>>>>> Executing build 
> job ...
> 2005-08-25 19:54:24,656 [Thread-29] INFO  ContinuumBuildExecutor:maven-1 
> - Exit code: 0
> [2005.08.25 19:54:34] Testing that the POM is updated before each build.
> 2005-08-25 19:54:34,109 [Thread-29] ERROR VelocityComponent              
> - Left side ($build.scmResult.files.size()) of '==' operation has null 
> value. If a reference, it may not be in the context. Operation not 
> possible. 
> /org/apache/maven/continuum/notification/mail/templates/maven-1/BuildComplete.vm 
> [line 17, column 39]
> 2005-08-25 19:54:34,109 [Thread-29] INFO  Notifier:mail                  
> - Sending message: From '"Continuum@192.168.1.64" <Arnold@localhost>'.
> 2005-08-25 19:54:34,109 [Thread-29] INFO  Notifier:mail                  
> - Recipient: To '<Arnold@localhost>'.
> DEBUG: JavaMail version 1.3.2
> DEBUG: java.io.FileNotFoundException: 
> D:\dev\apps\jdk\jdk1.5.0_01\jre\lib\javamail.providers (The system 
> cannot find the file specified)
> DEBUG: !anyLoaded
> DEBUG: not loading resource: /META-INF/javamail.providers
> DEBUG: successfully loaded resource: /META-INF/javamail.default.providers
> DEBUG: Tables of loaded providers
> DEBUG: Providers Listed By Class Name: 
> {com.sun.mail.smtp.SMTPSSLTransport=javax.mail.Provider[TRANSPORT,smtps,com.sun.mail.smtp.SMTPSSLTransport,Sun 
> Microsystems, Inc], 
> com.sun.mail.smtp.SMTPTransport=javax.mail.Provider[TRANSPORT,smtp,com.sun.mail.smtp.SMTPTransport,Sun 
> Microsystems, Inc], 
> com.sun.mail.imap.IMAPSSLStore=javax.mail.Provider[STORE,imaps,com.sun.mail.imap.IMAPSSLStore,Sun 
> Microsystems, Inc], 
> com.sun.mail.pop3.POP3SSLStore=javax.mail.Provider[STORE,pop3s,com.sun.mail.pop3.POP3SSLStore,Sun 
> Microsystems, Inc], 
> com.sun.mail.imap.IMAPStore=javax.mail.Provider[STORE,imap,com.sun.mail.imap.IMAPStore,Sun 
> Microsystems, Inc], 
> com.sun.mail.pop3.POP3Store=javax.mail.Provider[STORE,pop3,com.sun.mail.pop3.POP3Store,Sun 
> Microsystems, Inc]}
> DEBUG: Providers Listed By Protocol: 
> {imaps=javax.mail.Provider[STORE,imaps,com.sun.mail.imap.IMAPSSLStore,Sun 
> Microsystems, Inc], 
> imap=javax.mail.Provider[STORE,imap,com.sun.mail.imap.IMAPStore,Sun 
> Microsystems, Inc], 
> smtps=javax.mail.Provider[TRANSPORT,smtps,com.sun.mail.smtp.SMTPSSLTransport,Sun 
> Microsystems, Inc], 
> pop3=javax.mail.Provider[STORE,pop3,com.sun.mail.pop3.POP3Store,Sun 
> Microsystems, Inc], 
> pop3s=javax.mail.Provider[STORE,pop3s,com.sun.mail.pop3.POP3SSLStore,Sun 
> Microsystems, Inc], 
> smtp=javax.mail.Provider[TRANSPORT,smtp,com.sun.mail.smtp.SMTPTransport,Sun 
> Microsystems, Inc]}
> DEBUG: successfully loaded resource: /META-INF/javamail.default.address.map
> DEBUG: !anyLoaded
> DEBUG: not loading resource: /META-INF/javamail.address.map
> DEBUG: java.io.FileNotFoundException: 
> D:\dev\apps\jdk\jdk1.5.0_01\jre\lib\javamail.address.map (The system 
> cannot find the file specified)
> DEBUG: setDebug: JavaMail version 1.3.2
> [2005.08.25 19:54:34] Tearing down test - ignore any interrupted exceptions
> 2005-08-25 19:54:34,390 [main] INFO  TaskQueueExecutor:check-out-project 
> - Executor thread got shutdown signal.
> 2005-08-25 19:54:34,390 [Thread-30] INFO  
> TaskQueueExecutor:check-out-project - Executor thread 
> 'check-out-project' exited.
> 2005-08-25 19:54:34,406 [main] INFO  Continuum                      - 
> Stopping Continuum.
> 2005-08-25 19:54:34,406 [main] INFO  Continuum                      - 
> Continuum stopped.
> 2005-08-25 19:54:34,421 [main] INFO  QuartzScheduler                - 
> Scheduler scheduler1_$_NON_CLUSTERED shutting down.
> 2005-08-25 19:54:34,421 [main] INFO  QuartzScheduler                - 
> Scheduler scheduler1_$_NON_CLUSTERED paused.
> 2005-08-25 19:54:34,421 [scheduler1_Worker-4] DEBUG 
> SimpleThreadPool               - WorkerThread is shutting down
> 2005-08-25 19:54:34,421 [scheduler1_Worker-2] DEBUG 
> SimpleThreadPool               - WorkerThread is shutting down
> 2005-08-25 19:54:34,421 [scheduler1_Worker-1] DEBUG 
> SimpleThreadPool               - WorkerThread is shutting down
> 2005-08-25 19:54:34,421 [scheduler1_Worker-0] DEBUG 
> SimpleThreadPool               - WorkerThread is shutting down
> 2005-08-25 19:54:34,421 [scheduler1_Worker-13] DEBUG 
> SimpleThreadPool               - WorkerThread is shutting down
> 2005-08-25 19:54:34,421 [scheduler1_Worker-14] DEBUG 
> SimpleThreadPool               - WorkerThread is shutting down
> 2005-08-25 19:54:34,421 [scheduler1_Worker-12] DEBUG 
> SimpleThreadPool               - WorkerThread is shutting down
> 2005-08-25 19:54:34,421 [scheduler1_Worker-8] DEBUG 
> SimpleThreadPool               - WorkerThread is shutting down
> 2005-08-25 19:54:34,421 [scheduler1_Worker-11] DEBUG 
> SimpleThreadPool               - WorkerThread is shutting down
> 2005-08-25 19:54:34,421 [scheduler1_Worker-10] DEBUG 
> SimpleThreadPool               - WorkerThread is shutting down
> 2005-08-25 19:54:34,421 [scheduler1_Worker-9] DEBUG 
> SimpleThreadPool               - WorkerThread is shutting down
> 2005-08-25 19:54:34,421 [scheduler1_Worker-7] DEBUG 
> SimpleThreadPool               - WorkerThread is shutting down
> 2005-08-25 19:54:34,421 [scheduler1_Worker-6] DEBUG 
> SimpleThreadPool               - WorkerThread is shutting down
> 2005-08-25 19:54:34,453 [scheduler1_Worker-5] DEBUG 
> SimpleThreadPool               - WorkerThread is shutting down
> 2005-08-25 19:54:34,453 [scheduler1_Worker-3] DEBUG 
> SimpleThreadPool               - WorkerThread is shutting down
> 2005-08-25 19:54:34,453 [main] INFO  QuartzScheduler                - 
> Scheduler scheduler1_$_NON_CLUSTERED shutdown complete.
> DEBUG: getProvider() returning 
> javax.mail.Provider[TRANSPORT,smtp,com.sun.mail.smtp.SMTPTransport,Sun 
> Microsystems, Inc]
> 2005-08-25 19:54:34,484 [main] INFO  TaskQueueExecutor:build-project - 
> Executor thread got shutdown signal.
> 2005-08-25 19:54:34,484 [main] INFO  TaskQueueExecutor:build-project - 
> Waiting until task executor 'build-project' is idling...
> DEBUG SMTP: useEhlo true, useAuth false
> DEBUG SMTP: trying to connect to host "localhost", port 25, isSSL false
> 2005-08-25 19:54:35,484 [Thread-29] ERROR 
> ContinuumNotificationDispatcher - Error while trying to use the 
> mailnotifier.
> org.codehaus.plexus.notification.NotificationException: Error while 
> notifiying.
>     at 
> org.apache.maven.continuum.notification.mail.MailContinuumNotifier.sendNotification(MailContinuumNotifier.java:196) 
> 
>     at 
> org.apache.maven.continuum.notification.DefaultContinuumNotificationDispatcher.sendNotification(DefaultContinuumNotificationDispatcher.java:149) 
> 
>     at 
> org.apache.maven.continuum.notification.DefaultContinuumNotificationDispatcher.buildComplete(DefaultContinuumNotificationDispatcher.java:89) 
> 
>     at 
> org.apache.maven.continuum.buildcontroller.DefaultBuildController.build(DefaultBuildController.java:226) 
> 
>     at 
> org.apache.maven.continuum.buildcontroller.BuildProjectTaskExecutor.executeTask(BuildProjectTaskExecutor.java:53) 
> 
>     at 
> org.codehaus.plexus.taskqueue.execution.ThreadedTaskQueueExecutor$ExecutorRunnable.run(ThreadedTaskQueueExecutor.java:103) 
> 
>     at java.lang.Thread.run(Thread.java:595)
> Caused by: org.apache.maven.continuum.ContinuumException: Exception 
> while sending message.
>     at 
> org.apache.maven.continuum.notification.mail.MailContinuumNotifier.sendMessage(MailContinuumNotifier.java:368) 
> 
>     at 
> org.apache.maven.continuum.notification.mail.MailContinuumNotifier.buildComplete(MailContinuumNotifier.java:278) 
> 
>     at 
> org.apache.maven.continuum.notification.mail.MailContinuumNotifier.sendNotification(MailContinuumNotifier.java:191) 
> 
>     ... 6 more
> Caused by: org.codehaus.plexus.mailsender.MailSenderException: Error 
> while sending mail.
>     at 
> org.codehaus.plexus.mailsender.javamail.JavamailMailSender.send(JavamailMailSender.java:204) 
> 
>     at 
> org.apache.maven.continuum.notification.mail.MailContinuumNotifier.sendMessage(MailContinuumNotifier.java:364) 
> 
>     ... 8 more
> Caused by: javax.mail.MessagingException: Could not connect to SMTP 
> host: localhost, port: 25;
>  nested exception is:
>     java.net.ConnectException: Connection refused: connect
>     at com.sun.mail.smtp.SMTPTransport.openServer(SMTPTransport.java:1213)
>     at 
> com.sun.mail.smtp.SMTPTransport.protocolConnect(SMTPTransport.java:311)
>     at javax.mail.Service.connect(Service.java:233)
>     at javax.mail.Service.connect(Service.java:134)
>     at javax.mail.Service.connect(Service.java:86)
>     at com.sun.mail.smtp.SMTPTransport.connect(SMTPTransport.java:144)
>     at javax.mail.Transport.send0(Transport.java:150)
>     at javax.mail.Transport.send(Transport.java:80)
>     at 
> org.codehaus.plexus.mailsender.javamail.JavamailMailSender.send(JavamailMailSender.java:200) 
> 
>     ... 9 more
> 2005-08-25 19:54:35,500 [Thread-29] INFO  
> TaskQueueExecutor:build-project - Executor thread 'build-project' exited.
> [2005.08.25 19:54:35] Used 42187ms
> 
> [ stderr ] ---------------------------------------------------------------
> 
> ------------------------------------------------------------------------------- 
> 
> ------------------------------------------------------------------------------- 
> 
> ------------------------------------------------------------------------------- 
> 
> Error while executing command: cvs -d 
> D:\continuum\continuum-core-it\target\it\cvs-root checkout -d 
> D:\continuum\continuum-core-it\target\it\temp-co maven-1
> workingDirectory: D:\continuum\continuum-core-it
> Exit code: 1
> Standard output:
> ------------------------------------------------------------------------------- 
> 
> 
> ------------------------------------------------------------------------------- 
> 
> Standard Error:
> ------------------------------------------------------------------------------- 
> 
> cvs checkout: existing repository 
> D:\continuum\continuum-core-it\target\it\cvs-root/shell does not match 
> D:\continuum\continuum-core-it\target\it\cvs-root/maven-1
> cvs checkout: ignoring module maven-1
> 
> ------------------------------------------------------------------------------- 
> 
> There was no such logger 
> 'org.codehaus.plexus.action.Action:update-working-directory-from-scm' 
> 19943615.
> There was no such logger 'org.apache.maven.plugin.MavenPluginCollector' 
> 19943615.
> There was no such logger 
> 'org.apache.maven.continuum.project.builder.manager.ContinuumProjectBuilderManager' 
> 19943615.
> There was no such logger 
> 'org.apache.maven.continuum.execution.maven.m2.MavenBuilderHelper' 
> 19943615.
> There was no such logger 
> 'org.codehaus.plexus.notification.notifier.Notifier:irc' 19943615.
> There was no such logger 
> 'org.apache.maven.continuum.execution.ContinuumBuildExecutor:shell' 
> 19943615.
> There was no such logger 
> 'org.apache.maven.continuum.project.builder.ContinuumProjectBuilder:maven-one-builder' 
> 19943615.
> There was no such logger 
> 'org.codehaus.plexus.notification.notifier.manager.NotifierManager' 
> 19943615.
> There was no such logger 
> 'org.codehaus.plexus.velocity.VelocityComponent' 19943615.
> There was no such logger 
> 'org.codehaus.plexus.taskqueue.TaskQueue:check-out-project' 19943615.
> There was no such logger 
> 'org.codehaus.plexus.action.Action:add-project-to-checkout-queue' 19943615.
> There was no such logger 
> 'org.codehaus.plexus.action.Action:checkout-project' 19943615.
> There was no such logger 
> 'org.apache.maven.continuum.buildcontroller.BuildController' 19943615.
> There was no such logger 'org.apache.maven.continuum.scm.ContinuumScm' 
> 19943615.
> There was no such logger 
> 'org.apache.maven.settings.MavenSettingsBuilder' 19943615.
> There was no such logger 
> 'org.apache.maven.continuum.utils.WorkingDirectoryService' 19943615.
> There was no such logger 
> 'org.apache.maven.artifact.resolver.ArtifactResolver' 19943615.
> There was no such logger 
> 'org.apache.maven.continuum.scheduler.ContinuumScheduler' 19943615.
> There was no such logger 'org.codehaus.plexus.action.ActionManager' 
> 19943615.
> There was no such logger 'org.codehaus.plexus.mailsender.MailSender' 
> 19943615.
> There was no such logger 
> 'org.apache.maven.continuum.execution.ContinuumBuildExecutor:maven2' 
> 19943615.
> There was no such logger 
> 'org.apache.maven.project.interpolation.ModelInterpolator' 19943615.
> There was no such logger 
> 'org.apache.maven.continuum.project.builder.ContinuumProjectBuilder:maven-two-builder' 
> 19943615.
> There was no such logger 
> 'org.apache.maven.continuum.execution.manager.BuildExecutorManager' 
> 19943615.
> There was no such logger 
> 'org.codehaus.plexus.notification.notifier.Notifier:console' 19943615.
> There was no such logger 
> 'org.apache.maven.continuum.utils.shell.ShellCommandHelper' 19943615.
> There was no such logger 
> 'org.codehaus.plexus.taskqueue.execution.TaskExecutor:build-project' 
> 19943615.
> There was no such logger 
> 'org.codehaus.plexus.notification.RecipientSource' 19943615.
> There was no such logger 
> 'org.apache.maven.continuum.initialization.ContinuumInitializer' 19943615.
> There was no such logger 
> 'org.apache.maven.continuum.build.settings.SchedulesActivator' 19943615.
> There was no such logger 
> 'org.apache.maven.continuum.execution.ContinuumBuildExecutor:maven-1' 
> 19943615.
> There was no such logger 'org.codehaus.plexus.jdo.JdoFactory' 19943615.
> There was no such logger 
> 'org.codehaus.plexus.action.Action:store-checkout-scm-result' 19943615.
> There was no such logger 
> 'org.codehaus.plexus.notification.notifier.Notifier:jabber' 19943615.
> There was no such logger 
> 'org.codehaus.plexus.action.Action:store-project-group' 19943615.
> There was no such logger 
> 'org.apache.maven.continuum.execution.maven.m1.MavenOneMetadataHelper' 
> 19943615.
> There was no such logger 
> 'org.codehaus.plexus.action.Action:execute-builder' 19943615.
> There was no such logger 
> 'org.apache.maven.artifact.transform.ArtifactTransformation:release' 
> 19943615.
> There was no such logger 'org.codehaus.plexus.jabber.JabberClient' 
> 19943615.
> There was no such logger 
> 'org.codehaus.plexus.taskqueue.TaskViabilityEvaluator:build-project' 
> 19943615.
> There was no such logger 
> 'org.codehaus.plexus.notification.notifier.Notifier:mail' 19943615.
> There was no such logger 
> 'org.apache.maven.continuum.notification.ContinuumNotificationDispatcher' 
> 19943615.
> There was no such logger 'org.apache.maven.project.MavenProjectBuilder' 
> 19943615.
> There was no such logger 'org.codehaus.plexus.msn.MsnClient' 19943615.
> There was no such logger 
> 'org.apache.maven.artifact.transform.ArtifactTransformation:snapshot' 
> 19943615.
> There was no such logger 'org.apache.maven.scm.manager.ScmManager' 
> 19943615.
> There was no such logger 
> 'org.codehaus.plexus.notification.notifier.Notifier:msn' 19943615.
> There was no such logger 
> 'org.apache.maven.artifact.manager.WagonManager' 19943615.
> There was no such logger 
> 'org.codehaus.plexus.taskqueue.execution.TaskQueueExecutor:build-project' 
> 19943615.
> There was no such logger 
> 'org.codehaus.plexus.action.Action:update-project-from-working-directory' 
> 19943615.
> There was no such logger 
> 'org.codehaus.plexus.action.Action:check-working-directory' 19943615.
> There was no such logger 
> 'org.apache.maven.artifact.transform.ArtifactTransformation:latest' 
> 19943615.
> 
> [ stacktrace ] -----------------------------------------------------------
> 
> junit.framework.AssertionFailedError: The command failed.
>     at junit.framework.Assert.fail(Assert.java:47)
>     at 
> org.apache.maven.continuum.it.AbstractIntegrationTest.system(AbstractIntegrationTest.java:318) 
> 
>     at 
> org.apache.maven.continuum.it.AbstractIntegrationTest.system(AbstractIntegrationTest.java:278) 
> 
>     at 
> org.apache.maven.continuum.it.AbstractIntegrationTest.cvsCheckout(AbstractIntegrationTest.java:701) 
> 
>     at 
> org.apache.maven.continuum.it.MavenOneIntegrationTest.testBasic(MavenOneIntegrationTest.java:83) 
> 
>     at sun.reflect.NativeMethodAccessorImpl.invoke0(Native Method)
>     at 
> sun.reflect.NativeMethodAccessorImpl.invoke(NativeMethodAccessorImpl.java:39) 
> 
>     at 
> sun.reflect.DelegatingMethodAccessorImpl.invoke(DelegatingMethodAccessorImpl.java:25) 
> 
>     at java.lang.reflect.Method.invoke(Method.java:585)
>     at junit.framework.TestCase.runTest(TestCase.java:154)
>     at junit.framework.TestCase.runBare(TestCase.java:127)
>     at junit.framework.TestResult$1.protect(TestResult.java:106)
>     at junit.framework.TestResult.runProtected(TestResult.java:124)
>     at junit.framework.TestResult.run(TestResult.java:109)
>     at junit.framework.TestCase.run(TestCase.java:118)
>     at junit.framework.TestSuite.runTest(TestSuite.java:208)
>     at junit.framework.TestSuite.run(TestSuite.java:203)
>     at sun.reflect.NativeMethodAccessorImpl.invoke0(Native Method)
>     at 
> sun.reflect.NativeMethodAccessorImpl.invoke(NativeMethodAccessorImpl.java:39) 
> 
>     at 
> sun.reflect.DelegatingMethodAccessorImpl.invoke(DelegatingMethodAccessorImpl.java:25) 
> 
>     at java.lang.reflect.Method.invoke(Method.java:585)
>     at 
> org.codehaus.surefire.battery.JUnitBattery.executeJUnit(JUnitBattery.java:230) 
> 
>     at 
> org.codehaus.surefire.battery.JUnitBattery.execute(JUnitBattery.java:204)
>     at org.codehaus.surefire.Surefire.executeBattery(Surefire.java:187)
>     at org.codehaus.surefire.Surefire.run(Surefire.java:136)
>     at org.codehaus.surefire.Surefire.run(Surefire.java:60)
>     at sun.reflect.NativeMethodAccessorImpl.invoke0(Native Method)
>     at 
> sun.reflect.NativeMethodAccessorImpl.invoke(NativeMethodAccessorImpl.java:39) 
> 
>     at 
> sun.reflect.DelegatingMethodAccessorImpl.invoke(DelegatingMethodAccessorImpl.java:25) 
> 
>     at java.lang.reflect.Method.invoke(Method.java:585)
>     at org.codehaus.surefire.SurefireBooter.run(SurefireBooter.java:83)
>     at 
> org.apache.maven.test.SurefirePlugin.execute(SurefirePlugin.java:238)
>     at 
> org.apache.maven.plugin.DefaultPluginManager.executeMojo(DefaultPluginManager.java:364) 
> 
>     at 
> org.apache.maven.lifecycle.DefaultLifecycleExecutor.executeGoals(DefaultLifecycleExecutor.java:478) 
> 
>     at 
> org.apache.maven.lifecycle.DefaultLifecycleExecutor.executeGoalWithLifecycle(DefaultLifecycleExecutor.java:451) 
> 
>     at 
> org.apache.maven.lifecycle.DefaultLifecycleExecutor.executeGoal(DefaultLifecycleExecutor.java:437) 
> 
>     at 
> org.apache.maven.lifecycle.DefaultLifecycleExecutor.executeTaskSegments(DefaultLifecycleExecutor.java:273) 
> 
>     at 
> org.apache.maven.lifecycle.DefaultLifecycleExecutor.execute(DefaultLifecycleExecutor.java:131) 
> 
>     at org.apache.maven.DefaultMaven.execute(DefaultMaven.java:186)
>     at org.apache.maven.cli.MavenCli.main(MavenCli.java:316)
>     at sun.reflect.NativeMethodAccessorImpl.invoke0(Native Method)
>     at 
> sun.reflect.NativeMethodAccessorImpl.invoke(NativeMethodAccessorImpl.java:39) 
> 
>     at 
> sun.reflect.DelegatingMethodAccessorImpl.invoke(DelegatingMethodAccessorImpl.java:25) 
> 
>     at java.lang.reflect.Method.invoke(Method.java:585)
>     at org.codehaus.classworlds.Launcher.launchEnhanced(Launcher.java:315)
>     at org.codehaus.classworlds.Launcher.launch(Launcher.java:255)
>     at 
> org.codehaus.classworlds.Launcher.mainWithExitCode(Launcher.java:430)
>     at org.codehaus.classworlds.Launcher.main(Launcher.java:375)
> ------------------------------------------------------------------------------- 
> 
> Battery: org.apache.maven.continuum.it.ShellIntegrationTest
> ------------------------------------------------------------------------------- 
> 
> testBasic(org.apache.maven.continuum.it.ShellIntegrationTest)
> 
> [ stdout ] ---------------------------------------------------------------
> 
> [WARNING] The specified JAR repository doesn't exist or is not a 
> directory: 
> 'D:\continuum\continuum-core-it\target\level1\level2\plexus-home\lib'.
> 2005-08-25 19:55:00,468 [main] DEBUG PlexusContainer                - 
> Found 3 components to load on start
> 2005-08-25 19:55:00,468 [main] INFO  PlexusContainer                - 
> Loading on start [role]: [org.apache.maven.continuum.Continuum]
> 2005-08-25 19:55:00,468 [main] INFO  JdoFactory                     - 
> Initializing JDO.
> 2005-08-25 19:55:00,484 [main] INFO  JDO                            - 
> PersistenceManagerFactory - Vendor: JPOX  Version: 1.1.0-beta-4-SNAPSHOT
> 2005-08-25 19:55:00,484 [main] INFO  JDO                            - 
> PersistenceManagerFactory initialised for datastore 
> URL=jdbc:derby:D:\continuum\continuum-core-it\target\level1\level2\plexus-home/database;create=true 
> driver=org.apache.derby.jdbc.EmbeddedDriver userName=sa
> 2005-08-25 19:55:00,484 [main] INFO  RAMJobStore                    - 
> RAMJobStore initialized.
> 2005-08-25 19:55:00,484 [main] INFO  StdSchedulerFactory            - 
> Quartz scheduler 'scheduler1' initialized from an externally provided 
> properties instance.
> 2005-08-25 19:55:00,484 [main] INFO  StdSchedulerFactory            - 
> Quartz scheduler version: 1.4.5
> 2005-08-25 19:55:00,484 [main] INFO  QuartzScheduler                - 
> Scheduler scheduler1_$_NON_CLUSTERED started.
> 2005-08-25 19:55:00,484 [main] INFO  Continuum                      - 
> Initializing Continuum.
> 2005-08-25 19:55:00,500 [main] INFO  Continuum                      - 
> Showing all projects: 2005-08-25 19:55:00,500 [main] INFO  
> RDBMS                          - RDBMS Adapter initialised : 
> CloudscapeAdapter : Apache Derby version=10.0.2.1, major=10, minor=0, 
> revision=2
> Identifier Names : UPPERCASE Driver name=Apache Derby Embedded JDBC 
> Driver, version=10.0.2.1, major=10, minor=0
> Identifier Max Lengths : Table=128  Column=30  Constraint=18  Index=18  
> Delimeters="
> Identifier Support in DDL : catalog=false  schema=true
> 2005-08-25 19:55:00,500 [main] INFO  SCHEMA                         - 
> Initialising Catalog "", Schema "SA" using "SchemaTable" auto-start option
> 2005-08-25 19:55:00,546 [main] INFO  JDO                            - 
> Managing Persistence of 
> org.apache.maven.continuum.model.project.Schedule since it was managed 
> previously
> 2005-08-25 19:55:00,546 [main] INFO  JDO                            - 
> Managing Persistence of 
> org.apache.maven.continuum.model.system.Installation since it was 
> managed previously
> 2005-08-25 19:55:00,546 [main] INFO  JDO                            - 
> Managing Persistence of 
> org.apache.maven.continuum.model.project.BuildResult since it was 
> managed previously
> 2005-08-25 19:55:00,546 [main] INFO  JDO                            - 
> Managing Persistence of org.apache.maven.continuum.model.scm.ChangeFile 
> since it was managed previously
> 2005-08-25 19:55:00,546 [main] INFO  JDO                            - 
> Managing Persistence of org.apache.maven.continuum.model.scm.ChangeSet 
> since it was managed previously
> 2005-08-25 19:55:00,546 [main] INFO  JDO                            - 
> Managing Persistence of org.apache.maven.continuum.model.scm.ScmResult 
> since it was managed previously
> 2005-08-25 19:55:00,546 [main] INFO  JDO                            - 
> Managing Persistence of 
> org.apache.maven.continuum.model.project.ProjectDependency since it was 
> managed previously
> 2005-08-25 19:55:00,546 [main] INFO  JDO                            - 
> Managing Persistence of org.apache.maven.continuum.model.project.Profile 
> since it was managed previously
> 2005-08-25 19:55:00,546 [main] INFO  JDO                            - 
> Managing Persistence of org.apache.maven.continuum.model.project.Project 
> since it was managed previously
> 2005-08-25 19:55:00,546 [main] INFO  JDO                            - 
> Managing Persistence of 
> org.apache.maven.continuum.model.project.ProjectGroup since it was 
> managed previously
> 2005-08-25 19:55:00,546 [main] INFO  JDO                            - 
> Managing Persistence of 
> org.apache.maven.continuum.model.project.BuildDefinition since it was 
> managed previously
> 2005-08-25 19:55:00,546 [main] INFO  JDO                            - 
> Managing Persistence of 
> org.apache.maven.continuum.model.project.ProjectDeveloper since it was 
> managed previously
> 2005-08-25 19:55:00,546 [main] INFO  JDO                            - 
> Managing Persistence of 
> org.apache.maven.continuum.model.project.ProjectNotifier since it was 
> managed previously
> 2005-08-25 19:55:00,562 [main] INFO  MetaData                       - 
> Parsing MetaData from file 
> "file:/D:/continuum/continuum-model/target/continuum-model-1.0-beta-1-SNAPSHOT.jar!/META-INF/package.jdo" 
> 
> 2005-08-25 19:55:00,734 [main] INFO  SCHEMA                         - 
> Managing Persistence of Class : 
> org.apache.maven.continuum.model.project.Schedule [Table : SCHEDULE, 
> InheritanceStrategy : new-table]
> 2005-08-25 19:55:00,734 [main] INFO  SCHEMA                         - 
> Managing Persistence of Class : 
> org.apache.maven.continuum.model.system.Installation [Table : 
> INSTALLATION, InheritanceStrategy : new-table]
> 2005-08-25 19:55:00,734 [main] INFO  SCHEMA                         - 
> Managing Persistence of Class : 
> org.apache.maven.continuum.model.project.Profile [Table : PROFILE, 
> InheritanceStrategy : new-table]
> 2005-08-25 19:55:00,734 [main] INFO  SCHEMA                         - 
> Managing Persistence of Class : 
> org.apache.maven.continuum.model.project.BuildDefinition [Table : 
> BUILDDEFINITION, InheritanceStrategy : new-table]
> 2005-08-25 19:55:00,734 [main] INFO  SCHEMA                         - 
> Managing Persistence of Class : 
> org.apache.maven.continuum.model.scm.ChangeFile [Table : CHANGEFILE, 
> InheritanceStrategy : new-table]
> 2005-08-25 19:55:00,734 [main] INFO  SCHEMA                         - 
> Managing Persistence of Class : 
> org.apache.maven.continuum.model.scm.ChangeSet [Table : CHANGESET, 
> InheritanceStrategy : new-table]
> 2005-08-25 19:55:00,734 [main] INFO  SCHEMA                         - 
> Managing Persistence of Class : 
> org.apache.maven.continuum.model.scm.ScmResult [Table : SCMRESULT, 
> InheritanceStrategy : new-table]
> 2005-08-25 19:55:00,734 [main] INFO  SCHEMA                         - 
> Managing Persistence of Class : 
> org.apache.maven.continuum.model.project.ProjectDependency [Table : 
> PROJECTDEPENDENCY, InheritanceStrategy : new-table]
> 2005-08-25 19:55:00,734 [main] INFO  SCHEMA                         - 
> Managing Persistence of Class : 
> org.apache.maven.continuum.model.project.ProjectDeveloper [Table : 
> PROJECTDEVELOPER, InheritanceStrategy : new-table]
> 2005-08-25 19:55:00,734 [main] INFO  SCHEMA                         - 
> Managing Persistence of Class : 
> org.apache.maven.continuum.model.project.ProjectNotifier [Table : 
> PROJECTNOTIFIER, InheritanceStrategy : new-table]
> 2005-08-25 19:55:00,734 [main] INFO  SCHEMA                         - 
> Managing Persistence of Class : 
> org.apache.maven.continuum.model.project.ProjectGroup [Table : 
> PROJECTGROUP, InheritanceStrategy : new-table]
> 2005-08-25 19:55:00,734 [main] INFO  SCHEMA                         - 
> Managing Persistence of Class : 
> org.apache.maven.continuum.model.project.Project [Table : PROJECT, 
> InheritanceStrategy : new-table]
> 2005-08-25 19:55:00,734 [main] INFO  SCHEMA                         - 
> Managing Persistence of Class : 
> org.apache.maven.continuum.model.project.BuildResult [Table : 
> BUILDRESULT, InheritanceStrategy : new-table]
> 2005-08-25 19:55:00,734 [main] INFO  SCHEMA                         - 
> Managing Persistence of Field : 
> org.apache.maven.continuum.model.project.ProjectNotifier.configuration 
> [Table : PROJECTNOTIFIER_CONFIGURATION]
> 2005-08-25 19:55:00,734 [main] INFO  SCHEMA                         - 
> Managing Persistence of Field : 
> org.apache.maven.continuum.model.project.ProjectGroup.buildDefinitions 
> [Table : PROJECTGROUP_BUILDDEFINITIONS]
> 2005-08-25 19:55:00,750 [main] INFO  SCHEMA                         - 
> Managing Persistence of Field : 
> org.apache.maven.continuum.model.project.ProjectGroup.notifiers [Table : 
> PROJECTGROUP_NOTIFIERS]
> 2005-08-25 19:55:00,750 [main] INFO  SCHEMA                         - 
> Managing Persistence of Field : 
> org.apache.maven.continuum.model.project.Project.buildDefinitions [Table 
> : PROJECT_BUILDDEFINITIONS]
> 2005-08-25 19:55:00,750 [main] INFO  SCHEMA                         - 
> Managing Persistence of Field : 
> org.apache.maven.continuum.model.project.Project.notifiers [Table : 
> PROJECT_NOTIFIERS]
> 2005-08-25 19:55:00,875 [main] INFO  RDBMS                          - 
> Validated 1 unique key(s) for table CHANGEFILE
> 2005-08-25 19:55:01,453 [main] INFO  RDBMS                          - 
> Validated 1 foreign key(s) for table CHANGEFILE
> 2005-08-25 19:55:12,671 [main] INFO  RDBMS                          - 
> Validated 1 unique key(s) for table BUILDDEFINITION
> 2005-08-25 19:55:12,671 [main] INFO  RDBMS                          - 
> Validated 2 foreign key(s) for table BUILDDEFINITION
> 2005-08-25 19:55:12,671 [main] INFO  RDBMS                          - 
> Validated 1 unique key(s) for table PROJECTNOTIFIER
> 2005-08-25 19:55:12,687 [main] INFO  RDBMS                          - 
> Validated 1 unique key(s) for table CHANGESET
> 2005-08-25 19:55:12,687 [main] INFO  RDBMS                          - 
> Validated 1 foreign key(s) for table CHANGESET
> 2005-08-25 19:55:12,687 [main] INFO  RDBMS                          - 
> Validated 1 unique key(s) for table PROJECTGROUP
> 2005-08-25 19:55:12,703 [main] INFO  RDBMS                          - 
> Validated 1 unique key(s) for table SCMRESULT
> 2005-08-25 19:55:12,703 [main] INFO  RDBMS                          - 
> Validated 1 unique key(s) for table BUILDRESULT
> 2005-08-25 19:55:12,703 [main] INFO  RDBMS                          - 
> Validated 2 foreign key(s) for table BUILDRESULT
> 2005-08-25 19:55:12,718 [main] INFO  RDBMS                          - 
> Validated 1 unique key(s) for table PROJECTDEVELOPER
> 2005-08-25 19:55:12,718 [main] INFO  RDBMS                          - 
> Validated 1 foreign key(s) for table PROJECTDEVELOPER
> 2005-08-25 19:55:12,734 [main] INFO  RDBMS                          - 
> Validated 1 unique key(s) for table SCHEDULE
> 2005-08-25 19:55:12,734 [main] INFO  RDBMS                          - 
> Validated 1 unique key(s) for table INSTALLATION
> 2005-08-25 19:55:12,765 [main] INFO  RDBMS                          - 
> Validated 1 unique key(s) for table PROJECT
> 2005-08-25 19:55:12,765 [main] INFO  RDBMS                          - 
> Validated 2 foreign key(s) for table PROJECT
> 2005-08-25 19:55:12,765 [main] INFO  RDBMS                          - 
> Validated 1 unique key(s) for table PROJECTDEPENDENCY
> 2005-08-25 19:55:12,781 [main] INFO  RDBMS                          - 
> Validated 1 foreign key(s) for table PROJECTDEPENDENCY
> 2005-08-25 19:55:12,781 [main] INFO  RDBMS                          - 
> Validated 1 unique key(s) for table PROFILE
> 2005-08-25 19:55:12,796 [main] INFO  RDBMS                          - 
> Validated 2 foreign key(s) for table PROFILE
> 2005-08-25 19:55:12,796 [main] INFO  RDBMS                          - 
> Validated 1 unique key(s) for table PROJECTNOTIFIER_CONFIGURATION
> 2005-08-25 19:55:12,796 [main] INFO  RDBMS                          - 
> Validated 1 foreign key(s) for table PROJECTNOTIFIER_CONFIGURATION
> 2005-08-25 19:55:12,812 [main] INFO  RDBMS                          - 
> Validated 1 unique key(s) for table PROJECTGROUP_BUILDDEFINITIONS
> 2005-08-25 19:55:12,812 [main] INFO  RDBMS                          - 
> Validated 2 foreign key(s) for table PROJECTGROUP_BUILDDEFINITIONS
> 2005-08-25 19:55:12,812 [main] INFO  RDBMS                          - 
> Validated 1 unique key(s) for table PROJECTGROUP_NOTIFIERS
> 2005-08-25 19:55:12,828 [main] INFO  RDBMS                          - 
> Validated 2 foreign key(s) for table PROJECTGROUP_NOTIFIERS
> 2005-08-25 19:55:12,828 [main] INFO  RDBMS                          - 
> Validated 1 unique key(s) for table PROJECT_NOTIFIERS
> 2005-08-25 19:55:12,828 [main] INFO  RDBMS                          - 
> Validated 2 foreign key(s) for table PROJECT_NOTIFIERS
> 2005-08-25 19:55:12,843 [main] INFO  RDBMS                          - 
> Validated 1 unique key(s) for table PROJECT_BUILDDEFINITIONS
> 2005-08-25 19:55:12,843 [main] INFO  RDBMS                          - 
> Validated 2 foreign key(s) for table PROJECT_BUILDDEFINITIONS
> 2005-08-25 19:55:12,859 [main] INFO  SCHEMA                         - 
> Catalog "", Schema "SA" initialised - managing 18 classes
> 2005-08-25 19:55:12,859 [main] INFO  Continuum                      - 
> Starting Continuum.
> 2005-08-25 19:55:12,859 [main] INFO  Continuum                      - 
> 2005-08-25 19:55:12,859 [main] INFO  Continuum                      - 
> 2005-08-25 19:55:12,859 [main] INFO  Continuum                      - < 
> Continuum 1.0-beta-1-20050825.074627-1 started! >
> 2005-08-25 19:55:12,859 [main] INFO  Continuum                      - 
> ---------------------------------------------------
> 2005-08-25 19:55:12,859 [main] INFO  Continuum                      
> -        \   ^__^
> 2005-08-25 19:55:12,859 [main] INFO  Continuum                      
> -         \  (oo)\_______
> 2005-08-25 19:55:12,859 [main] INFO  Continuum                      
> -            (__)\       )\/\
> 2005-08-25 19:55:12,859 [main] INFO  Continuum                      
> -                ||----w |
> 2005-08-25 19:55:12,859 [main] INFO  Continuum                      
> -                ||     ||
> 2005-08-25 19:55:12,859 [main] INFO  Continuum                      - 
> 2005-08-25 19:55:12,859 [main] INFO  Continuum                      - 
> 2005-08-25 19:55:12,859 [main] INFO  ContinuumInitializer           - 
> Continuum initializer running ...
> 2005-08-25 19:55:12,875 [main] INFO  SchedulesActivator             - 
> Activating build settings ...
> 2005-08-25 19:55:12,890 [main] INFO  SchedulesActivator             - 
> Thu Aug 25 19:56:00 NZST 2005
> 2005-08-25 19:55:12,890 [main] WARN  ContinuumScheduler             - 
> Will not schedule this job as a job {DEFAULT_BUILD_SETTINGS:DEFAULT} 
> already exists.
> 2005-08-25 19:55:12,890 [main] INFO  SchedulesActivator             - null
> 2005-08-25 19:55:12,890 [main] WARN  ContinuumScheduler             - 
> Will not schedule this job as a job {DEFAULT_BUILD_SETTINGS:DEFAULT} 
> already exists.
> 2005-08-25 19:55:12,890 [main] INFO  SchedulesActivator             - null
> 2005-08-25 19:55:12,890 [main] WARN  ContinuumScheduler             - 
> Will not schedule this job as a job {DEFAULT_BUILD_SETTINGS:DEFAULT} 
> already exists.
> 2005-08-25 19:55:12,890 [main] INFO  SchedulesActivator             - null
> 2005-08-25 19:55:12,890 [main] WARN  ContinuumScheduler             - 
> Will not schedule this job as a job {DEFAULT_BUILD_SETTINGS:DEFAULT} 
> already exists.
> 2005-08-25 19:55:12,890 [main] INFO  SchedulesActivator             - null
> 2005-08-25 19:55:12,890 [main] INFO  PlexusContainer                - 
> Loading on start [role,roleHint]: 
> [org.codehaus.plexus.taskqueue.execution.TaskQueueExecutor,build-project]
> 2005-08-25 19:55:13,593 [main] ERROR VelocityComponent              - 
> ResourceManager.getResource() parse exception: 
> org.apache.velocity.exception.ParseErrorException: Lexical error: 
> org.apache.velocity.runtime.parser.TokenMgrError: Lexical error at line 
> 110, column 17.  Encountered: <EOF> after : ""
> 2005-08-25 19:55:13,593 [main] INFO  Notifier:mail                  - 
> The from mailbox is not configured, will use the nag email address from 
> the project.
> 2005-08-25 19:55:13,609 [main] INFO  Notifier:mail                  - 
>  >From name: Continuum@192.168.1.64
> 2005-08-25 19:55:13,609 [main] INFO  Notifier:mail                  - 
> Build host name: 192.168.1.64
> 2005-08-25 19:55:13,609 [main] INFO  RecipientSource                - To 
> override address is not configured, will use the nag email address from 
> the project.
> 2005-08-25 19:55:13,609 [main] INFO  TaskQueueExecutor:build-project - 
> Starting task executor, thread name 'build-project'.
> 2005-08-25 19:55:13,609 [main] INFO  PlexusContainer                - 
> Loading on start [role,roleHint]: 
> [org.codehaus.plexus.taskqueue.execution.TaskQueueExecutor,check-out-project] 
> 
> 2005-08-25 19:55:13,609 [main] INFO  TaskQueueExecutor:check-out-project 
> - Starting task executor, thread name 'check-out-project'.
> [2005.08.25 19:55:13] Integration test settings
> [2005.08.25 19:55:13] IT root: D:\continuum\continuum-core-it\target\it
> [2005.08.25 19:55:13] Remoting method: jvm
> [2005.08.25 19:55:13] Store implementation: class 
> org.apache.maven.continuum.store.JdoContinuumStore
> [2005.08.25 19:55:14] Connecting to and starting Continuum
> [2005.08.25 19:55:14] Removing all existing projects from Continuum.
> [2005.08.25 19:55:14] Initializing Shell CVS project
> [2005.08.25 19:55:14] Adding CVS Shell project
> 2005-08-25 19:55:14,296 [main] WARN  ContinuumBuildExecutor:ant     - 
> Could not find the executable 'ant' in the path '[]'.
> 2005-08-25 19:55:14,296 [main] WARN  ContinuumBuildExecutor:maven-1 - 
> Could not find the executable 'maven' in the path '[]'.
> 2005-08-25 19:55:14,296 [main] DEBUG MavenSettingsBuilder           - 
> Building Maven global-level settings from: 
> 'D:\rnd\apps\m2\conf\settings.xml'
> 2005-08-25 19:55:14,296 [main] DEBUG MavenSettingsBuilder           - 
> Building Maven user-level settings from: 'C:\Documents and 
> Settings\Arnold.NONE-C03D6244FF\.m2\settings.xml'
> 2005-08-25 19:55:14,296 [main] WARN  ContinuumBuildExecutor:maven2  - 
> Could not find the executable 'm2' in the path '[]'.
> 2005-08-25 19:55:14,296 [main] INFO  BuildExecutorManager           - 
> Build executors:
> 2005-08-25 19:55:14,296 [main] INFO  BuildExecutorManager           -   
> maven-1
> 2005-08-25 19:55:14,296 [main] INFO  BuildExecutorManager           -   ant
> 2005-08-25 19:55:14,296 [main] INFO  BuildExecutorManager           -   
> maven2
> 2005-08-25 19:55:14,296 [main] INFO  BuildExecutorManager           -   
> shell
> 2005-08-25 19:55:14,515 [Thread-62] INFO  ContinuumScm                   
> - Checking out project: 'Shell Project', id: '21' to 
> 'D:\continuum\continuum-core-it\target\working-directory\21'.
> 2005-08-25 19:55:15,609 [Thread-62] INFO  ContinuumScm                   
> - Checked out 1 files.
> [2005.08.25 19:55:15] Building Shell project
> 2005-08-25 19:55:15,734 [main] INFO  Continuum                      - 
> Enqueuing 'Shell Project'.
> 2005-08-25 19:55:15,875 [Thread-61] INFO  ContinuumScm                   
> - Updating project: id: '21', name 'Shell Project'.
> 2005-08-25 19:55:16,062 [Thread-61] INFO  
> Action:update-project-from-working-directory - Updating project 'Shell 
> Project' from checkout.
> 2005-08-25 19:55:16,203 [Thread-61] WARN  ContinuumBuildExecutor:shell   
> - Executable 
> 'D:\continuum\continuum-core-it\target\working-directory\21\script.bat'.
> 2005-08-25 19:55:16,203 [Thread-61] INFO  ContinuumBuildExecutor:shell   
> - Arguments: 2005-08-25 19:55:16,203 [Thread-61] INFO  
> ContinuumBuildExecutor:shell   - Working directory: 
> D:\continuum\continuum-core-it\target\working-directory\21
> 2005-08-25 19:55:16,359 [Thread-61] INFO  ContinuumBuildExecutor:shell   
> - Exit code: 0
> [2005.08.25 19:55:16] Building Shell project with alternative configuration
> [2005.08.25 19:55:16] Tearing down test - ignore any interrupted exceptions
> 2005-08-25 19:55:16,531 [main] INFO  TaskQueueExecutor:check-out-project 
> - Executor thread got shutdown signal.
> 2005-08-25 19:55:16,531 [main] INFO  TaskQueueExecutor:check-out-project 
> - Waiting until task executor 'check-out-project' is idling...
> 2005-08-25 19:55:16,531 [Thread-62] INFO  
> TaskQueueExecutor:check-out-project - Executor thread 
> 'check-out-project' exited.
> 2005-08-25 19:55:16,531 [main] INFO  Continuum                      - 
> Stopping Continuum.
> 2005-08-25 19:55:16,531 [main] INFO  Continuum                      - 
> Continuum stopped.
> 2005-08-25 19:55:16,531 [main] INFO  QuartzScheduler                - 
> Scheduler scheduler1_$_NON_CLUSTERED shutting down.
> 2005-08-25 19:55:16,531 [main] INFO  QuartzScheduler                - 
> Scheduler scheduler1_$_NON_CLUSTERED paused.
> 2005-08-25 19:55:16,531 [scheduler1_Worker-1] DEBUG 
> SimpleThreadPool               - WorkerThread is shutting down
> 2005-08-25 19:55:16,531 [scheduler1_Worker-14] DEBUG 
> SimpleThreadPool               - WorkerThread is shutting down
> 2005-08-25 19:55:16,531 [scheduler1_Worker-13] DEBUG 
> SimpleThreadPool               - WorkerThread is shutting down
> 2005-08-25 19:55:16,531 [scheduler1_Worker-12] DEBUG 
> SimpleThreadPool               - WorkerThread is shutting down
> 2005-08-25 19:55:16,531 [scheduler1_Worker-11] DEBUG 
> SimpleThreadPool               - WorkerThread is shutting down
> 2005-08-25 19:55:16,531 [scheduler1_Worker-10] DEBUG 
> SimpleThreadPool               - WorkerThread is shutting down
> 2005-08-25 19:55:16,531 [scheduler1_Worker-9] DEBUG 
> SimpleThreadPool               - WorkerThread is shutting down
> 2005-08-25 19:55:16,531 [scheduler1_Worker-8] DEBUG 
> SimpleThreadPool               - WorkerThread is shutting down
> 2005-08-25 19:55:16,531 [scheduler1_Worker-7] DEBUG 
> SimpleThreadPool               - WorkerThread is shutting down
> 2005-08-25 19:55:16,531 [scheduler1_Worker-6] DEBUG 
> SimpleThreadPool               - WorkerThread is shutting down
> 2005-08-25 19:55:16,531 [scheduler1_Worker-5] DEBUG 
> SimpleThreadPool               - WorkerThread is shutting down
> 2005-08-25 19:55:16,531 [scheduler1_Worker-4] DEBUG 
> SimpleThreadPool               - WorkerThread is shutting down
> 2005-08-25 19:55:16,531 [scheduler1_Worker-3] DEBUG 
> SimpleThreadPool               - WorkerThread is shutting down
> 2005-08-25 19:55:16,531 [scheduler1_Worker-2] DEBUG 
> SimpleThreadPool               - WorkerThread is shutting down
> 2005-08-25 19:55:16,531 [scheduler1_Worker-0] DEBUG 
> SimpleThreadPool               - WorkerThread is shutting down
> 2005-08-25 19:55:16,531 [main] INFO  QuartzScheduler                - 
> Scheduler scheduler1_$_NON_CLUSTERED shutdown complete.
> 2005-08-25 19:55:16,546 [main] INFO  TaskQueueExecutor:build-project - 
> Executor thread got shutdown signal.
> 2005-08-25 19:55:16,546 [Thread-61] INFO  
> TaskQueueExecutor:build-project - Executor thread 'build-project' exited.
> [2005.08.25 19:55:16] Used 16781ms
> 
> [ stderr ] ---------------------------------------------------------------
> 
> ------------------------------------------------------------------------------- 
> 
> ------------------------------------------------------------------------------- 
> 
> ------------------------------------------------------------------------------- 
> 
> There was no such logger 
> 'org.codehaus.plexus.action.Action:update-working-directory-from-scm' 
> 24041479.
> There was no such logger 'org.apache.maven.plugin.MavenPluginCollector' 
> 24041479.
> There was no such logger 
> 'org.apache.maven.continuum.execution.maven.m2.MavenBuilderHelper' 
> 24041479.
> There was no such logger 
> 'org.codehaus.plexus.notification.notifier.Notifier:irc' 24041479.
> There was no such logger 
> 'org.apache.maven.continuum.execution.ContinuumBuildExecutor:shell' 
> 24041479.
> There was no such logger 
> 'org.codehaus.plexus.notification.notifier.manager.NotifierManager' 
> 24041479.
> There was no such logger 
> 'org.codehaus.plexus.velocity.VelocityComponent' 24041479.
> There was no such logger 
> 'org.codehaus.plexus.taskqueue.TaskQueue:check-out-project' 24041479.
> There was no such logger 
> 'org.codehaus.plexus.action.Action:add-project-to-checkout-queue' 24041479.
> There was no such logger 
> 'org.codehaus.plexus.action.Action:checkout-project' 24041479.
> There was no such logger 
> 'org.apache.maven.continuum.buildcontroller.BuildController' 24041479.
> There was no such logger 'org.apache.maven.continuum.scm.ContinuumScm' 
> 24041479.
> There was no such logger 
> 'org.apache.maven.settings.MavenSettingsBuilder' 24041479.
> There was no such logger 
> 'org.apache.maven.continuum.utils.WorkingDirectoryService' 24041479.
> There was no such logger 
> 'org.apache.maven.artifact.resolver.ArtifactResolver' 24041479.
> There was no such logger 
> 'org.apache.maven.continuum.scheduler.ContinuumScheduler' 24041479.
> There was no such logger 'org.codehaus.plexus.action.ActionManager' 
> 24041479.
> There was no such logger 'org.codehaus.plexus.mailsender.MailSender' 
> 24041479.
> There was no such logger 
> 'org.apache.maven.continuum.execution.ContinuumBuildExecutor:maven2' 
> 24041479.
> There was no such logger 
> 'org.apache.maven.project.interpolation.ModelInterpolator' 24041479.
> There was no such logger 
> 'org.codehaus.plexus.notification.notifier.Notifier:console' 24041479.
> There was no such logger 
> 'org.apache.maven.continuum.execution.manager.BuildExecutorManager' 
> 24041479.
> There was no such logger 
> 'org.apache.maven.continuum.utils.shell.ShellCommandHelper' 24041479.
> There was no such logger 
> 'org.codehaus.plexus.taskqueue.execution.TaskExecutor:build-project' 
> 24041479.
> There was no such logger 
> 'org.codehaus.plexus.notification.RecipientSource' 24041479.
> There was no such logger 
> 'org.apache.maven.continuum.initialization.ContinuumInitializer' 24041479.
> There was no such logger 
> 'org.apache.maven.continuum.build.settings.SchedulesActivator' 24041479.
> There was no such logger 
> 'org.apache.maven.continuum.execution.ContinuumBuildExecutor:maven-1' 
> 24041479.
> There was no such logger 'org.codehaus.plexus.jdo.JdoFactory' 24041479.
> There was no such logger 
> 'org.codehaus.plexus.action.Action:store-checkout-scm-result' 24041479.
> There was no such logger 
> 'org.codehaus.plexus.notification.notifier.Notifier:jabber' 24041479.
> There was no such logger 
> 'org.apache.maven.continuum.execution.maven.m1.MavenOneMetadataHelper' 
> 24041479.
> There was no such logger 
> 'org.codehaus.plexus.action.Action:execute-builder' 24041479.
> There was no such logger 
> 'org.apache.maven.artifact.transform.ArtifactTransformation:release' 
> 24041479.
> There was no such logger 'org.codehaus.plexus.jabber.JabberClient' 
> 24041479.
> There was no such logger 
> 'org.codehaus.plexus.action.Action:store-project' 24041479.
> There was no such logger 
> 'org.codehaus.plexus.taskqueue.TaskViabilityEvaluator:build-project' 
> 24041479.
> There was no such logger 
> 'org.codehaus.plexus.notification.notifier.Notifier:mail' 24041479.
> There was no such logger 
> 'org.apache.maven.continuum.notification.ContinuumNotificationDispatcher' 
> 24041479.
> There was no such logger 'org.apache.maven.project.MavenProjectBuilder' 
> 24041479.
> There was no such logger 'org.codehaus.plexus.msn.MsnClient' 24041479.
> There was no such logger 
> 'org.apache.maven.artifact.transform.ArtifactTransformation:snapshot' 
> 24041479.
> There was no such logger 
> 'org.codehaus.plexus.action.Action:validate-project' 24041479.
> There was no such logger 'org.apache.maven.scm.manager.ScmManager' 
> 24041479.
> There was no such logger 
> 'org.codehaus.plexus.notification.notifier.Notifier:msn' 24041479.
> There was no such logger 
> 'org.apache.maven.artifact.manager.WagonManager' 24041479.
> There was no such logger 
> 'org.codehaus.plexus.taskqueue.execution.TaskQueueExecutor:build-project' 
> 24041479.
> There was no such logger 
> 'org.codehaus.plexus.action.Action:update-project-from-working-directory' 
> 24041479.
> There was no such logger 
> 'org.codehaus.plexus.action.Action:check-working-directory' 24041479.
> There was no such logger 
> 'org.apache.maven.artifact.transform.ArtifactTransformation:latest' 
> 24041479.
> 
> [ stacktrace ] -----------------------------------------------------------
> 
> java.io.FileNotFoundException: 
> D:\continuum\continuum-core-it\target\it\temp-co\script.bat (The system 
> cannot find the path specified)
>     at java.io.FileInputStream.open(Native Method)
>     at java.io.FileInputStream.<init>(FileInputStream.java:106)
>     at org.codehaus.plexus.util.FileUtils.fileRead(FileUtils.java:258)
>     at 
> org.apache.maven.continuum.it.ShellIntegrationTest.addExtraPartInScript(ShellIntegrationTest.java:152) 
> 
>     at 
> org.apache.maven.continuum.it.ShellIntegrationTest.testBasic(ShellIntegrationTest.java:84) 
> 
>     at sun.reflect.NativeMethodAccessorImpl.invoke0(Native Method)
>     at 
> sun.reflect.NativeMethodAccessorImpl.invoke(NativeMethodAccessorImpl.java:39) 
> 
>     at 
> sun.reflect.DelegatingMethodAccessorImpl.invoke(DelegatingMethodAccessorImpl.java:25) 
> 
>     at java.lang.reflect.Method.invoke(Method.java:585)
>     at junit.framework.TestCase.runTest(TestCase.java:154)
>     at junit.framework.TestCase.runBare(TestCase.java:127)
>     at junit.framework.TestResult$1.protect(TestResult.java:106)
>     at junit.framework.TestResult.runProtected(TestResult.java:124)
>     at junit.framework.TestResult.run(TestResult.java:109)
>     at junit.framework.TestCase.run(TestCase.java:118)
>     at junit.framework.TestSuite.runTest(TestSuite.java:208)
>     at junit.framework.TestSuite.run(TestSuite.java:203)
>     at sun.reflect.NativeMethodAccessorImpl.invoke0(Native Method)
>     at 
> sun.reflect.NativeMethodAccessorImpl.invoke(NativeMethodAccessorImpl.java:39) 
> 
>     at 
> sun.reflect.DelegatingMethodAccessorImpl.invoke(DelegatingMethodAccessorImpl.java:25) 
> 
>     at java.lang.reflect.Method.invoke(Method.java:585)
>     at 
> org.codehaus.surefire.battery.JUnitBattery.executeJUnit(JUnitBattery.java:230) 
> 
>     at 
> org.codehaus.surefire.battery.JUnitBattery.execute(JUnitBattery.java:204)
>     at org.codehaus.surefire.Surefire.executeBattery(Surefire.java:187)
>     at org.codehaus.surefire.Surefire.run(Surefire.java:136)
>     at org.codehaus.surefire.Surefire.run(Surefire.java:60)
>     at sun.reflect.NativeMethodAccessorImpl.invoke0(Native Method)
>     at 
> sun.reflect.NativeMethodAccessorImpl.invoke(NativeMethodAccessorImpl.java:39) 
> 
>     at 
> sun.reflect.DelegatingMethodAccessorImpl.invoke(DelegatingMethodAccessorImpl.java:25) 
> 
>     at java.lang.reflect.Method.invoke(Method.java:585)
>     at org.codehaus.surefire.SurefireBooter.run(SurefireBooter.java:83)
>     at 
> org.apache.maven.test.SurefirePlugin.execute(SurefirePlugin.java:238)
>     at 
> org.apache.maven.plugin.DefaultPluginManager.executeMojo(DefaultPluginManager.java:364) 
> 
>     at 
> org.apache.maven.lifecycle.DefaultLifecycleExecutor.executeGoals(DefaultLifecycleExecutor.java:478) 
> 
>     at 
> org.apache.maven.lifecycle.DefaultLifecycleExecutor.executeGoalWithLifecycle(DefaultLifecycleExecutor.java:451) 
> 
>     at 
> org.apache.maven.lifecycle.DefaultLifecycleExecutor.executeGoal(DefaultLifecycleExecutor.java:437) 
> 
>     at 
> org.apache.maven.lifecycle.DefaultLifecycleExecutor.executeTaskSegments(DefaultLifecycleExecutor.java:273) 
> 
>     at 
> org.apache.maven.lifecycle.DefaultLifecycleExecutor.execute(DefaultLifecycleExecutor.java:131) 
> 
>     at org.apache.maven.DefaultMaven.execute(DefaultMaven.java:186)
>     at org.apache.maven.cli.MavenCli.main(MavenCli.java:316)
>     at sun.reflect.NativeMethodAccessorImpl.invoke0(Native Method)
>     at 
> sun.reflect.NativeMethodAccessorImpl.invoke(NativeMethodAccessorImpl.java:39) 
> 
>     at 
> sun.reflect.DelegatingMethodAccessorImpl.invoke(DelegatingMethodAccessorImpl.java:25) 
> 
>     at java.lang.reflect.Method.invoke(Method.java:585)
>     at org.codehaus.classworlds.Launcher.launchEnhanced(Launcher.java:315)
>     at org.codehaus.classworlds.Launcher.launch(Launcher.java:255)
>     at 
> org.codehaus.classworlds.Launcher.mainWithExitCode(Launcher.java:430)
>     at org.codehaus.classworlds.Launcher.main(Launcher.java:375)


Mime
View raw message