continuum-dev mailing list archives

Site index · List index
Message view « Date » · « Thread »
Top « Date » · « Thread »
From "Continuum@maven.zones.apache.org" <contin...@maven.zones.apache.org>
Subject [continuum] BUILD FAILURE: Continuum Plexus Application
Date Fri, 10 Jun 2005 02:29:34 GMT
****************************************************************************
Build statistics:
  State: Failed
  Previous build: No previous build.
  Started at: Fri, 10 Jun 2005 02:29:31 +0000
  Finished at: Fri, 10 Jun 2005 02:29:34 +0000
  Total time: 2s
  Building machine hostname: maven.zones.apache.org
****************************************************************************

****************************************************************************
Standard output:
****************************************************************************
[INFO] ----------------------------------------------------------------------------
[INFO] Building Continuum Plexus Application
[INFO] ----------------------------------------------------------------------------
[INFO] maven-compiler-plugin: resolved to version 2.0-alpha-3-SNAPSHOT from local repository
[INFO] maven-compiler-plugin: using locally installed snapshot
[INFO] plexus-compiler-javac: resolved to version 1.4-20050608.082112-2 from local repository
[INFO] plexus-compilers: resolved to version 1.4-20050608.082112-1 from local repository
[INFO] plexus-compiler: resolved to version 1.4-20050608.082112-1 from local repository
[INFO] maven-deploy-plugin: resolved to version 2.0-alpha-3-SNAPSHOT from local repository
[INFO] maven-deploy-plugin: using locally installed snapshot
[INFO] maven-install-plugin: resolved to version 2.0-alpha-3-SNAPSHOT from local repository
[INFO] maven-install-plugin: using locally installed snapshot
[INFO] maven-plexus-plugin: resolved to version 1.1-alpha-3-20050607.182512-3 from local repository
[INFO] plexus-cdc: resolved to version 1.0-alpha-2-20050606.110048-4 from local repository
[INFO] plexus-runtime-builder: resolved to version 1.0-alpha-3-20050607.203446-7 from local
repository
[INFO] maven-resources-plugin: resolved to version 2.0-alpha-3-SNAPSHOT from local repository
[INFO] maven-resources-plugin: using locally installed snapshot
[INFO] maven-surefire-plugin: resolved to version 2.0-alpha-3-SNAPSHOT from local repository
[INFO] maven-surefire-plugin: using locally installed snapshot
[INFO] maven-clean-plugin: resolved to version 2.0-alpha-3-SNAPSHOT from local repository
[INFO] maven-clean-plugin: using locally installed snapshot
[INFO] [clean:clean]
[INFO] Deleting directory /export/home/continuum/continuum-1.0-alpha-2/apps/continuum/temp/5/target
[INFO] [resources:resources]
[INFO] continuum-web: using locally installed snapshot
[INFO] continuum-xmlrpc: using locally installed snapshot
[INFO] plexus-container-default: resolved to version 1.0-alpha-4-20050607.002806-7 from local
repository
[INFO] plexus-formica: resolved to version 1.0-beta-4-20050527.015415-1 from local repository
[INFO] continuum-model: using locally installed snapshot
[INFO] plexus-summit: resolved to version 1.0-beta-5-20050606.090841-1 from local repository
[INFO] continuum-core: using locally installed snapshot
[INFO] plexus-workflow: resolved to version 1.0-alpha-1-20050603.142444-2 from local repository
[INFO] maven-model: using locally installed snapshot
[INFO] maven: using locally installed snapshot
[INFO] maven-settings: using locally installed snapshot
[INFO] continuum-api: using locally installed snapshot
[INFO] maven-core: using locally installed snapshot
[INFO] maven-project: using locally installed snapshot
[INFO] werkflow: resolved to version 2.0-alpha-2-20050602.193612-1 from local repository
[INFO] maven-profile: using locally installed snapshot
[INFO] maven-plugin-descriptor: using locally installed snapshot
[INFO] maven-plugin-api: using locally installed snapshot
[INFO] maven-monitor: using locally installed snapshot
[INFO] [compiler:compile]
[INFO] No sources to compile
[INFO] [resources:testResources]
[INFO] [compiler:testCompile]
[INFO] No sources to compile
[INFO] [surefire:test]
[INFO] Setting reports dir: /export/home/continuum/continuum-1.0-alpha-2/apps/continuum/temp/5/target/surefire-reports

-------------------------------------------------------
 T E S T S
-------------------------------------------------------
There are no test to run.

Results :
[surefire] Tests run: 0, Failures: 0, Errors: 0

[INFO] [plexus:app]
[INFO] Adding org.apache.maven:maven-profile:jar:2.0-SNAPSHOT to lib
[INFO] Adding commons-dbcp:commons-dbcp:jar:1.0 to lib
[INFO] Adding plexus:plexus-summit:jar:1.0-beta-5-SNAPSHOT to lib
[INFO] Adding org.apache.maven:maven-plugin-descriptor:jar:2.0-SNAPSHOT to lib
[INFO] Adding plexus:plexus-workflow:jar:1.0-alpha-1-SNAPSHOT to lib
[INFO] Adding logkit:logkit:jar:1.0.1 to lib
[INFO] Adding org.apache.maven.scm:maven-scm-provider-cvs:jar:1.0-alpha-1 to lib
[INFO] Adding plexus:plexus-action:jar:1.0-alpha-2 to lib
[INFO] Adding jdo:jdo:jar:1.0.1 to lib
[INFO] Adding org.apache.maven.wagon:wagon-ssh:jar:1.0-alpha-3 to lib
[INFO] Adding plexus:plexus-notification:jar:1.0-alpha-3 to lib
[INFO] Adding xml-apis:xml-apis:jar:2.0.2 to lib
[INFO] Adding hsqldb:hsqldb:jar:1.7.3.0 to lib
[INFO] Adding commons-collections:commons-collections:jar:2.0 to lib
[INFO] Adding plexus:plexus-log4j-logging:jar:1.0 to lib
[INFO] Adding regexp:regexp:jar:1.3 to lib
[INFO] Adding commons-pool:commons-pool:jar:1.0.1 to lib
[INFO] Adding jpox:jpox:jar:1.0.4 to lib
[INFO] Adding commons-cli:commons-cli:jar:1.0-beta-2 to lib
[INFO] Adding org.apache.maven.scm:maven-scm-api:jar:1.0-alpha-1 to lib
[INFO] Adding plexus:plexus-servlet:jar:1.0-beta-2 to lib
[INFO] Adding plexus:plexus-mail-sender-api:jar:1.0-alpha-1 to lib
[INFO] Adding org.apache.maven.scm:maven-scm-provider-svn:jar:1.0-alpha-1 to lib
[INFO] Adding velocity:velocity:jar:1.4 to lib
[INFO] Adding org.apache.maven.continuum:continuum-web:jar:1.0-alpha-3-SNAPSHOT to lib
[INFO] Adding jsch:jsch:jar:0.1.17 to lib
[INFO] Adding jdbc:jdbc-stdext:jar:2.0 to lib
[INFO] Adding jaas:jaas:jar:1.0.1 to lib
[INFO] Adding bcel:bcel:jar:5.1 to lib
[INFO] Adding oro:oro:jar:2.0.6 to lib
[INFO] Adding jca:jca:jar:1.0.0 to lib
[INFO] Adding commons-lang:commons-lang:jar:1.0-b1 to lib
[INFO] Adding ojdbc:ojdbc:jar:14 to lib
[INFO] Adding jta:jta:jar:1.0.1b to lib
[INFO] Adding jdbc:jdbc:jar:2.0 to lib
[INFO] Adding log4j:log4j:jar:1.2.8 to lib
[INFO] Adding plexus:plexus-formica:jar:1.0-beta-4-SNAPSHOT to lib
[INFO] Adding org.apache.maven.continuum:continuum-model:jar:1.0-alpha-3-SNAPSHOT to lib
[INFO] Adding plexus:plexus-i18n:jar:1.0-beta-4 to lib
[INFO] Adding org.apache.maven:maven-plugin-api:jar:2.0-SNAPSHOT to lib
[INFO] Adding org.apache.maven:maven-settings:jar:2.0-SNAPSHOT to lib
[INFO] Adding org.apache.maven.continuum:continuum-api:jar:1.0-alpha-3-SNAPSHOT to lib
[INFO] Adding plexus:plexus-mail-sender-simple:jar:1.0-alpha-1 to lib
[INFO] Adding commons-fileupload:commons-fileupload:jar:1.0 to lib
[INFO] Adding commons-logging:commons-logging:jar:1.0.2 to lib
[INFO] Adding org.apache.maven:maven-core:jar:2.0-SNAPSHOT to lib
[INFO] Adding plexus:plexus-velocity:jar:1.0 to lib
[INFO] Adding org.apache.maven.continuum:continuum-core:jar:1.0-alpha-3-SNAPSHOT to lib
[INFO] Adding org.apache.maven.wagon:wagon-provider-api:jar:1.0-alpha-3 to lib
[INFO] Adding org.apache.maven:maven-model:jar:2.0-SNAPSHOT to lib
[INFO] Adding jpox:jpox-enhancer:jar:1.0.4 to lib
[INFO] Adding org.apache.maven:maven-monitor:jar:2.0-SNAPSHOT to lib
[INFO] Adding ognl:ognl:jar:2.5.1 to lib
[INFO] Adding org.apache.maven.wagon:wagon-http-lightweight:jar:1.0-alpha-3 to lib
[INFO] Adding ant:ant:jar:1.6 to lib
[INFO] Adding org.apache.maven.continuum:continuum-xmlrpc:jar:1.0-alpha-3-SNAPSHOT to lib
[INFO] Adding plexus:plexus-formica-web:jar:1.0-alpha-1 to lib
[INFO] Adding org.apache.maven:maven-project:jar:2.0-SNAPSHOT to lib
[INFO] Adding werkflow:werkflow:jar:2.0-alpha-2-SNAPSHOT to lib
[INFO] Adding org.apache.maven:maven-artifact:jar:2.0-alpha-2 to lib
[INFO] Adding plexus:plexus-taskqueue:jar:1.0-alpha-1 to lib
[INFO] Adding plexus:plexus-jdo:jar:1.0-alpha-2 to lib
[INFO] [install:install]
[INFO] Installing /export/home/continuum/continuum-1.0-alpha-2/apps/continuum/temp/5/target/continuum-plexus-application-1.0-alpha-3-SNAPSHOT.jar
to /export/home/continuum/.m2/repository/org/apache/maven/continuum/continuum-plexus-application/1.0-alpha-3-SNAPSHOT/continuum-plexus-application-1.0-alpha-3-SNAPSHOT.jar
[INFO] ----------------------------------------------------------------------------
[ERROR] BUILD ERROR
[INFO] ----------------------------------------------------------------------------
[INFO] Diagnosis: Error installing artifact
[INFO] ----------------------------------------------------------------------------
[ERROR] Cause: 
org.apache.maven.plugin.MojoExecutionException: Error installing artifact
	at org.apache.maven.plugin.install.InstallMojo.execute(InstallMojo.java:126)
	at org.apache.maven.plugin.DefaultPluginManager.executeMojo(DefaultPluginManager.java:427)
	at org.apache.maven.lifecycle.DefaultLifecycleExecutor.processGoals(DefaultLifecycleExecutor.java:168)
	at org.apache.maven.lifecycle.DefaultLifecycleExecutor.execute(DefaultLifecycleExecutor.java:90)
	at org.apache.maven.DefaultMaven.processProject(DefaultMaven.java:255)
	at org.apache.maven.DefaultMaven.execute(DefaultMaven.java:174)
	at org.apache.maven.cli.MavenCli.main(MavenCli.java:252)
	at sun.reflect.NativeMethodAccessorImpl.invoke0(Native Method)
	at sun.reflect.NativeMethodAccessorImpl.invoke(NativeMethodAccessorImpl.java:39)
	at sun.reflect.DelegatingMethodAccessorImpl.invoke(DelegatingMethodAccessorImpl.java:25)
	at java.lang.reflect.Method.invoke(Method.java:585)
	at org.codehaus.classworlds.Launcher.launchEnhanced(Launcher.java:303)
	at org.codehaus.classworlds.Launcher.launch(Launcher.java:243)
	at org.codehaus.classworlds.Launcher.mainWithExitCode(Launcher.java:416)
	at org.codehaus.classworlds.Launcher.main(Launcher.java:363)
Caused by: org.apache.maven.artifact.installer.ArtifactInstallationException: Error installing
artifact: 
	at org.apache.maven.artifact.installer.DefaultArtifactInstaller.install(DefaultArtifactInstaller.java:95)
	at org.apache.maven.artifact.installer.DefaultArtifactInstaller.install(DefaultArtifactInstaller.java:58)
	at org.apache.maven.plugin.install.InstallMojo.execute(InstallMojo.java:120)
	... 14 more
Caused by: java.io.IOException: File /export/home/continuum/continuum-1.0-alpha-2/apps/continuum/temp/5/target/continuum-plexus-application-1.0-alpha-3-SNAPSHOT.jar
does not exist
	at org.codehaus.plexus.util.FileUtils.copyFile(FileUtils.java:753)
	at org.apache.maven.artifact.installer.DefaultArtifactInstaller.install(DefaultArtifactInstaller.java:84)
	... 16 more
[INFO] ----------------------------------------------------------------------------
[INFO] Total time: 1 second
[INFO] Finished at: Fri Jun 10 02:29:33 GMT+00:00 2005
[INFO] Final Memory: 6M/309M
[INFO] ----------------------------------------------------------------------------

****************************************************************************

There was no content on standard error.


Mime
View raw message