continuum-dev mailing list archives

Site index · List index
Message view « Date » · « Thread »
Top « Date » · « Thread »
From "Continuum@maven.zones.apache.org" <contin...@maven.zones.apache.org>
Subject [continuum] BUILD SUCCESSFUL: Continuum Model
Date Fri, 10 Jun 2005 02:29:29 GMT
****************************************************************************
Build statistics:
  State: Ok
  Previous build: No previous build.
  Started at: Fri, 10 Jun 2005 02:29:24 +0000
  Finished at: Fri, 10 Jun 2005 02:29:29 +0000
  Total time: 5s
  Building machine hostname: maven.zones.apache.org
****************************************************************************

****************************************************************************
Standard output:
****************************************************************************
[INFO] ----------------------------------------------------------------------------
[INFO] Building Continuum Model
[INFO] ----------------------------------------------------------------------------
[INFO] maven-compiler-plugin: resolved to version 2.0-alpha-3-SNAPSHOT from local repository
[INFO] maven-compiler-plugin: using locally installed snapshot
[INFO] plexus-compiler-javac: resolved to version 1.4-20050608.082112-2 from local repository
[INFO] plexus-compilers: resolved to version 1.4-20050608.082112-1 from local repository
[INFO] plexus-compiler: resolved to version 1.4-20050608.082112-1 from local repository
[INFO] maven-deploy-plugin: resolved to version 2.0-alpha-3-SNAPSHOT from local repository
[INFO] maven-deploy-plugin: using locally installed snapshot
[INFO] maven-install-plugin: resolved to version 2.0-alpha-3-SNAPSHOT from local repository
[INFO] maven-install-plugin: using locally installed snapshot
[INFO] maven-jar-plugin: resolved to version 2.0-alpha-3-SNAPSHOT from local repository
[INFO] maven-jar-plugin: using locally installed snapshot
[INFO] maven-archiver: using locally installed snapshot
[INFO] maven: using locally installed snapshot
[INFO] maven-resources-plugin: resolved to version 2.0-alpha-3-SNAPSHOT from local repository
[INFO] maven-resources-plugin: using locally installed snapshot
[INFO] maven-surefire-plugin: resolved to version 2.0-alpha-3-SNAPSHOT from local repository
[INFO] maven-surefire-plugin: using locally installed snapshot
[INFO] maven-jpox-plugin: resolved to version 1.0-20050507.150141-7 from local repository
[INFO] mojo: resolved to version 1.0-20050429.134955-2 from local repository
[INFO] maven-clean-plugin: resolved to version 2.0-alpha-3-SNAPSHOT from local repository
[INFO] maven-clean-plugin: using locally installed snapshot
[INFO] [clean:clean]
[INFO] Deleting directory /export/home/continuum/continuum-1.0-alpha-2/apps/continuum/temp/4/target
[INFO] Setting property: classpath.resource.loader.class => 'org.codehaus.plexus.velocity.ContextClassLoaderResourceLoader'.
[INFO] Setting property: resource.loader => 'classpath'.
[INFO] ************************************************************** 
[INFO] Starting Jakarta Velocity v1.4
[INFO] RuntimeInstance initializing.
[INFO] Default Properties File: org/apache/velocity/runtime/defaults/velocity.properties
[INFO] Default ResourceManager initializing. (class org.apache.velocity.runtime.resource.ResourceManagerImpl)
[INFO] Resource Loader Instantiated: org.codehaus.plexus.velocity.ContextClassLoaderResourceLoader
[INFO] ClasspathResourceLoader : initialization starting.
[INFO] ClasspathResourceLoader : initialization complete.
[INFO] ResourceCache : initialized. (class org.apache.velocity.runtime.resource.ResourceCacheImpl)
[INFO] Default ResourceManager initialization complete.
[INFO] Loaded System Directive: org.apache.velocity.runtime.directive.Literal
[INFO] Loaded System Directive: org.apache.velocity.runtime.directive.Macro
[INFO] Loaded System Directive: org.apache.velocity.runtime.directive.Parse
[INFO] Loaded System Directive: org.apache.velocity.runtime.directive.Include
[INFO] Loaded System Directive: org.apache.velocity.runtime.directive.Foreach
[INFO] Created: 20 parsers.
[INFO] Velocimacro : initialization starting.
[INFO] Velocimacro : adding VMs from VM library template : VM_global_library.vm
[ERROR] ResourceManager : unable to find resource 'VM_global_library.vm' in any resource loader.
[INFO] Velocimacro : error using  VM library template VM_global_library.vm : org.apache.velocity.exception.ResourceNotFoundException:
Unable to find resource 'VM_global_library.vm'
[INFO] Velocimacro :  VM library template macro registration complete.
[INFO] Velocimacro : allowInline = true : VMs can be defined inline in templates
[INFO] Velocimacro : allowInlineToOverride = false : VMs defined inline may NOT replace previous
VM definitions
[INFO] Velocimacro : allowInlineLocal = false : VMs defined inline will be  global in scope
if allowed.
[INFO] Velocimacro : messages on  : VM system will output logging messages
[INFO] Velocimacro : autoload off  : VM system will not automatically reload global library
macros
[INFO] Velocimacro : initialization complete.
[INFO] Velocity successfully started.
[INFO] [modello:java]
[INFO] outputDirectory: /export/home/continuum/continuum-1.0-alpha-2/apps/continuum/temp/4/target/generated-sources
[INFO] [modello:jpox-store]
[INFO] outputDirectory: /export/home/continuum/continuum-1.0-alpha-2/apps/continuum/temp/4/target/generated-sources
[ERROR] ResourceManager : unable to find resource '/org/codehaus/modello/plugin/jpox/templates/JPoxStore.java.vm'
in any resource loader.
[INFO] ResourceManager : found /org/codehaus/modello/plugin/jpox/templates/JPoxStore.java.vm
with loader org.codehaus.plexus.velocity.ContextClassLoaderResourceLoader
[INFO] [modello:jpox-jdo-mapping]
[INFO] outputDirectory: /export/home/continuum/continuum-1.0-alpha-2/apps/continuum/temp/4/target/classes
[INFO] [resources:resources]
[INFO] plexus-container-default: resolved to version 1.0-alpha-4-20050607.002806-7 from local
repository
[INFO] [compiler:compile]
Compiling 18 source files to /export/home/continuum/continuum-1.0-alpha-2/apps/continuum/temp/4/target/classes
[INFO] [jpox:enhance]
[INFO] [resources:testResources]
[INFO] [compiler:testCompile]
[INFO] No sources to compile
[INFO] [surefire:test]
[INFO] Setting reports dir: /export/home/continuum/continuum-1.0-alpha-2/apps/continuum/temp/4/target/surefire-reports

-------------------------------------------------------
 T E S T S
-------------------------------------------------------
There are no test to run.

Results :
[surefire] Tests run: 0, Failures: 0, Errors: 0

[INFO] [jar:jar]
[INFO] Building jar: /export/home/continuum/continuum-1.0-alpha-2/apps/continuum/temp/4/target/continuum-model-1.0-alpha-3-SNAPSHOT.jar
[INFO] [install:install]
[INFO] Installing /export/home/continuum/continuum-1.0-alpha-2/apps/continuum/temp/4/target/continuum-model-1.0-alpha-3-SNAPSHOT.jar
to /export/home/continuum/.m2/repository/org/apache/maven/continuum/continuum-model/1.0-alpha-3-SNAPSHOT/continuum-model-1.0-alpha-3-SNAPSHOT.jar
[INFO] ----------------------------------------------------------------------------
[INFO] BUILD SUCCESSFUL
[INFO] ----------------------------------------------------------------------------
[INFO] Total time: 4 seconds
[INFO] Finished at: Fri Jun 10 02:29:29 GMT+00:00 2005
[INFO] Final Memory: 6M/266M
[INFO] ----------------------------------------------------------------------------

****************************************************************************

****************************************************************************
Standard error:
****************************************************************************
Executing command line:
java -cp /export/home/continuum/continuum-1.0-alpha-2/apps/continuum/temp/4/target/classes:/export/home/continuum/continuum-1.0-alpha-2/apps/continuum/temp/4/target/classes:/export/home/continuum/.m2/repository/jta/jta/1.0.1b/jta-1.0.1b.jar:/export/home/continuum/.m2/repository/commons-dbcp/commons-dbcp/1.0/commons-dbcp-1.0.jar:/export/home/continuum/.m2/repository/jdbc/jdbc/2.0/jdbc-2.0.jar:/export/home/continuum/.m2/repository/junit/junit/3.8.1/junit-3.8.1.jar:/export/home/continuum/.m2/repository/jpox/jpox/1.0.4/jpox-1.0.4.jar:/export/home/continuum/.m2/repository/classworlds/classworlds/1.1-alpha-1/classworlds-1.1-alpha-1.jar:/export/home/continuum/.m2/repository/log4j/log4j/1.2.8/log4j-1.2.8.jar:/export/home/continuum/.m2/repository/commons-collections/commons-collections/2.1/commons-collections-2.1.jar:/export/home/continuum/.m2/repository/plexus/plexus-container-default/1.0-alpha-4-SNAPSHOT/plexus-container-default-1.0-alpha-4-20050607.002806-7.jar:/export/home/contin!
 uum/.m2/repository/plexus/plexus-utils/1.0-alpha-3/plexus-utils-1.0-alpha-3.jar:/export/home/continuum/.m2/repository/jpox/jpox-enhancer/1.0.4/jpox-enhancer-1.0.4.jar:/export/home/continuum/.m2/repository/jdo/jdo/1.0.1/jdo-1.0.1.jar:/export/home/continuum/.m2/repository/ant/ant/1.6/ant-1.6.jar:/export/home/continuum/.m2/repository/jaas/jaas/1.0.1/jaas-1.0.1.jar:/export/home/continuum/.m2/repository/jdbc/jdbc-stdext/2.0/jdbc-stdext-2.0.jar:/export/home/continuum/.m2/repository/xml-apis/xml-apis/2.0.2/xml-apis-2.0.2.jar:/export/home/continuum/.m2/repository/bcel/bcel/5.1/bcel-5.1.jar:/export/home/continuum/.m2/repository/jca/jca/1.0.0/jca-1.0.0.jar:/export/home/continuum/.m2/repository/commons-lang/commons-lang/1.0-b1/commons-lang-1.0-b1.jar:/export/home/continuum/.m2/repository/ojdbc/ojdbc/14/ojdbc-14.jar:/export/home/continuum/.m2/repository/commons-pool/commons-pool/1.0.1/commons-pool-1.0.1.jar
-Dlog4j.configuration=file:/var/tmp/jpox-enhancer29004tmp org.jpox.enhancer.JPO!
 XEnhancer -v /export/home/continuum/continuum-1.0-alpha-2/apps/continu
um/temp/4/target/classes/META-INF/package.jdo
exit code: 0
--------------------
 Standard output from the JPox enhancer tool:
--------------------
JPOX Enhancer : Processing JDO Meta-Data /export/home/continuum/continuum-1.0-alpha-2/apps/continuum/temp/4/target/classes/META-INF/package.jdo
INFO  [JPOX.Enhancer.Parser] - reading jdo file :/export/home/continuum/continuum-1.0-alpha-2/apps/continuum/temp/4/target/classes/META-INF/package.jdo
JPOX Enhancer : Processing class org.apache.maven.continuum.project.ContinuumProject
INFO  [JPOX.Enhancer] - setup org.apache.maven.continuum.project.ContinuumProject
INFO  [JPOX.Enhancer] - update class file : /export/home/continuum/continuum-1.0-alpha-2/apps/continuum/temp/4/target/classes/org/apache/maven/continuum/project/ContinuumProject.class
ENHANCED: org.apache.maven.continuum.project.ContinuumProject
JPOX Enhancer : Processing class org.apache.maven.continuum.project.ContinuumDeveloper
INFO  [JPOX.Enhancer] - setup org.apache.maven.continuum.project.ContinuumDeveloper
INFO  [JPOX.Enhancer] - update class file : /export/home/continuum/continuum-1.0-alpha-2/apps/continuum/temp/4/target/classes/org/apache/maven/continuum/project/ContinuumDeveloper.class
ENHANCED: org.apache.maven.continuum.project.ContinuumDeveloper
JPOX Enhancer : Processing class org.apache.maven.continuum.project.MavenTwoProject
INFO  [JPOX.Enhancer] - setup org.apache.maven.continuum.project.MavenTwoProject
INFO  [JPOX.Enhancer] - update class file : /export/home/continuum/continuum-1.0-alpha-2/apps/continuum/temp/4/target/classes/org/apache/maven/continuum/project/MavenTwoProject.class
ENHANCED: org.apache.maven.continuum.project.MavenTwoProject
JPOX Enhancer : Processing class org.apache.maven.continuum.project.MavenOneProject
INFO  [JPOX.Enhancer] - setup org.apache.maven.continuum.project.MavenOneProject
INFO  [JPOX.Enhancer] - update class file : /export/home/continuum/continuum-1.0-alpha-2/apps/continuum/temp/4/target/classes/org/apache/maven/continuum/project/MavenOneProject.class
ENHANCED: org.apache.maven.continuum.project.MavenOneProject
JPOX Enhancer : Processing class org.apache.maven.continuum.project.AntProject
INFO  [JPOX.Enhancer] - setup org.apache.maven.continuum.project.AntProject
INFO  [JPOX.Enhancer] - update class file : /export/home/continuum/continuum-1.0-alpha-2/apps/continuum/temp/4/target/classes/org/apache/maven/continuum/project/AntProject.class
ENHANCED: org.apache.maven.continuum.project.AntProject
JPOX Enhancer : Processing class org.apache.maven.continuum.project.ShellProject
INFO  [JPOX.Enhancer] - setup org.apache.maven.continuum.project.ShellProject
INFO  [JPOX.Enhancer] - update class file : /export/home/continuum/continuum-1.0-alpha-2/apps/continuum/temp/4/target/classes/org/apache/maven/continuum/project/ShellProject.class
ENHANCED: org.apache.maven.continuum.project.ShellProject
JPOX Enhancer : Processing class org.apache.maven.continuum.project.ContinuumBuild
INFO  [JPOX.Enhancer] - setup org.apache.maven.continuum.project.ContinuumBuild
INFO  [JPOX.Enhancer] - update class file : /export/home/continuum/continuum-1.0-alpha-2/apps/continuum/temp/4/target/classes/org/apache/maven/continuum/project/ContinuumBuild.class
ENHANCED: org.apache.maven.continuum.project.ContinuumBuild
JPOX Enhancer : Processing class org.apache.maven.continuum.project.ContinuumBuildResult
INFO  [JPOX.Enhancer] - setup org.apache.maven.continuum.project.ContinuumBuildResult
INFO  [JPOX.Enhancer] - update class file : /export/home/continuum/continuum-1.0-alpha-2/apps/continuum/temp/4/target/classes/org/apache/maven/continuum/project/ContinuumBuildResult.class
ENHANCED: org.apache.maven.continuum.project.ContinuumBuildResult
JPOX Enhancer : Processing class org.apache.maven.continuum.execution.ant.AntBuildResult
INFO  [JPOX.Enhancer] - setup org.apache.maven.continuum.execution.ant.AntBuildResult
INFO  [JPOX.Enhancer] - update class file : /export/home/continuum/continuum-1.0-alpha-2/apps/continuum/temp/4/target/classes/org/apache/maven/continuum/execution/ant/AntBuildResult.class
ENHANCED: org.apache.maven.continuum.execution.ant.AntBuildResult
JPOX Enhancer : Processing class org.apache.maven.continuum.execution.shell.ShellBuildResult
INFO  [JPOX.Enhancer] - setup org.apache.maven.continuum.execution.shell.ShellBuildResult
INFO  [JPOX.Enhancer] - update class file : /export/home/continuum/continuum-1.0-alpha-2/apps/continuum/temp/4/target/classes/org/apache/maven/continuum/execution/shell/ShellBuildResult.class
ENHANCED: org.apache.maven.continuum.execution.shell.ShellBuildResult
JPOX Enhancer : Processing class org.apache.maven.continuum.execution.maven.m1.Maven1BuildResult
INFO  [JPOX.Enhancer] - setup org.apache.maven.continuum.execution.maven.m1.Maven1BuildResult
INFO  [JPOX.Enhancer] - update class file : /export/home/continuum/continuum-1.0-alpha-2/apps/continuum/temp/4/target/classes/org/apache/maven/continuum/execution/maven/m1/Maven1BuildResult.class
ENHANCED: org.apache.maven.continuum.execution.maven.m1.Maven1BuildResult
JPOX Enhancer : Processing class org.apache.maven.continuum.scm.ScmResult
INFO  [JPOX.Enhancer] - setup org.apache.maven.continuum.scm.ScmResult
INFO  [JPOX.Enhancer] - update class file : /export/home/continuum/continuum-1.0-alpha-2/apps/continuum/temp/4/target/classes/org/apache/maven/continuum/scm/ScmResult.class
ENHANCED: org.apache.maven.continuum.scm.ScmResult
JPOX Enhancer : Processing class org.apache.maven.continuum.scm.ScmFile
INFO  [JPOX.Enhancer] - setup org.apache.maven.continuum.scm.ScmFile
INFO  [JPOX.Enhancer] - update class file : /export/home/continuum/continuum-1.0-alpha-2/apps/continuum/temp/4/target/classes/org/apache/maven/continuum/scm/ScmFile.class
ENHANCED: org.apache.maven.continuum.scm.ScmFile
JPOX Enhancer : Processing class org.apache.maven.continuum.scm.CheckOutScmResult
INFO  [JPOX.Enhancer] - setup org.apache.maven.continuum.scm.CheckOutScmResult
INFO  [JPOX.Enhancer] - update class file : /export/home/continuum/continuum-1.0-alpha-2/apps/continuum/temp/4/target/classes/org/apache/maven/continuum/scm/CheckOutScmResult.class
ENHANCED: org.apache.maven.continuum.scm.CheckOutScmResult
JPOX Enhancer : Processing class org.apache.maven.continuum.scm.UpdateScmResult
INFO  [JPOX.Enhancer] - setup org.apache.maven.continuum.scm.UpdateScmResult
INFO  [JPOX.Enhancer] - update class file : /export/home/continuum/continuum-1.0-alpha-2/apps/continuum/temp/4/target/classes/org/apache/maven/continuum/scm/UpdateScmResult.class
ENHANCED: org.apache.maven.continuum.scm.UpdateScmResult
JPOX Enhancer : Processing class org.apache.maven.continuum.execution.maven.m2.MavenTwoBuildResult
INFO  [JPOX.Enhancer] - setup org.apache.maven.continuum.execution.maven.m2.MavenTwoBuildResult
INFO  [JPOX.Enhancer] - update class file : /export/home/continuum/continuum-1.0-alpha-2/apps/continuum/temp/4/target/classes/org/apache/maven/continuum/execution/maven/m2/MavenTwoBuildResult.class
ENHANCED: org.apache.maven.continuum.execution.maven.m2.MavenTwoBuildResult

--------------------

****************************************************************************


Mime
View raw message