continuum-dev mailing list archives

Site index · List index
Message view « Date » · « Thread »
Top « Date » · « Thread »
From "Continuum@maven.zones.apache.org" <contin...@maven.zones.apache.org>
Subject [continuum] BUILD FAILURE: Continuum Plexus Application
Date Tue, 07 Jun 2005 19:24:10 GMT
****************************************************************************
Build statistics:
  State: Failed
  Previous State: Ok
  Started at: Tue, 7 Jun 2005 19:24:09 +0000
  Finished at: Tue, 7 Jun 2005 19:24:09 +0000
  Total time: 0s
  Building machine hostname: maven.zones.apache.org
****************************************************************************

****************************************************************************
Standard output:
****************************************************************************
[INFO] ----------------------------------------------------------------------------
[INFO] Building Continuum Plexus Application
[INFO] ----------------------------------------------------------------------------
[INFO] ----------------------------------------------------------------------------
[ERROR] BUILD ERROR
[INFO] ----------------------------------------------------------------------------
[ERROR] Cause: 
org.apache.maven.artifact.handler.manager.ArtifactHandlerNotFoundException: Artifact handler
for type 'plexus-application' cannot be found.
	at org.apache.maven.artifact.handler.manager.DefaultArtifactHandlerManager.getArtifactHandler(DefaultArtifactHandlerManager.java:44)
	at org.apache.maven.lifecycle.DefaultLifecycleExecutor.processGoals(DefaultLifecycleExecutor.java:128)
	at org.apache.maven.lifecycle.DefaultLifecycleExecutor.execute(DefaultLifecycleExecutor.java:90)
	at org.apache.maven.DefaultMaven.processProject(DefaultMaven.java:253)
	at org.apache.maven.DefaultMaven.execute(DefaultMaven.java:167)
	at org.apache.maven.cli.MavenCli.main(MavenCli.java:246)
	at sun.reflect.NativeMethodAccessorImpl.invoke0(Native Method)
	at sun.reflect.NativeMethodAccessorImpl.invoke(NativeMethodAccessorImpl.java:39)
	at sun.reflect.DelegatingMethodAccessorImpl.invoke(DelegatingMethodAccessorImpl.java:25)
	at java.lang.reflect.Method.invoke(Method.java:585)
	at org.codehaus.classworlds.Launcher.launchEnhanced(Launcher.java:303)
	at org.codehaus.classworlds.Launcher.launch(Launcher.java:243)
	at org.codehaus.classworlds.Launcher.mainWithExitCode(Launcher.java:416)
	at org.codehaus.classworlds.Launcher.main(Launcher.java:363)
[INFO] ----------------------------------------------------------------------------
[INFO] Total time: < 1 second
[INFO] Finished at: Tue Jun 07 19:24:09 GMT+00:00 2005
[INFO] Final Memory: 1M/245M
[INFO] ----------------------------------------------------------------------------

****************************************************************************

There was no content on standard error.


Mime
View raw message