continuum-dev mailing list archives

Site index · List index
Message view « Date » · « Thread »
Top « Date » · « Thread »
From "Continuum@maven.zones.apache.org" <contin...@maven.zones.apache.org>
Subject [continuum] BUILD FAILURE: Continuum Core
Date Sun, 29 May 2005 17:24:26 GMT
****************************************************************************
Build statistics:
  State: Failed
  Previous State: Error
  Started at: Sun, 29 May 2005 17:24:01 +0000
  Finished at: Sun, 29 May 2005 17:24:26 +0000
  Total time: 25s
  Building machine hostname: maven.zones.apache.org
****************************************************************************

****************************************************************************
Standard output:
****************************************************************************
[INFO] ----------------------------------------------------------------------------
[INFO] Building Continuum Core
[INFO] ----------------------------------------------------------------------------
[INFO] maven-jar-plugin: checking for updates from central
[INFO] Retrieving release information for maven-jar-plugin
[INFO] maven-jar-plugin: resolved to version 2.0-alpha-2 from local repository
[INFO] maven-clean-plugin: checking for updates from central
[INFO] Retrieving release information for maven-clean-plugin
[INFO] maven-clean-plugin: resolved to version 2.0-alpha-2 from local repository
[INFO] [clean:clean]
[INFO] Deleting directory /export/home/continuum/continuum-1.0-alpha-2/apps/continuum/temp/3/target
[INFO] maven-resources-plugin: checking for updates from central
[INFO] Retrieving release information for maven-resources-plugin
[INFO] maven-resources-plugin: resolved to version 2.0-alpha-2 from local repository
[INFO] maven-compiler-plugin: checking for updates from central
[INFO] Retrieving release information for maven-compiler-plugin
[INFO] maven-compiler-plugin: resolved to version 2.0-alpha-2 from local repository
[INFO] maven-surefire-plugin: checking for updates from central
[INFO] Retrieving release information for maven-surefire-plugin
[INFO] maven-surefire-plugin: resolved to version 2.0-alpha-2 from local repository
[INFO] maven-install-plugin: checking for updates from central
[INFO] Retrieving release information for maven-install-plugin
[INFO] maven-install-plugin: resolved to version 2.0-alpha-2 from local repository
[INFO] [resources:resources]
[INFO] plexus-utils: checking for updates from central
[INFO] Retrieving snapshot information for plexus-utils 1.0.1-SNAPSHOT
[INFO] plexus-utils: using locally installed snapshot
[INFO] continuum-api: checking for updates from central
[INFO] Retrieving snapshot information for continuum-api 1.0-alpha-3-SNAPSHOT
[INFO] continuum-api: using locally installed snapshot
[INFO] continuum-parent: checking for updates from central
[INFO] Retrieving snapshot information for continuum-parent 1.0-alpha-3-SNAPSHOT
[INFO] continuum-parent: resolved to version 1.0-alpha-3-20050527.024032-1 from repository
central
Downloading: http://repo1.maven.org/maven2/org/apache/maven/continuum/continuum-parent/1.0-alpha-3-SNAPSHOT/continuum-parent-1.0-alpha-3-20050527.024032-1.pom
2/2K
2/2K
2K downloaded
Downloading: http://repo1.maven.org/maven2/org/apache/maven/continuum/continuum-parent/1.0-alpha-3-SNAPSHOT/continuum-parent-1.0-alpha-3-20050527.024032-1.pom.md5
0/0K
0K downloaded
[INFO] plexus-container-default: checking for updates from central
[INFO] Retrieving snapshot information for plexus-container-default 1.0-alpha-4-SNAPSHOT
[INFO] plexus-container-default: resolved to version 1.0-alpha-4-20050529.082259-2 from repository
central
Downloading: http://repo1.maven.org/maven2/plexus/plexus-container-default/1.0-alpha-4-SNAPSHOT/plexus-container-default-1.0-alpha-4-20050529.082259-2.pom
0/0K
0K downloaded
Downloading: http://repo1.maven.org/maven2/plexus/plexus-container-default/1.0-alpha-4-SNAPSHOT/plexus-container-default-1.0-alpha-4-20050529.082259-2.pom.md5
0/0K
0K downloaded
[INFO] continuum-model: checking for updates from central
[INFO] Retrieving snapshot information for continuum-model 1.0-alpha-3-SNAPSHOT
[INFO] continuum-model: using locally installed snapshot
Downloading: http://repo1.maven.org/maven2/plexus/plexus-container-default/1.0-alpha-4-SNAPSHOT/plexus-container-default-1.0-alpha-4-20050529.082259-2.jar
2/278K
6/278K
7/278K
11/278K
14/278K
15/278K
19/278K
22/278K
23/278K
27/278K
31/278K
34/278K
35/278K
39/278K
41/278K
43/278K
47/278K
51/278K
55/278K
59/278K
63/278K
67/278K
70/278K
74/278K
78/278K
79/278K
83/278K
87/278K
91/278K
95/278K
98/278K
102/278K
106/278K
107/278K
111/278K
115/278K
119/278K
123/278K
127/278K
131/278K
133/278K
137/278K
140/278K
144/278K
147/278K
150/278K
151/278K
155/278K
159/278K
163/278K
167/278K
171/278K
175/278K
179/278K
183/278K
186/278K
190/278K
193/278K
195/278K
199/278K
203/278K
207/278K
210/278K
214/278K
215/278K
219/278K
223/278K
226/278K
230/278K
233/278K
237/278K
241/278K
243/278K
247/278K
251/278K
254/278K
258/278K
261/278K
263/278K
267/278K
270/278K
274/278K
278/278K
278/278K
278K downloaded
Downloading: http://repo1.maven.org/maven2/plexus/plexus-container-default/1.0-alpha-4-SNAPSHOT/plexus-container-default-1.0-alpha-4-20050529.082259-2.jar.md5
0/0K
0K downloaded
[INFO] [compiler:compile]
Compiling 62 source files to /export/home/continuum/continuum-1.0-alpha-2/apps/continuum/temp/3/target/classes
[INFO] [resources:testResources]
[INFO] [compiler:testCompile]
Compiling 14 source files to /export/home/continuum/continuum-1.0-alpha-2/apps/continuum/temp/3/target/test-classes
[INFO] [surefire:test]
[INFO] Setting reports dir: /export/home/continuum/continuum-1.0-alpha-2/apps/continuum/temp/3/target/surefire-reports

-------------------------------------------------------
 T E S T S
-------------------------------------------------------
[INFO] Initializing JDO.
[INFO] Initializing JDO.
[INFO] Initializing JDO.
[surefire] Running org.apache.maven.continuum.buildqueue.BuildQueueTest
[surefire] Tests run: 3, Failures: 0, Errors: 0, Time elapsed: 0.29 sec
[INFO] Build executors:
[INFO]   maven-1
[INFO]   ant
[INFO]   maven2
[INFO]   shell
[INFO] Initializing JDO.
[INFO] Initializing Continuum.
[INFO] Showing all projects: 
[INFO]  1:Build Queue Project 1:maven-two
[INFO]  6:Build Queue Project 2:maven-two
[INFO]  7:Build Queue Project 3:maven-two
[INFO]  11:Build Queue Project 4:maven-two
[INFO] Starting Continuum.
[INFO] Checking for projects that has to be checked out.
[INFO] 
[INFO] 
[INFO] < Continuum 1.0-alpha-2-SNAPSHOT started! >
[INFO] -------------------------------------------
[INFO]        \   ^__^
[INFO]         \  (oo)\_______
[INFO]            (__)\       )\/\
[INFO]                ||----w |
[INFO]                ||     ||
[INFO] 
[INFO] 
[INFO] Downloading file:/export/home/continuum/continuum-1.0-alpha-2/apps/continuum/temp/3/src/test-projects/project1/pom.xml
[INFO] Downloading file:/export/home/continuum/continuum-1.0-alpha-2/apps/continuum/temp/3/src/test-projects/project1/pom.xml
[INFO] Stopping Continuum.
[INFO] Continuum stopped.
[surefire] Running org.apache.maven.continuum.core.ContinuumCoreTest
[surefire] Tests run: 1, Failures: 0, Errors: 0, Time elapsed: 0.494 sec
[INFO] Starting socket listener on port 54321
[INFO] Stopping socket listener on port 54321
[surefire] Running org.apache.maven.continuum.network.SimpleServerSocketConnectionFactoryTest
[surefire] Tests run: 1, Failures: 0, Errors: 0, Time elapsed: 0.049 sec
[INFO] Setting property: velocimacro.library => '/org/apache/maven/continuum/notification/mail/templates/common.vm'.
[INFO] Setting property: resource.loader => 'threadContext'.
[INFO] Setting property: threadContext.resource.loader.class => 'org.codehaus.plexus.velocity.ContextClassLoaderResourceLoader'.
[INFO] ************************************************************** 
[INFO] Starting Jakarta Velocity v1.4
[INFO] RuntimeInstance initializing.
[INFO] Default Properties File: org/apache/velocity/runtime/defaults/velocity.properties
[INFO] Default ResourceManager initializing. (class org.apache.velocity.runtime.resource.ResourceManagerImpl)
[INFO] Resource Loader Instantiated: org.codehaus.plexus.velocity.ContextClassLoaderResourceLoader
[INFO] ClasspathResourceLoader : initialization starting.
[INFO] ClasspathResourceLoader : initialization complete.
[INFO] ResourceCache : initialized. (class org.apache.velocity.runtime.resource.ResourceCacheImpl)
[INFO] Default ResourceManager initialization complete.
[INFO] Loaded System Directive: org.apache.velocity.runtime.directive.Literal
[INFO] Loaded System Directive: org.apache.velocity.runtime.directive.Macro
[INFO] Loaded System Directive: org.apache.velocity.runtime.directive.Parse
[INFO] Loaded System Directive: org.apache.velocity.runtime.directive.Include
[INFO] Loaded System Directive: org.apache.velocity.runtime.directive.Foreach
[INFO] Created: 20 parsers.
[INFO] Velocimacro : initialization starting.
[INFO] Velocimacro : adding VMs from VM library template : /org/apache/maven/continuum/notification/mail/templates/common.vm
[INFO] Velocimacro : added new VM : #shellBuildResult( ) : source = /org/apache/maven/continuum/notification/mail/templates/common.vm
[INFO] ResourceManager : found /org/apache/maven/continuum/notification/mail/templates/common.vm
with loader org.codehaus.plexus.velocity.ContextClassLoaderResourceLoader
[INFO] Velocimacro :  VM library template macro registration complete.
[INFO] Velocimacro : allowInline = true : VMs can be defined inline in templates
[INFO] Velocimacro : allowInlineToOverride = false : VMs defined inline may NOT replace previous
VM definitions
[INFO] Velocimacro : allowInlineLocal = false : VMs defined inline will be  global in scope
if allowed.
[INFO] Velocimacro : messages on  : VM system will output logging messages
[INFO] Velocimacro : autoload off  : VM system will not automatically reload global library
macros
[INFO] Velocimacro : initialization complete.
[INFO] Velocity successfully started.
[INFO] Initializing JDO.
[INFO] Using 'continuum@localhost' as the from mailbox for all emails.
[INFO] From name: Continuum
[INFO] ResourceManager : found /org/apache/maven/continuum/notification/mail/templates/maven2/BuildComplete.vm
with loader org.codehaus.plexus.velocity.ContextClassLoaderResourceLoader
[WARNING] org.apache.velocity.runtime.exception.ReferenceException: reference : template =
/org/apache/maven/continuum/notification/mail/templates/maven2/BuildComplete.vm [line 12,column
30] : $buildHost is not a valid reference.
[WARNING] Unknown build state 0
[INFO] Sending message: From '"Continuum" <continuum@localhost>'.
[INFO] Recipient: To '<foo@bar>'.
[surefire] Running org.apache.maven.continuum.notification.mail.MailContinuumNotifierTest
[surefire] Tests run: 1, Failures: 0, Errors: 0, Time elapsed: 0.421 sec
[surefire] Running org.apache.maven.continuum.notification.mail.FormatterToolTest
[surefire] Tests run: 1, Failures: 0, Errors: 0, Time elapsed: 0 sec
[WARNING] Using 'nobody@localhost' as the to address for all emails.
[INFO] Initializing JDO.
Build event for project 'Notification Dispatcher Test Project':Build complete.
[surefire] Running org.apache.maven.continuum.notification.ContinuumNotificationDispatcherTest
[surefire] Tests run: 1, Failures: 0, Errors: 0, Time elapsed: 0.27 sec
[INFO] Initializing JDO.
[INFO] Initializing JDO.
[INFO] Initializing JDO.
[INFO] Initializing JDO.
[INFO] Removed project with id '31'.
[INFO] Initializing JDO.
[INFO] Initializing JDO.
[INFO] Initializing JDO.
[INFO] Removed project with id '46'.
[INFO] Initializing JDO.
[INFO] Initializing JDO.
[INFO] Initializing JDO.
[surefire] Running org.apache.maven.continuum.store.ModelloJPoxContinuumStoreTest
[surefire] Tests run: 10, Failures: 0, Errors: 0, Time elapsed: 0.216 sec
[INFO] Build executors:
[INFO]   maven-1
[INFO]   ant
[INFO]   maven2
[INFO]   shell
[INFO] Initializing JDO.
[WARNING] Using 'nobody@localhost' as the to address for all emails.
[INFO] Initializing Continuum.
[INFO] Showing all projects: 
[INFO] Starting Continuum.
[INFO] Checking for projects that has to be checked out.
[INFO] 
[INFO] 
[INFO] < Continuum 1.0-alpha-2-SNAPSHOT started! >
[INFO] -------------------------------------------
[INFO]        \   ^__^
[INFO]         \  (oo)\_______
[INFO]            (__)\       )\/\
[INFO]                ||----w |
[INFO]                ||     ||
[INFO] 
[INFO] 
[INFO] Starting task executor, thread name 'build-project'.
[INFO] Starting task executor, thread name 'check-out-project'.
[INFO] Executor thread got shutdown signal.
[INFO] Waiting until task executor 'check-out-project' is idling...
[INFO] Executor thread 'check-out-project' exited.
[INFO] Stopping Continuum.
[INFO] Continuum stopped.
[INFO] Executor thread got shutdown signal.
[INFO] Waiting until task executor 'build-project' is idling...
[INFO] Executor thread 'build-project' exited.
[surefire] Running org.apache.maven.continuum.DefaultContinuumTest
[surefire] Tests run: 1, Failures: 0, Errors: 0, Time elapsed: 0.465 sec
[INFO] Build executors:
[INFO]   maven-1
[INFO]   ant
[INFO]   maven2
[INFO]   shell
[surefire] Running org.apache.maven.continuum.execution.maven.m1.MavenOneBuildExecutorTest
[surefire] Tests run: 1, Failures: 0, Errors: 0, Time elapsed: 0.039 sec
[INFO] Build executors:
[INFO]   maven-1
[INFO]   ant
[INFO]   maven2
[INFO]   shell
[surefire] Running org.apache.maven.continuum.execution.manager.DefaultBuildExecutorManagerTest
[surefire] Tests run: 1, Failures: 0, Errors: 0, Time elapsed: 0.082 sec
[INFO] Downloading file:/export/home/continuum/continuum-1.0-alpha-2/apps/continuum/temp/3/src/test/repository/maven-builder-helper-1.xml
[INFO] Downloading file:/export/home/continuum/continuum-1.0-alpha-2/apps/continuum/temp/3/src/test/repository/maven-builder-helper-2.xml
[INFO] Downloading file:/export/home/continuum/continuum-1.0-alpha-2/apps/continuum/temp/3/src/test/resources/projects/continuum/pom.xml
[INFO] Downloading file:/export/home/continuum/continuum-1.0-alpha-2/apps/continuum/temp/3/src/test/resources/projects/continuum/continuum-core/pom.xml
[INFO] Downloading file:/export/home/continuum/continuum-1.0-alpha-2/apps/continuum/temp/3/src/test/resources/projects/continuum/continuum-model/pom.xml
[surefire] Running org.apache.maven.continuum.project.builder.maven.MavenTwoContinuumProjectBuilderTest
[surefire] Tests run: 3, Failures: 0, Errors: 1, Time elapsed: 0.081 sec <<<<<<<<
FAILURE !! 
[INFO] Downloading file:/export/home/continuum/continuum-1.0-alpha-2/apps/continuum/temp/3/src/test/resources/projects/maven-1.pom.xml
[surefire] Running org.apache.maven.continuum.project.builder.maven.MavenOneContinuumProjectBuilderTest
[surefire] Tests run: 1, Failures: 0, Errors: 0, Time elapsed: 0.029 sec
[surefire] Running org.apache.maven.continuum.scm.ContinuumScmTest
[surefire] Tests run: 1, Failures: 0, Errors: 0, Time elapsed: 0.024 sec

Results :
[surefire] Tests run: 26, Failures: 0, Errors: 1

[INFO] ----------------------------------------------------------------------------
[INFO] BUILD FAILURE
[INFO] ----------------------------------------------------------------------------
[INFO] Reason: There are some test failures.
[INFO] ----------------------------------------------------------------------------
[INFO] Total time: 24 seconds
[INFO] Finished at: Sun May 29 17:24:26 GMT+00:00 2005
[INFO] Final Memory: 20M/319M
[INFO] ----------------------------------------------------------------------------

****************************************************************************

****************************************************************************
Standard error:
****************************************************************************
org.codehaus.surefire.IsolatedClassLoader@175ade6
java.sql.SQLException: Table not found: SEQUENCE_TABLE in statement [SELECT NEXT_VAL FROM
SEQUENCE_TABLE WHERE SEQUENCE_NAME=?]
	at org.hsqldb.jdbc.jdbcUtil.throwError(Unknown Source)
	at org.hsqldb.jdbc.jdbcPreparedStatement.<init>(Unknown Source)
	at org.hsqldb.jdbc.jdbcConnection.prepareStatement(Unknown Source)
	at org.jpox.store.table.SequenceTable.getNextVal(SequenceTable.java:155)
	at org.jpox.poid.SequenceTablePoidGenerator.reserveBlock(SequenceTablePoidGenerator.java:74)
	at org.jpox.poid.PoidManager.obtainPoidBlock(PoidManager.java:85)
	at org.jpox.poid.PoidManager.getPoidBlock(PoidManager.java:181)
	at org.jpox.poid.PoidManager.getPoid(PoidManager.java:54)
	at org.jpox.store.StoreManager.getNextOID(StoreManager.java:1301)
	at org.jpox.store.table.JDOBaseTable.newOID(JDOBaseTable.java:134)
	at org.jpox.store.StoreManager.newObjectID(StoreManager.java:1099)
	at org.jpox.state.StateManagerImpl.<init>(StateManagerImpl.java:375)
	at org.jpox.AbstractPersistenceManager.internalMakePersistent(AbstractPersistenceManager.java:839)
	at org.jpox.AbstractPersistenceManager.makePersistent(AbstractPersistenceManager.java:860)
	at org.apache.maven.continuum.project.ContinuumJPoxStore.addContinuumProject(ContinuumJPoxStore.java:173)
	at org.apache.maven.continuum.store.ModelloJPoxContinuumStore.addProject(ModelloJPoxContinuumStore.java:100)
	at org.apache.maven.continuum.store.ModelloJPoxContinuumStoreTest.addProject(ModelloJPoxContinuumStoreTest.java:762)
	at org.apache.maven.continuum.store.ModelloJPoxContinuumStoreTest.addProject(ModelloJPoxContinuumStoreTest.java:728)
	at org.apache.maven.continuum.store.ModelloJPoxContinuumStoreTest.addProject(ModelloJPoxContinuumStoreTest.java:748)
	at org.apache.maven.continuum.buildqueue.BuildQueueTest.testTestTheQueueWithASingleProject(BuildQueueTest.java:52)
	at sun.reflect.NativeMethodAccessorImpl.invoke0(Native Method)
	at sun.reflect.NativeMethodAccessorImpl.invoke(NativeMethodAccessorImpl.java:39)
	at sun.reflect.DelegatingMethodAccessorImpl.invoke(DelegatingMethodAccessorImpl.java:25)
	at java.lang.reflect.Method.invoke(Method.java:585)
	at junit.framework.TestCase.runTest(TestCase.java:154)
	at junit.framework.TestCase.runBare(TestCase.java:127)
	at junit.framework.TestResult$1.protect(TestResult.java:106)
	at junit.framework.TestResult.runProtected(TestResult.java:124)
	at junit.framework.TestResult.run(TestResult.java:109)
	at junit.framework.TestCase.run(TestCase.java:118)
	at junit.framework.TestSuite.runTest(TestSuite.java:208)
	at junit.framework.TestSuite.run(TestSuite.java:203)
	at sun.reflect.NativeMethodAccessorImpl.invoke0(Native Method)
	at sun.reflect.NativeMethodAccessorImpl.invoke(NativeMethodAccessorImpl.java:39)
	at sun.reflect.DelegatingMethodAccessorImpl.invoke(DelegatingMethodAccessorImpl.java:25)
	at java.lang.reflect.Method.invoke(Method.java:585)
	at org.codehaus.surefire.battery.JUnitBattery.execute(JUnitBattery.java:190)
	at org.codehaus.surefire.Surefire.executeBattery(Surefire.java:155)
	at org.codehaus.surefire.Surefire.run(Surefire.java:105)
	at org.codehaus.surefire.Surefire.run(Surefire.java:59)
	at sun.reflect.NativeMethodAccessorImpl.invoke0(Native Method)
	at sun.reflect.NativeMethodAccessorImpl.invoke(NativeMethodAccessorImpl.java:39)
	at sun.reflect.DelegatingMethodAccessorImpl.invoke(DelegatingMethodAccessorImpl.java:25)
	at java.lang.reflect.Method.invoke(Method.java:585)
	at org.codehaus.surefire.SurefireBooter.run(SurefireBooter.java:83)
	at org.apache.maven.test.SurefirePlugin.execute(SurefirePlugin.java:213)
	at org.apache.maven.plugin.DefaultPluginManager.executeMojo(DefaultPluginManager.java:415)
	at org.apache.maven.lifecycle.DefaultLifecycleExecutor.processGoals(DefaultLifecycleExecutor.java:169)
	at org.apache.maven.lifecycle.DefaultLifecycleExecutor.execute(DefaultLifecycleExecutor.java:90)
	at org.apache.maven.DefaultMaven.processProject(DefaultMaven.java:253)
	at org.apache.maven.DefaultMaven.execute(DefaultMaven.java:167)
	at org.apache.maven.cli.MavenCli.main(MavenCli.java:246)
	at sun.reflect.NativeMethodAccessorImpl.invoke0(Native Method)
	at sun.reflect.NativeMethodAccessorImpl.invoke(NativeMethodAccessorImpl.java:39)
	at sun.reflect.DelegatingMethodAccessorImpl.invoke(DelegatingMethodAccessorImpl.java:25)
	at java.lang.reflect.Method.invoke(Method.java:585)
	at org.codehaus.classworlds.Launcher.launchEnhanced(Launcher.java:303)
	at org.codehaus.classworlds.Launcher.launch(Launcher.java:243)
	at org.codehaus.classworlds.Launcher.mainWithExitCode(Launcher.java:416)
	at org.codehaus.classworlds.Launcher.main(Launcher.java:363)

****************************************************************************


Mime
View raw message