commonsrdf-commits mailing list archives

Site index · List index
Message view « Date » · « Thread »
Top « Date » · « Thread »
From Apache Jenkins Server <jenk...@builds.apache.org>
Subject Build failed in Jenkins: incubator-commonsrdf #112
Date Fri, 07 Oct 2016 16:20:13 GMT
See <https://builds.apache.org/job/incubator-commonsrdf/112/changes>

Changes:

[stain] Removed generics from RDF4JTerm

------------------------------------------
[...truncated 323 lines...]
Running org.apache.commons.rdf.simple.SimpleGraphTest
<http://example.com/alice> <http://xmlns.com/foaf/0.1/knows> <http://example.com/bob>
.
_:4ea2f1c4-9317-3fb1-a29e-488eaab058a8 <http://xmlns.com/foaf/0.1/name> "The Secret
Club" .
<http://example.com/alice> <http://xmlns.com/foaf/0.1/member> _:4ea2f1c4-9317-3fb1-a29e-488eaab058a8
.
<http://example.com/bob> <http://xmlns.com/foaf/0.1/name> "Bob"@en-us .
<http://example.com/bob> <http://xmlns.com/foaf/0.1/member> _:4ea2f1c4-9317-3fb1-a29e-488eaab058a8
.
<http://example.com/alice> <http://xmlns.com/foaf/0.1/name> "Alice" .
<http://example.com/bob> <http://xmlns.com/foaf/0.1/member> _:11b37fcc-fc81-3467-87e9-2f3725fc7eb2
.
_:11b37fcc-fc81-3467-87e9-2f3725fc7eb2 <http://xmlns.com/foaf/0.1/name> "A company"
.
Tests run: 11, Failures: 0, Errors: 0, Skipped: 0, Time elapsed: 0.063 sec - in org.apache.commons.rdf.simple.SimpleGraphTest
Running org.apache.commons.rdf.simple.BlankNodeImplTest
Tests run: 4, Failures: 0, Errors: 0, Skipped: 0, Time elapsed: 0.004 sec - in org.apache.commons.rdf.simple.BlankNodeImplTest
Running org.apache.commons.rdf.simple.SimpleNoRelativeIRIRDFTermFactoryTest
Tests run: 24, Failures: 0, Errors: 0, Skipped: 1, Time elapsed: 0.016 sec - in org.apache.commons.rdf.simple.SimpleNoRelativeIRIRDFTermFactoryTest
Running org.apache.commons.rdf.simple.DefaultGraphTest
Tests run: 10, Failures: 0, Errors: 0, Skipped: 7, Time elapsed: 0.005 sec - in org.apache.commons.rdf.simple.DefaultGraphTest
Running org.apache.commons.rdf.simple.TypesTest
Tests run: 3, Failures: 0, Errors: 0, Skipped: 0, Time elapsed: 0 sec - in org.apache.commons.rdf.simple.TypesTest
Running org.apache.commons.rdf.simple.experimental.AbstractRDFParserTest
Tests run: 11, Failures: 0, Errors: 0, Skipped: 0, Time elapsed: 0.064 sec - in org.apache.commons.rdf.simple.experimental.AbstractRDFParserTest

Results :

Tests run: 93, Failures: 0, Errors: 0, Skipped: 8

[JENKINS] Recording test results
[INFO] 
[INFO] --- maven-jar-plugin:3.0.0:jar (default-jar) @ commons-rdf-simple ---
[INFO] Building jar: <https://builds.apache.org/job/incubator-commonsrdf/ws/simple/target/apache-commonsrdf-0.3.0-incubating-SNAPSHOT.jar>
[INFO] 
[INFO] --- maven-site-plugin:3.4:attach-descriptor (attach-descriptor) @ commons-rdf-simple
---
[INFO] 
[INFO] >>> maven-source-plugin:3.0.1:jar (default) @ commons-rdf-simple >>>
[INFO] 
[INFO] --- maven-enforcer-plugin:1.4.1:enforce (enforce-maven-3) @ commons-rdf-simple ---
[INFO] 
[INFO] --- build-helper-maven-plugin:1.10:parse-version (parse-version) @ commons-rdf-simple
---
[INFO] 
[INFO] --- maven-antrun-plugin:1.8:run (javadoc.resources) @ commons-rdf-simple ---
[INFO] Executing tasks

main:
[INFO] Executed tasks
[WARNING] Failed to getClass for org.apache.maven.plugins.source.SourceJarMojo
[INFO] 
[INFO] <<< maven-source-plugin:3.0.1:jar (default) @ commons-rdf-simple <<<
[INFO] 
[INFO] --- maven-source-plugin:3.0.1:jar (default) @ commons-rdf-simple ---
[INFO] Building jar: <https://builds.apache.org/job/incubator-commonsrdf/ws/simple/target/apache-commonsrdf-0.3.0-incubating-SNAPSHOT-sources.jar>
[INFO] 
[INFO] >>> maven-source-plugin:3.0.1:test-jar (default) @ commons-rdf-simple >>>
[INFO] 
[INFO] --- maven-enforcer-plugin:1.4.1:enforce (enforce-maven-3) @ commons-rdf-simple ---
[INFO] 
[INFO] --- build-helper-maven-plugin:1.10:parse-version (parse-version) @ commons-rdf-simple
---
[INFO] 
[INFO] --- maven-antrun-plugin:1.8:run (javadoc.resources) @ commons-rdf-simple ---
[INFO] Executing tasks

main:
[INFO] Executed tasks
[WARNING] Failed to getClass for org.apache.maven.plugins.source.TestSourceJarMojo
[INFO] 
[INFO] <<< maven-source-plugin:3.0.1:test-jar (default) @ commons-rdf-simple <<<
[INFO] 
[INFO] --- maven-source-plugin:3.0.1:test-jar (default) @ commons-rdf-simple ---
[INFO] Building jar: <https://builds.apache.org/job/incubator-commonsrdf/ws/simple/target/apache-commonsrdf-0.3.0-incubating-SNAPSHOT-test-sources.jar>
[INFO] 
[INFO] --- maven-javadoc-plugin:2.10.4:jar (attach-javadocs) @ commons-rdf-simple ---
[INFO] 
4 warnings
[WARNING] Javadoc Warnings
[WARNING] javadoc: warning - Error fetching URL: https://docs.oracle.com/javase/8/docs/api
[WARNING] javadoc: warning - Error fetching URL: https://jena.apache.org/documentation/javadoc/jena
[WARNING] javadoc: warning - Error fetching URL: https://jena.apache.org/documentation/javadoc/arq
[WARNING] javadoc: warning - Error fetching URL: http://rdf4j.org/javadoc/2.0
[INFO] Building jar: <https://builds.apache.org/job/incubator-commonsrdf/ws/simple/target/apache-commonsrdf-0.3.0-incubating-SNAPSHOT-javadoc.jar>
[INFO] 
[INFO] --- jacoco-maven-plugin:0.7.6.201602180812:check (check) @ commons-rdf-simple ---
[INFO] Analyzed bundle 'Commons RDF: Simple Implementation' with 12 classes
[WARNING] Rule violated for bundle Commons RDF: Simple Implementation: classes covered ratio
is 0.75, but expected minimum is 1.00
[WARNING] Rule violated for bundle Commons RDF: Simple Implementation: instructions covered
ratio is 0.62, but expected minimum is 0.90
[WARNING] Rule violated for bundle Commons RDF: Simple Implementation: methods covered ratio
is 0.65, but expected minimum is 0.95
[WARNING] Rule violated for bundle Commons RDF: Simple Implementation: branches covered ratio
is 0.48, but expected minimum is 0.85
[WARNING] Rule violated for bundle Commons RDF: Simple Implementation: lines covered ratio
is 0.65, but expected minimum is 0.90
[WARNING] Rule violated for bundle Commons RDF: Simple Implementation: complexity covered
ratio is 0.53, but expected minimum is 0.85
[WARNING] Coverage checks have not been met. See log for details.
[INFO] 
[INFO] --- japicmp-maven-plugin:0.9.1:cmp (default) @ commons-rdf-simple ---
[INFO] Written file '<https://builds.apache.org/job/incubator-commonsrdf/ws/simple/target/japicmp/japicmp.diff'.>
[INFO] Written file '<https://builds.apache.org/job/incubator-commonsrdf/ws/simple/target/japicmp/japicmp.xml'.>
[INFO] Written file '<https://builds.apache.org/job/incubator-commonsrdf/ws/simple/target/japicmp/japicmp.html'.>
[INFO]                                                                         
[INFO] ------------------------------------------------------------------------
[INFO] Building Commons RDF: Integration: RDF4j 0.3.0-incubating-SNAPSHOT
[INFO] ------------------------------------------------------------------------
[INFO] 
[INFO] --- maven-clean-plugin:3.0.0:clean (default-clean) @ commons-rdf-rdf4j ---
[INFO] Deleting <https://builds.apache.org/job/incubator-commonsrdf/ws/rdf4j/target>
[INFO] 
[INFO] --- maven-enforcer-plugin:1.4.1:enforce (enforce-maven-3) @ commons-rdf-rdf4j ---
[INFO] 
[INFO] --- build-helper-maven-plugin:1.10:parse-version (parse-version) @ commons-rdf-rdf4j
---
[INFO] 
[INFO] --- maven-antrun-plugin:1.8:run (javadoc.resources) @ commons-rdf-rdf4j ---
[INFO] Executing tasks

main:
[INFO] Executed tasks
[INFO] 
[INFO] --- maven-remote-resources-plugin:1.5:process (process-resource-bundles) @ commons-rdf-rdf4j
---
[INFO] 
[INFO] --- buildnumber-maven-plugin:1.4:create (default) @ commons-rdf-rdf4j ---
[INFO] Executing: /bin/sh -c cd '<https://builds.apache.org/job/incubator-commonsrdf/ws/rdf4j'>
&& 'git' 'rev-parse' '--verify' 'HEAD'
[INFO] Working directory: <https://builds.apache.org/job/incubator-commonsrdf/ws/rdf4j>
[INFO] Storing buildNumber: 7f866f0250d88b1e184bb3c42081d86d4b5f9d75 at timestamp: 1475857128021
[WARNING] Cannot get the branch information from the git repository: 
Detecting the current branch failed: fatal: ref HEAD is not a symbolic ref

[INFO] Executing: /bin/sh -c cd '<https://builds.apache.org/job/incubator-commonsrdf/ws/rdf4j'>
&& 'git' 'rev-parse' '--verify' 'HEAD'
[INFO] Working directory: <https://builds.apache.org/job/incubator-commonsrdf/ws/rdf4j>
[INFO] Storing buildScmBranch: UNKNOWN
[INFO] 
[INFO] --- maven-resources-plugin:2.7:resources (default-resources) @ commons-rdf-rdf4j ---
[INFO] Using 'UTF-8' encoding to copy filtered resources.
[INFO] skip non existing resourceDirectory <https://builds.apache.org/job/incubator-commonsrdf/ws/rdf4j/src/main/resources>
[INFO] Copying 0 resource to META-INF
[INFO] 
[INFO] --- maven-compiler-plugin:3.5.1:compile (default-compile) @ commons-rdf-rdf4j ---
[INFO] Changes detected - recompiling the module!
[INFO] Compiling 28 source files to <https://builds.apache.org/job/incubator-commonsrdf/ws/rdf4j/target/classes>
[INFO] 
[INFO] --- maven-bundle-plugin:3.0.1:manifest (bundle-manifest) @ commons-rdf-rdf4j ---
[INFO] 
[INFO] --- animal-sniffer-maven-plugin:1.15:check (checkAPIcompatibility) @ commons-rdf-rdf4j
---
[INFO] Checking unresolved references to org.codehaus.mojo.signature:java18:1.0
[INFO] 
[INFO] --- maven-resources-plugin:2.7:testResources (default-testResources) @ commons-rdf-rdf4j
---
[INFO] Using 'UTF-8' encoding to copy filtered resources.
[INFO] skip non existing resourceDirectory <https://builds.apache.org/job/incubator-commonsrdf/ws/rdf4j/src/test/resources>
[INFO] Copying 0 resource to META-INF
[INFO] 
[INFO] --- maven-compiler-plugin:3.5.1:testCompile (default-testCompile) @ commons-rdf-rdf4j
---
[INFO] Changes detected - recompiling the module!
[INFO] Compiling 6 source files to <https://builds.apache.org/job/incubator-commonsrdf/ws/rdf4j/target/test-classes>
[INFO] 
[INFO] --- maven-surefire-plugin:2.19.1:test (default-test) @ commons-rdf-rdf4j ---

-------------------------------------------------------
 T E S T S
-------------------------------------------------------
Running org.apache.commons.rdf.rdf4j.MemoryGraphTest
SLF4J: Failed to load class "org.slf4j.impl.StaticLoggerBinder".
SLF4J: Defaulting to no-operation (NOP) logger implementation
SLF4J: See http://www.slf4j.org/codes.html#StaticLoggerBinder for further details.
Tests run: 10, Failures: 0, Errors: 0, Skipped: 0, Time elapsed: 0.445 sec - in org.apache.commons.rdf.rdf4j.MemoryGraphTest
Running org.apache.commons.rdf.rdf4j.Rdf4JRDFTermFactoryTest
Tests run: 24, Failures: 0, Errors: 0, Skipped: 2, Time elapsed: 0.017 sec - in org.apache.commons.rdf.rdf4j.Rdf4JRDFTermFactoryTest
Running org.apache.commons.rdf.rdf4j.GraphTest
Tests run: 10, Failures: 0, Errors: 0, Skipped: 0, Time elapsed: 0.021 sec - in org.apache.commons.rdf.rdf4j.GraphTest
Running org.apache.commons.rdf.rdf4j.MemoryRDFTermFactoryTest
Tests run: 24, Failures: 0, Errors: 0, Skipped: 2, Time elapsed: 0.019 sec - in org.apache.commons.rdf.rdf4j.MemoryRDFTermFactoryTest
Running org.apache.commons.rdf.rdf4j.BlankNodeTest
Tests run: 4, Failures: 0, Errors: 0, Skipped: 0, Time elapsed: 0.001 sec - in org.apache.commons.rdf.rdf4j.BlankNodeTest
Running org.apache.commons.rdf.rdf4j.NativeStoreGraphTest
Shutting down rdf4j repository /tmp/junit283454501208955314/junit5580310736893745453...OK
Shutting down rdf4j repository /tmp/junit1193531735422696200/junit5780465901561557649...OK
Shutting down rdf4j repository /tmp/junit7692767848366605523/junit455771366126408656...OK
Shutting down rdf4j repository /tmp/junit3748662941062872842/junit5344938593788507056...OK
Shutting down rdf4j repository /tmp/junit3586633054446098590/junit8307730000500116110...OK
Shutting down rdf4j repository /tmp/junit1778760843282496328/junit6707158447972272431...OK
Shutting down rdf4j repository /tmp/junit8212339450379762586/junit4523005271386071609...OK
Shutting down rdf4j repository /tmp/junit4853515194163358217/junit649941711669088480...OK
Shutting down rdf4j repository /tmp/junit5243702246593392745/junit3992395920049169392...OK
Shutting down rdf4j repository /tmp/junit1143909786438160533/junit1479630279249244140...OK
Tests run: 10, Failures: 0, Errors: 0, Skipped: 0, Time elapsed: 0.362 sec - in org.apache.commons.rdf.rdf4j.NativeStoreGraphTest

Results :

Tests run: 82, Failures: 0, Errors: 0, Skipped: 4

[JENKINS] Recording test results
[INFO] 
[INFO] --- maven-jar-plugin:3.0.0:jar (default-jar) @ commons-rdf-rdf4j ---
[INFO] Building jar: <https://builds.apache.org/job/incubator-commonsrdf/ws/rdf4j/target/apache-commonsrdf-0.3.0-incubating-SNAPSHOT.jar>
[INFO] 
[INFO] --- maven-javadoc-plugin:2.10.4:jar (attach-javadocs) @ commons-rdf-rdf4j ---
[INFO] 
2 errors
4 warnings
[INFO] ------------------------------------------------------------------------
[INFO] Reactor Summary:
[INFO] 
[INFO] Commons RDF ....................................... SUCCESS [  6.876 s]
[INFO] Commons RDF: API .................................. SUCCESS [ 23.652 s]
[INFO] Commons RDF: Simple Implementation ................ SUCCESS [ 14.609 s]
[INFO] Commons RDF: Integration: RDF4j ................... FAILURE [  9.618 s]
[INFO] Commons RDF: Integration: Apache Jena ............. SKIPPED
[INFO] Commons RDF: Integration: JSON-LD Java ............ SKIPPED
[INFO] ------------------------------------------------------------------------
[INFO] BUILD FAILURE
[INFO] ------------------------------------------------------------------------
[INFO] Total time: 01:00 min
[INFO] Finished at: 2016-10-07T16:18:59+00:00
[INFO] Final Memory: 46M/566M
[INFO] ------------------------------------------------------------------------
[ERROR] Failed to execute goal org.apache.maven.plugins:maven-javadoc-plugin:2.10.4:jar (attach-javadocs)
on project commons-rdf-rdf4j: MavenReportException: Error while generating Javadoc:
[ERROR] Exit code: 1 - javadoc: warning - Error fetching URL: https://docs.oracle.com/javase/8/docs/api
[ERROR] javadoc: warning - Error fetching URL: https://jena.apache.org/documentation/javadoc/jena
[ERROR] javadoc: warning - Error fetching URL: https://jena.apache.org/documentation/javadoc/arq
[ERROR] javadoc: warning - Error fetching URL: http://rdf4j.org/javadoc/2.0
[ERROR] <https://builds.apache.org/job/incubator-commonsrdf/ws/rdf4j/src/main/java/org/apache/commons/rdf/rdf4j/RDF4JTermFactory.java>:228:
error: @param name not found
[ERROR] * @param <T>
[ERROR] ^
[ERROR] <https://builds.apache.org/job/incubator-commonsrdf/ws/rdf4j/src/main/java/org/apache/commons/rdf/rdf4j/RDF4JTermFactory.java>:257:
error: @param name not found
[ERROR] * @param <T>
[ERROR] ^
[ERROR] 
[ERROR] Command line was: /usr/local/jenkins/java/jdk1.8.0/jre/../bin/javadoc @options @packages
[ERROR] 
[ERROR] Refer to the generated Javadoc files in '<https://builds.apache.org/job/incubator-commonsrdf/ws/rdf4j/target/apidocs'>
dir.
[ERROR] -> [Help 1]
[ERROR] 
[ERROR] To see the full stack trace of the errors, re-run Maven with the -e switch.
[ERROR] Re-run Maven using the -X switch to enable full debug logging.
[ERROR] 
[ERROR] For more information about the errors and possible solutions, please read the following
articles:
[ERROR] [Help 1] http://cwiki.apache.org/confluence/display/MAVEN/MojoExecutionException
[ERROR] 
[ERROR] After correcting the problems, you can resume the build with the command
[ERROR]   mvn <goals> -rf :commons-rdf-rdf4j
[JENKINS] Archiving <https://builds.apache.org/job/incubator-commonsrdf/ws/jsonld-java/pom.xml>
to org.apache.commons/commons-rdf-jsonld-java/0.3.0-incubating-SNAPSHOT/commons-rdf-jsonld-java-0.3.0-incubating-SNAPSHOT.pom
[JENKINS] Archiving <https://builds.apache.org/job/incubator-commonsrdf/ws/jena/pom.xml>
to org.apache.commons/commons-rdf-jena/0.3.0-incubating-SNAPSHOT/commons-rdf-jena-0.3.0-incubating-SNAPSHOT.pom
[JENKINS] Archiving <https://builds.apache.org/job/incubator-commonsrdf/ws/simple/pom.xml>
to org.apache.commons/commons-rdf-simple/0.3.0-incubating-SNAPSHOT/commons-rdf-simple-0.3.0-incubating-SNAPSHOT.pom
[JENKINS] Archiving <https://builds.apache.org/job/incubator-commonsrdf/ws/simple/target/apache-commonsrdf-0.3.0-incubating-SNAPSHOT.jar>
to org.apache.commons/commons-rdf-simple/0.3.0-incubating-SNAPSHOT/commons-rdf-simple-0.3.0-incubating-SNAPSHOT.jar
[JENKINS] Archiving <https://builds.apache.org/job/incubator-commonsrdf/ws/simple/target/apache-commonsrdf-0.3.0-incubating-SNAPSHOT-sources.jar>
to org.apache.commons/commons-rdf-simple/0.3.0-incubating-SNAPSHOT/commons-rdf-simple-0.3.0-incubating-SNAPSHOT-sources.jar
[JENKINS] Archiving <https://builds.apache.org/job/incubator-commonsrdf/ws/simple/target/apache-commonsrdf-0.3.0-incubating-SNAPSHOT-test-sources.jar>
to org.apache.commons/commons-rdf-simple/0.3.0-incubating-SNAPSHOT/commons-rdf-simple-0.3.0-incubating-SNAPSHOT-test-sources.jar
[JENKINS] Archiving <https://builds.apache.org/job/incubator-commonsrdf/ws/simple/target/apache-commonsrdf-0.3.0-incubating-SNAPSHOT-javadoc.jar>
to org.apache.commons/commons-rdf-simple/0.3.0-incubating-SNAPSHOT/commons-rdf-simple-0.3.0-incubating-SNAPSHOT-javadoc.jar
[JENKINS] Archiving <https://builds.apache.org/job/incubator-commonsrdf/ws/api/pom.xml>
to org.apache.commons/commons-rdf-api/0.3.0-incubating-SNAPSHOT/commons-rdf-api-0.3.0-incubating-SNAPSHOT.pom
[JENKINS] Archiving <https://builds.apache.org/job/incubator-commonsrdf/ws/api/target/apache-commonsrdf-0.3.0-incubating-SNAPSHOT.jar>
to org.apache.commons/commons-rdf-api/0.3.0-incubating-SNAPSHOT/commons-rdf-api-0.3.0-incubating-SNAPSHOT.jar
[JENKINS] Archiving <https://builds.apache.org/job/incubator-commonsrdf/ws/api/target/apache-commonsrdf-0.3.0-incubating-SNAPSHOT-sources.jar>
to org.apache.commons/commons-rdf-api/0.3.0-incubating-SNAPSHOT/commons-rdf-api-0.3.0-incubating-SNAPSHOT-sources.jar
[JENKINS] Archiving <https://builds.apache.org/job/incubator-commonsrdf/ws/api/target/apache-commonsrdf-0.3.0-incubating-SNAPSHOT-test-sources.jar>
to org.apache.commons/commons-rdf-api/0.3.0-incubating-SNAPSHOT/commons-rdf-api-0.3.0-incubating-SNAPSHOT-test-sources.jar
[JENKINS] Archiving <https://builds.apache.org/job/incubator-commonsrdf/ws/api/target/apache-commonsrdf-0.3.0-incubating-SNAPSHOT-tests.jar>
to org.apache.commons/commons-rdf-api/0.3.0-incubating-SNAPSHOT/commons-rdf-api-0.3.0-incubating-SNAPSHOT-tests.jar
[JENKINS] Archiving <https://builds.apache.org/job/incubator-commonsrdf/ws/api/target/apache-commonsrdf-0.3.0-incubating-SNAPSHOT-javadoc.jar>
to org.apache.commons/commons-rdf-api/0.3.0-incubating-SNAPSHOT/commons-rdf-api-0.3.0-incubating-SNAPSHOT-javadoc.jar
[JENKINS] Archiving <https://builds.apache.org/job/incubator-commonsrdf/ws/pom.xml>
to org.apache.commons/commons-rdf-parent/0.3.0-incubating-SNAPSHOT/commons-rdf-parent-0.3.0-incubating-SNAPSHOT.pom
[JENKINS] Archiving <https://builds.apache.org/job/incubator-commonsrdf/ws/target/commons-rdf-parent-0.3.0-incubating-SNAPSHOT-site.xml>
to org.apache.commons/commons-rdf-parent/0.3.0-incubating-SNAPSHOT/commons-rdf-parent-0.3.0-incubating-SNAPSHOT-site.xml
[JENKINS] Archiving <https://builds.apache.org/job/incubator-commonsrdf/ws/rdf4j/pom.xml>
to org.apache.commons/commons-rdf-rdf4j/0.3.0-incubating-SNAPSHOT/commons-rdf-rdf4j-0.3.0-incubating-SNAPSHOT.pom
[JENKINS] Archiving <https://builds.apache.org/job/incubator-commonsrdf/ws/rdf4j/target/apache-commonsrdf-0.3.0-incubating-SNAPSHOT.jar>
to org.apache.commons/commons-rdf-rdf4j/0.3.0-incubating-SNAPSHOT/commons-rdf-rdf4j-0.3.0-incubating-SNAPSHOT.jar
channel stopped

Mime
View raw message