commonsrdf-commits mailing list archives

Site index · List index
Message view « Date » · « Thread »
Top « Date » · « Thread »
From Apache Jenkins Server <jenk...@builds.apache.org>
Subject Build failed in Jenkins: incubator-commonsrdf #91
Date Fri, 06 May 2016 02:11:16 GMT
See <https://builds.apache.org/job/incubator-commonsrdf/91/changes>

Changes:

[lewis.mcgibbney] Add SNAPSHOT prepping for new 0.2.0-incubating release

------------------------------------------
Started by an SCM change
[EnvInject] - Loading node environment variables.
Building remotely on ubuntu-5 (docker Ubuntu ubuntu5 ubuntu yahoo-not-h2) in workspace <https://builds.apache.org/job/incubator-commonsrdf/ws/>
 > git rev-parse --is-inside-work-tree # timeout=10
Fetching changes from the remote Git repository
 > git config remote.origin.url https://git-wip-us.apache.org/repos/asf/incubator-commonsrdf.git
# timeout=10
Fetching upstream changes from https://git-wip-us.apache.org/repos/asf/incubator-commonsrdf.git
 > git --version # timeout=10
 > git -c core.askpass=true fetch --tags --progress https://git-wip-us.apache.org/repos/asf/incubator-commonsrdf.git
+refs/heads/*:refs/remotes/origin/*
 > git rev-parse refs/remotes/origin/master^{commit} # timeout=10
 > git rev-parse refs/remotes/origin/origin/master^{commit} # timeout=10
Checking out Revision 1fdd553c470f1a1b87034643f5a0f2bd5883697f (refs/remotes/origin/master)
 > git config core.sparsecheckout # timeout=10
 > git checkout -f 1fdd553c470f1a1b87034643f5a0f2bd5883697f
 > git rev-list 20905e646df81e26e598fad613ccda67fd350a9d # timeout=10
Parsing POMs
Downloaded artifact http://repo.maven.apache.org/maven2/org/apache/commons/commons-parent/40/commons-parent-40.pom
Downloaded artifact http://repo.maven.apache.org/maven2/org/apache/apache/17/apache-17.pom
Failed to transfer Could not find artifact org.apache.commons:commons-rdf-parent:pom:0.3.0-incubating
in central (http://repo.maven.apache.org/maven2)
ERROR: Failed to parse POMs
java.io.IOException: remote file operation failed: <https://builds.apache.org/job/incubator-commonsrdf/ws/>
at hudson.remoting.Channel@50a1a698:ubuntu-5: hudson.remoting.ProxyException: hudson.maven.MavenModuleSetBuild$MavenExecutionException:
org.apache.maven.project.ProjectBuildingException: Some problems were encountered while processing
the POMs:
[FATAL] Non-resolvable parent POM: Could not find artifact org.apache.commons:commons-rdf-parent:pom:0.3.0-incubating
in central (http://repo.maven.apache.org/maven2) and 'parent.relativePath' points at wrong
local POM @ line 24, column 13
[FATAL] Non-resolvable parent POM: Failure to find org.apache.commons:commons-rdf-parent:pom:0.3.0-incubating
in http://repo.maven.apache.org/maven2 was cached in the local repository, resolution will
not be reattempted until the update interval of central has elapsed or updates are forced
and 'parent.relativePath' points at wrong local POM @ line 24, column 13

	at hudson.FilePath.act(FilePath.java:986)
	at hudson.FilePath.act(FilePath.java:968)
	at hudson.maven.MavenModuleSetBuild$MavenModuleSetBuildExecution.parsePoms(MavenModuleSetBuild.java:960)
	at hudson.maven.MavenModuleSetBuild$MavenModuleSetBuildExecution.doRun(MavenModuleSetBuild.java:679)
	at hudson.model.AbstractBuild$AbstractBuildExecution.run(AbstractBuild.java:534)
	at hudson.model.Run.execute(Run.java:1738)
	at hudson.maven.MavenModuleSetBuild.run(MavenModuleSetBuild.java:531)
	at hudson.model.ResourceController.execute(ResourceController.java:98)
	at hudson.model.Executor.run(Executor.java:410)
Caused by: hudson.remoting.ProxyException: hudson.maven.MavenModuleSetBuild$MavenExecutionException:
org.apache.maven.project.ProjectBuildingException: Some problems were encountered while processing
the POMs:
[FATAL] Non-resolvable parent POM: Could not find artifact org.apache.commons:commons-rdf-parent:pom:0.3.0-incubating
in central (http://repo.maven.apache.org/maven2) and 'parent.relativePath' points at wrong
local POM @ line 24, column 13
[FATAL] Non-resolvable parent POM: Failure to find org.apache.commons:commons-rdf-parent:pom:0.3.0-incubating
in http://repo.maven.apache.org/maven2 was cached in the local repository, resolution will
not be reattempted until the update interval of central has elapsed or updates are forced
and 'parent.relativePath' points at wrong local POM @ line 24, column 13

	at hudson.maven.MavenModuleSetBuild$PomParser.invoke(MavenModuleSetBuild.java:1364)
	at hudson.maven.MavenModuleSetBuild$PomParser.invoke(MavenModuleSetBuild.java:1098)
	at hudson.FilePath$FileCallableWrapper.call(FilePath.java:2719)
	at hudson.remoting.UserRequest.perform(UserRequest.java:120)
	at hudson.remoting.UserRequest.perform(UserRequest.java:48)
	at hudson.remoting.Request$2.run(Request.java:326)
	at hudson.remoting.InterceptingExecutorService$1.call(InterceptingExecutorService.java:68)
	at java.util.concurrent.FutureTask.run(FutureTask.java:262)
	at java.util.concurrent.ThreadPoolExecutor.runWorker(ThreadPoolExecutor.java:1145)
	at java.util.concurrent.ThreadPoolExecutor$Worker.run(ThreadPoolExecutor.java:615)
	at java.lang.Thread.run(Thread.java:745)
	at ......remote call to ubuntu-5(Native Method)
	at hudson.remoting.Channel.attachCallSiteStackTrace(Channel.java:1416)
	at hudson.remoting.UserResponse.retrieve(UserRequest.java:220)
	at hudson.remoting.Channel.call(Channel.java:781)
	at hudson.FilePath.act(FilePath.java:979)
	... 8 more
Caused by: hudson.remoting.ProxyException: org.apache.maven.project.ProjectBuildingException:
Some problems were encountered while processing the POMs:
[FATAL] Non-resolvable parent POM: Could not find artifact org.apache.commons:commons-rdf-parent:pom:0.3.0-incubating
in central (http://repo.maven.apache.org/maven2) and 'parent.relativePath' points at wrong
local POM @ line 24, column 13
[FATAL] Non-resolvable parent POM: Failure to find org.apache.commons:commons-rdf-parent:pom:0.3.0-incubating
in http://repo.maven.apache.org/maven2 was cached in the local repository, resolution will
not be reattempted until the update interval of central has elapsed or updates are forced
and 'parent.relativePath' points at wrong local POM @ line 24, column 13

	at org.apache.maven.project.DefaultProjectBuilder.build(DefaultProjectBuilder.java:364)
	at hudson.maven.MavenEmbedder.buildProjects(MavenEmbedder.java:361)
	at hudson.maven.MavenEmbedder.readProjects(MavenEmbedder.java:331)
	at hudson.maven.MavenModuleSetBuild$PomParser.invoke(MavenModuleSetBuild.java:1301)
	at hudson.maven.MavenModuleSetBuild$PomParser.invoke(MavenModuleSetBuild.java:1098)
	at hudson.FilePath$FileCallableWrapper.call(FilePath.java:2719)
	at hudson.remoting.UserRequest.perform(UserRequest.java:120)
	at hudson.remoting.UserRequest.perform(UserRequest.java:48)
	at hudson.remoting.Request$2.run(Request.java:326)
	at hudson.remoting.InterceptingExecutorService$1.call(InterceptingExecutorService.java:68)
	at java.util.concurrent.FutureTask.run(FutureTask.java:262)
	at java.util.concurrent.ThreadPoolExecutor.runWorker(ThreadPoolExecutor.java:1145)
	at java.util.concurrent.ThreadPoolExecutor$Worker.run(ThreadPoolExecutor.java:615)
	at java.lang.Thread.run(Thread.java:745)

Mime
View raw message