commonsrdf-commits mailing list archives

Site index · List index
Message view « Date » · « Thread »
Top « Date » · « Thread »
From Apache Jenkins Server <jenk...@builds.apache.org>
Subject Build failed in Jenkins: incubator-commonsrdf #89
Date Thu, 28 Apr 2016 23:47:10 GMT
See <https://builds.apache.org/job/incubator-commonsrdf/89/changes>

Changes:

[lewis.mcgibbney] Set new development version to 0.3.0-incubating

------------------------------------------
[...truncated 1912 lines...]
[INFO] 
[INFO] >>> maven-source-plugin:2.4:test-jar (default) @ commons-rdf-api >>>
[INFO] 
[INFO] --- maven-enforcer-plugin:1.3.1:enforce (enforce-maven-3) @ commons-rdf-api ---
[INFO] 
[INFO] --- build-helper-maven-plugin:1.9.1:parse-version (parse-version) @ commons-rdf-api
---
[INFO] 
[INFO] --- jacoco-maven-plugin:0.7.2.201409121644:prepare-agent (prepare-agent) @ commons-rdf-api
---
[INFO] argLine set to -javaagent:<https://builds.apache.org/job/incubator-commonsrdf/ws/.repository/org/jacoco/org.jacoco.agent/0.7.2.201409121644/org.jacoco.agent-0.7.2.201409121644-runtime.jar=destfile=/home/jenkins/jenkins-slave/workspace/incubator-commonsrdf/api/target/jacoco.exec>
[INFO] 
[INFO] --- maven-antrun-plugin:1.8:run (javadoc.resources) @ commons-rdf-api ---
[INFO] Executing tasks

main:
[INFO] Executed tasks
[WARNING] Failed to getClass for org.apache.maven.plugin.source.TestSourceJarMojo
[INFO] 
[INFO] <<< maven-source-plugin:2.4:test-jar (default) @ commons-rdf-api <<<
[INFO] 
[INFO] --- maven-source-plugin:2.4:test-jar (default) @ commons-rdf-api ---
[INFO] Building jar: <https://builds.apache.org/job/incubator-commonsrdf/ws/api/target/commons-rdf-api-0.3.0-incubating-test-sources.jar>
[INFO] 
[INFO] --- maven-javadoc-plugin:2.10.3:jar (attach-javadocs) @ commons-rdf-api ---
[INFO] 
2 warnings
[WARNING] Javadoc Warnings
[WARNING] javadoc: warning - Error fetching URL: http://docs.oracle.com/javase/8/docs/api
[WARNING] javadoc: warning - Error fetching URL: http://docs.oracle.com/javaee/6/api
[INFO] Building jar: <https://builds.apache.org/job/incubator-commonsrdf/ws/api/target/commons-rdf-api-0.3.0-incubating-javadoc.jar>
[INFO] 
[INFO] --- maven-jar-plugin:2.6:jar (jar-and-test-jar) @ commons-rdf-api ---
[INFO] 
[INFO] --- maven-jar-plugin:2.6:test-jar (jar-and-test-jar) @ commons-rdf-api ---
[INFO] Building jar: <https://builds.apache.org/job/incubator-commonsrdf/ws/api/target/commons-rdf-api-0.3.0-incubating-tests.jar>
[INFO]                                                                         
[INFO] ------------------------------------------------------------------------
[INFO] Building Commons RDF: Simple Implementation 0.3.0-incubating
[INFO] ------------------------------------------------------------------------
[INFO] 
[INFO] --- maven-clean-plugin:2.6.1:clean (default-clean) @ commons-rdf-simple ---
[INFO] 
[INFO] --- maven-enforcer-plugin:1.3.1:enforce (enforce-maven-3) @ commons-rdf-simple ---
[INFO] 
[INFO] --- build-helper-maven-plugin:1.9.1:parse-version (parse-version) @ commons-rdf-simple
---
[INFO] 
[INFO] --- jacoco-maven-plugin:0.7.2.201409121644:prepare-agent (prepare-agent) @ commons-rdf-simple
---
[INFO] argLine set to -javaagent:<https://builds.apache.org/job/incubator-commonsrdf/ws/.repository/org/jacoco/org.jacoco.agent/0.7.2.201409121644/org.jacoco.agent-0.7.2.201409121644-runtime.jar=destfile=/home/jenkins/jenkins-slave/workspace/incubator-commonsrdf/simple/target/jacoco.exec>
[INFO] 
[INFO] --- maven-antrun-plugin:1.8:run (javadoc.resources) @ commons-rdf-simple ---
[INFO] Executing tasks

main:
[INFO] Executed tasks
[INFO] 
[INFO] --- maven-remote-resources-plugin:1.5:process (default) @ commons-rdf-simple ---
[INFO] 
[INFO] --- buildnumber-maven-plugin:1.3:create (default) @ commons-rdf-simple ---
[INFO] Executing: /bin/sh -c cd <https://builds.apache.org/job/incubator-commonsrdf/ws/simple>
&& git rev-parse --verify HEAD
[INFO] Working directory: <https://builds.apache.org/job/incubator-commonsrdf/ws/simple>
[INFO] Storing buildNumber: null at timestamp: 1461887224829
[WARNING] Cannot get the branch information from the git repository: 
Detecting the current branch failed: fatal: ref HEAD is not a symbolic ref

[INFO] Executing: /bin/sh -c cd <https://builds.apache.org/job/incubator-commonsrdf/ws/simple>
&& git rev-parse --verify HEAD
[INFO] Working directory: <https://builds.apache.org/job/incubator-commonsrdf/ws/simple>
[INFO] Storing buildScmBranch: UNKNOWN
[INFO] 
[INFO] --- maven-resources-plugin:2.7:resources (default-resources) @ commons-rdf-simple ---
[INFO] Using 'UTF-8' encoding to copy filtered resources.
[INFO] Copying 3 resources
[INFO] Copying 0 resource to META-INF
[INFO] 
[INFO] --- maven-compiler-plugin:3.3:compile (default-compile) @ commons-rdf-simple ---
[INFO] Changes detected - recompiling the module!
[INFO] Compiling 8 source files to <https://builds.apache.org/job/incubator-commonsrdf/ws/simple/target/classes>
[INFO] 
[INFO] --- maven-bundle-plugin:2.5.3:manifest (bundle-manifest) @ commons-rdf-simple ---
[INFO] 
[INFO] --- animal-sniffer-maven-plugin:1.14:check (checkAPIcompatibility) @ commons-rdf-simple
---
[INFO] Signature checking is skipped.
[INFO] 
[INFO] --- maven-resources-plugin:2.7:testResources (default-testResources) @ commons-rdf-simple
---
[INFO] Using 'UTF-8' encoding to copy filtered resources.
[INFO] skip non existing resourceDirectory <https://builds.apache.org/job/incubator-commonsrdf/ws/simple/src/test/resources>
[INFO] Copying 0 resource to META-INF
[INFO] 
[INFO] --- maven-compiler-plugin:3.3:testCompile (default-testCompile) @ commons-rdf-simple
---
[INFO] Changes detected - recompiling the module!
[INFO] Compiling 8 source files to <https://builds.apache.org/job/incubator-commonsrdf/ws/simple/target/test-classes>
[INFO] 
[INFO] --- maven-surefire-plugin:2.18.1:test (default-test) @ commons-rdf-simple ---
[INFO] Surefire report directory: <https://builds.apache.org/job/incubator-commonsrdf/ws/simple/target/surefire-reports>

-------------------------------------------------------
 T E S T S
-------------------------------------------------------
Running org.apache.commons.rdf.simple.TestWritingGraph
Tests run: 5, Failures: 0, Errors: 0, Skipped: 0, Time elapsed: 2.488 sec - in org.apache.commons.rdf.simple.TestWritingGraph
Running org.apache.commons.rdf.simple.BlankNodeImplTest
Tests run: 4, Failures: 0, Errors: 0, Skipped: 0, Time elapsed: 0.009 sec - in org.apache.commons.rdf.simple.BlankNodeImplTest
Running org.apache.commons.rdf.simple.DefaultGraphTest
Tests run: 10, Failures: 0, Errors: 0, Skipped: 7, Time elapsed: 0.047 sec - in org.apache.commons.rdf.simple.DefaultGraphTest
Running org.apache.commons.rdf.simple.SimpleNoRelativeIRIRDFTermFactoryTest
Tests run: 24, Failures: 0, Errors: 0, Skipped: 1, Time elapsed: 0.019 sec - in org.apache.commons.rdf.simple.SimpleNoRelativeIRIRDFTermFactoryTest
Running org.apache.commons.rdf.simple.TypesTest
Tests run: 3, Failures: 0, Errors: 0, Skipped: 0, Time elapsed: 0.002 sec - in org.apache.commons.rdf.simple.TypesTest
Running org.apache.commons.rdf.simple.SimpleRDFTermFactoryLookupTest
Tests run: 1, Failures: 0, Errors: 0, Skipped: 0, Time elapsed: 0.004 sec - in org.apache.commons.rdf.simple.SimpleRDFTermFactoryLookupTest
Running org.apache.commons.rdf.simple.SimpleRDFTermFactoryTest
Tests run: 24, Failures: 0, Errors: 0, Skipped: 0, Time elapsed: 0.011 sec - in org.apache.commons.rdf.simple.SimpleRDFTermFactoryTest
Running org.apache.commons.rdf.simple.SimpleGraphTest
<http://example.com/alice> <http://xmlns.com/foaf/0.1/knows> <http://example.com/bob>
.
<http://example.com/alice> <http://xmlns.com/foaf/0.1/member> _:17468fd1-c0e8-3113-9980-27e8ab1536da
.
_:25900a6c-8464-3022-bbd2-2acd8c55a8a2 <http://xmlns.com/foaf/0.1/name> "A company"
.
_:17468fd1-c0e8-3113-9980-27e8ab1536da <http://xmlns.com/foaf/0.1/name> "The Secret
Club" .
<http://example.com/bob> <http://xmlns.com/foaf/0.1/member> _:25900a6c-8464-3022-bbd2-2acd8c55a8a2
.
<http://example.com/bob> <http://xmlns.com/foaf/0.1/name> "Bob"@en-us .
<http://example.com/alice> <http://xmlns.com/foaf/0.1/name> "Alice" .
<http://example.com/bob> <http://xmlns.com/foaf/0.1/member> _:17468fd1-c0e8-3113-9980-27e8ab1536da
.
Tests run: 11, Failures: 0, Errors: 0, Skipped: 0, Time elapsed: 0.028 sec - in org.apache.commons.rdf.simple.SimpleGraphTest

Results :

Tests run: 82, Failures: 0, Errors: 0, Skipped: 8

[JENKINS] Recording test results
[INFO] 
[INFO] --- maven-jar-plugin:2.6:jar (default-jar) @ commons-rdf-simple ---
[INFO] Building jar: <https://builds.apache.org/job/incubator-commonsrdf/ws/simple/target/commons-rdf-simple-0.3.0-incubating.jar>
[INFO] 
[INFO] --- maven-site-plugin:3.4:attach-descriptor (attach-descriptor) @ commons-rdf-simple
---
[INFO] 
[INFO] >>> maven-source-plugin:2.4:jar (default) @ commons-rdf-simple >>>
[INFO] 
[INFO] --- maven-enforcer-plugin:1.3.1:enforce (enforce-maven-3) @ commons-rdf-simple ---
[INFO] 
[INFO] --- build-helper-maven-plugin:1.9.1:parse-version (parse-version) @ commons-rdf-simple
---
[INFO] 
[INFO] --- jacoco-maven-plugin:0.7.2.201409121644:prepare-agent (prepare-agent) @ commons-rdf-simple
---
[INFO] argLine set to -javaagent:<https://builds.apache.org/job/incubator-commonsrdf/ws/.repository/org/jacoco/org.jacoco.agent/0.7.2.201409121644/org.jacoco.agent-0.7.2.201409121644-runtime.jar=destfile=/home/jenkins/jenkins-slave/workspace/incubator-commonsrdf/simple/target/jacoco.exec>
[INFO] 
[INFO] --- maven-antrun-plugin:1.8:run (javadoc.resources) @ commons-rdf-simple ---
[INFO] Executing tasks

main:
[INFO] Executed tasks
[WARNING] Failed to getClass for org.apache.maven.plugin.source.SourceJarMojo
[INFO] 
[INFO] <<< maven-source-plugin:2.4:jar (default) @ commons-rdf-simple <<<
[INFO] 
[INFO] --- maven-source-plugin:2.4:jar (default) @ commons-rdf-simple ---
[INFO] Building jar: <https://builds.apache.org/job/incubator-commonsrdf/ws/simple/target/commons-rdf-simple-0.3.0-incubating-sources.jar>
[INFO] 
[INFO] >>> maven-source-plugin:2.4:test-jar (default) @ commons-rdf-simple >>>
[INFO] 
[INFO] --- maven-enforcer-plugin:1.3.1:enforce (enforce-maven-3) @ commons-rdf-simple ---
[INFO] 
[INFO] --- build-helper-maven-plugin:1.9.1:parse-version (parse-version) @ commons-rdf-simple
---
[INFO] 
[INFO] --- jacoco-maven-plugin:0.7.2.201409121644:prepare-agent (prepare-agent) @ commons-rdf-simple
---
[INFO] argLine set to -javaagent:<https://builds.apache.org/job/incubator-commonsrdf/ws/.repository/org/jacoco/org.jacoco.agent/0.7.2.201409121644/org.jacoco.agent-0.7.2.201409121644-runtime.jar=destfile=/home/jenkins/jenkins-slave/workspace/incubator-commonsrdf/simple/target/jacoco.exec>
[INFO] 
[INFO] --- maven-antrun-plugin:1.8:run (javadoc.resources) @ commons-rdf-simple ---
[INFO] Executing tasks

main:
[INFO] Executed tasks
[WARNING] Failed to getClass for org.apache.maven.plugin.source.TestSourceJarMojo
[INFO] 
[INFO] <<< maven-source-plugin:2.4:test-jar (default) @ commons-rdf-simple <<<
[INFO] 
[INFO] --- maven-source-plugin:2.4:test-jar (default) @ commons-rdf-simple ---
[INFO] Building jar: <https://builds.apache.org/job/incubator-commonsrdf/ws/simple/target/commons-rdf-simple-0.3.0-incubating-test-sources.jar>
[INFO] 
[INFO] --- maven-javadoc-plugin:2.10.3:jar (attach-javadocs) @ commons-rdf-simple ---
[INFO] 
2 warnings
[WARNING] Javadoc Warnings
[WARNING] javadoc: warning - Error fetching URL: http://docs.oracle.com/javase/8/docs/api
[WARNING] javadoc: warning - Error fetching URL: http://docs.oracle.com/javaee/6/api
[INFO] Building jar: <https://builds.apache.org/job/incubator-commonsrdf/ws/simple/target/commons-rdf-simple-0.3.0-incubating-javadoc.jar>
[INFO] ------------------------------------------------------------------------
[INFO] Reactor Summary:
[INFO] 
[INFO] Commons RDF ....................................... SUCCESS [01:41 min]
[INFO] Commons RDF: API .................................. SUCCESS [ 19.896 s]
[INFO] Commons RDF: Simple Implementation ................ SUCCESS [  8.673 s]
[INFO] ------------------------------------------------------------------------
[INFO] BUILD SUCCESS
[INFO] ------------------------------------------------------------------------
[INFO] Total time: 02:12 min
[INFO] Finished at: 2016-04-28T23:47:14+00:00
[INFO] Final Memory: 37M/334M
[INFO] ------------------------------------------------------------------------
[JENKINS] Archiving <https://builds.apache.org/job/incubator-commonsrdf/ws/simple/pom.xml>
to org.apache.commons/commons-rdf-simple/0.3.0-incubating/commons-rdf-simple-0.3.0-incubating.pom
[JENKINS] Archiving <https://builds.apache.org/job/incubator-commonsrdf/ws/simple/target/commons-rdf-simple-0.3.0-incubating.jar>
to org.apache.commons/commons-rdf-simple/0.3.0-incubating/commons-rdf-simple-0.3.0-incubating.jar
[JENKINS] Archiving <https://builds.apache.org/job/incubator-commonsrdf/ws/simple/target/commons-rdf-simple-0.3.0-incubating-sources.jar>
to org.apache.commons/commons-rdf-simple/0.3.0-incubating/commons-rdf-simple-0.3.0-incubating-sources.jar
[JENKINS] Archiving <https://builds.apache.org/job/incubator-commonsrdf/ws/simple/target/commons-rdf-simple-0.3.0-incubating-test-sources.jar>
to org.apache.commons/commons-rdf-simple/0.3.0-incubating/commons-rdf-simple-0.3.0-incubating-test-sources.jar
[JENKINS] Archiving <https://builds.apache.org/job/incubator-commonsrdf/ws/simple/target/commons-rdf-simple-0.3.0-incubating-javadoc.jar>
to org.apache.commons/commons-rdf-simple/0.3.0-incubating/commons-rdf-simple-0.3.0-incubating-javadoc.jar
[JENKINS] Archiving <https://builds.apache.org/job/incubator-commonsrdf/ws/api/pom.xml>
to org.apache.commons/commons-rdf-api/0.3.0-incubating/commons-rdf-api-0.3.0-incubating.pom
[JENKINS] Archiving <https://builds.apache.org/job/incubator-commonsrdf/ws/api/target/commons-rdf-api-0.3.0-incubating.jar>
to org.apache.commons/commons-rdf-api/0.3.0-incubating/commons-rdf-api-0.3.0-incubating.jar
[JENKINS] Archiving <https://builds.apache.org/job/incubator-commonsrdf/ws/api/target/commons-rdf-api-0.3.0-incubating-sources.jar>
to org.apache.commons/commons-rdf-api/0.3.0-incubating/commons-rdf-api-0.3.0-incubating-sources.jar
[JENKINS] Archiving <https://builds.apache.org/job/incubator-commonsrdf/ws/api/target/commons-rdf-api-0.3.0-incubating-test-sources.jar>
to org.apache.commons/commons-rdf-api/0.3.0-incubating/commons-rdf-api-0.3.0-incubating-test-sources.jar
[JENKINS] Archiving <https://builds.apache.org/job/incubator-commonsrdf/ws/api/target/commons-rdf-api-0.3.0-incubating-javadoc.jar>
to org.apache.commons/commons-rdf-api/0.3.0-incubating/commons-rdf-api-0.3.0-incubating-javadoc.jar
[JENKINS] Archiving <https://builds.apache.org/job/incubator-commonsrdf/ws/api/target/commons-rdf-api-0.3.0-incubating-tests.jar>
to org.apache.commons/commons-rdf-api/0.3.0-incubating/commons-rdf-api-0.3.0-incubating-tests.jar
[JENKINS] Archiving <https://builds.apache.org/job/incubator-commonsrdf/ws/pom.xml>
to org.apache.commons/commons-rdf-parent/0.3.0-incubating/commons-rdf-parent-0.3.0-incubating.pom
[JENKINS] Archiving <https://builds.apache.org/job/incubator-commonsrdf/ws/target/commons-rdf-parent-0.3.0-incubating-site.xml>
to org.apache.commons/commons-rdf-parent/0.3.0-incubating/commons-rdf-parent-0.3.0-incubating-site.xml
channel stopped
Maven RedeployPublisher use remote ubuntu-1 maven settings from : /home/jenkins/.m2/settings.xml
[INFO] Deployment in https://repository.apache.org/service/local/staging/deploy/maven2 (id=apache.releases.https,uniqueVersion=true)
Deploying the main artifact commons-rdf-api-0.3.0-incubating.jar
Uploading: https://repository.apache.org/service/local/staging/deploy/maven2/org/apache/commons/commons-rdf-api/0.3.0-incubating/commons-rdf-api-0.3.0-incubating.jar
Uploading: https://repository.apache.org/service/local/staging/deploy/maven2/org/apache/commons/commons-rdf-api/0.3.0-incubating/commons-rdf-api-0.3.0-incubating.pom
ERROR: Failed to deploy artifacts: Could not transfer artifact org.apache.commons:commons-rdf-api:jar:0.3.0-incubating
from/to apache.releases.https (https://repository.apache.org/service/local/staging/deploy/maven2):
Failed to transfer file: https://repository.apache.org/service/local/staging/deploy/maven2/org/apache/commons/commons-rdf-api/0.3.0-incubating/commons-rdf-api-0.3.0-incubating.jar.
Return code is: 401, ReasonPhrase: Unauthorized.
org.apache.maven.artifact.deployer.ArtifactDeploymentException: Failed to deploy artifacts:
Could not transfer artifact org.apache.commons:commons-rdf-api:jar:0.3.0-incubating from/to
apache.releases.https (https://repository.apache.org/service/local/staging/deploy/maven2):
Failed to transfer file: https://repository.apache.org/service/local/staging/deploy/maven2/org/apache/commons/commons-rdf-api/0.3.0-incubating/commons-rdf-api-0.3.0-incubating.jar.
Return code is: 401, ReasonPhrase: Unauthorized.
	at org.apache.maven.artifact.deployer.DefaultArtifactDeployer.deploy(DefaultArtifactDeployer.java:143)
	at hudson.maven.reporters.MavenArtifactRecord.deploy(MavenArtifactRecord.java:193)
	at hudson.maven.RedeployPublisher.perform(RedeployPublisher.java:176)
	at hudson.tasks.BuildStepMonitor$1.perform(BuildStepMonitor.java:20)
	at hudson.model.AbstractBuild$AbstractBuildExecution.perform(AbstractBuild.java:782)
	at hudson.model.AbstractBuild$AbstractBuildExecution.performAllBuildSteps(AbstractBuild.java:723)
	at hudson.maven.MavenModuleSetBuild$MavenModuleSetBuildExecution.post2(MavenModuleSetBuild.java:1047)
	at hudson.model.AbstractBuild$AbstractBuildExecution.post(AbstractBuild.java:668)
	at hudson.model.Run.execute(Run.java:1763)
	at hudson.maven.MavenModuleSetBuild.run(MavenModuleSetBuild.java:531)
	at hudson.model.ResourceController.execute(ResourceController.java:98)
	at hudson.model.Executor.run(Executor.java:410)
Caused by: org.eclipse.aether.deployment.DeploymentException: Failed to deploy artifacts:
Could not transfer artifact org.apache.commons:commons-rdf-api:jar:0.3.0-incubating from/to
apache.releases.https (https://repository.apache.org/service/local/staging/deploy/maven2):
Failed to transfer file: https://repository.apache.org/service/local/staging/deploy/maven2/org/apache/commons/commons-rdf-api/0.3.0-incubating/commons-rdf-api-0.3.0-incubating.jar.
Return code is: 401, ReasonPhrase: Unauthorized.
	at org.eclipse.aether.internal.impl.DefaultDeployer.deploy(DefaultDeployer.java:341)
	at org.eclipse.aether.internal.impl.DefaultDeployer.deploy(DefaultDeployer.java:269)
	at org.eclipse.aether.internal.impl.DefaultRepositorySystem.deploy(DefaultRepositorySystem.java:413)
	at org.apache.maven.artifact.deployer.DefaultArtifactDeployer.deploy(DefaultArtifactDeployer.java:139)
	... 11 more
Caused by: org.eclipse.aether.transfer.ArtifactTransferException: Could not transfer artifact
org.apache.commons:commons-rdf-api:jar:0.3.0-incubating from/to apache.releases.https (https://repository.apache.org/service/local/staging/deploy/maven2):
Failed to transfer file: https://repository.apache.org/service/local/staging/deploy/maven2/org/apache/commons/commons-rdf-api/0.3.0-incubating/commons-rdf-api-0.3.0-incubating.jar.
Return code is: 401, ReasonPhrase: Unauthorized.
	at org.eclipse.aether.connector.wagon.WagonRepositoryConnector$6.wrap(WagonRepositoryConnector.java:1016)
	at org.eclipse.aether.connector.wagon.WagonRepositoryConnector$6.wrap(WagonRepositoryConnector.java:1004)
	at org.eclipse.aether.connector.wagon.WagonRepositoryConnector$PutTask.run(WagonRepositoryConnector.java:895)
	at org.eclipse.aether.connector.wagon.WagonRepositoryConnector.put(WagonRepositoryConnector.java:522)
	at org.eclipse.aether.internal.impl.DefaultDeployer.deploy(DefaultDeployer.java:335)
	... 14 more
Caused by: org.apache.maven.wagon.TransferFailedException: Failed to transfer file: https://repository.apache.org/service/local/staging/deploy/maven2/org/apache/commons/commons-rdf-api/0.3.0-incubating/commons-rdf-api-0.3.0-incubating.jar.
Return code is: 401, ReasonPhrase: Unauthorized.
	at org.apache.maven.wagon.shared.http4.AbstractHttpClientWagon.put(AbstractHttpClientWagon.java:626)
	at org.apache.maven.wagon.shared.http4.AbstractHttpClientWagon.put(AbstractHttpClientWagon.java:524)
	at org.apache.maven.wagon.shared.http4.AbstractHttpClientWagon.put(AbstractHttpClientWagon.java:505)
	at org.apache.maven.wagon.shared.http4.AbstractHttpClientWagon.put(AbstractHttpClientWagon.java:485)
	at org.eclipse.aether.connector.wagon.WagonRepositoryConnector$PutTask.run(WagonRepositoryConnector.java:871)
	... 16 more
[INFO] Deployment failed after 0.92 sec
Build step 'Deploy artifacts to Maven repository' changed build result to FAILURE

Mime
View raw message