commonsrdf-commits mailing list archives

Site index · List index
Message view « Date » · « Thread »
Top « Date » · « Thread »
From Apache Jenkins Server <jenk...@builds.apache.org>
Subject Build failed in Jenkins: incubator-commonsrdf #45
Date Wed, 06 May 2015 08:54:26 GMT
See <https://builds.apache.org/job/incubator-commonsrdf/45/changes>

Changes:

[wikier] last details towards our first release

------------------------------------------
Started by an SCM change
Started by an SCM change
Started by an SCM change
Building remotely on H3 (Mapreduce Hadoop Zookeeper Hdfs) in workspace <https://builds.apache.org/job/incubator-commonsrdf/ws/>
 > git rev-parse --is-inside-work-tree # timeout=10
Fetching changes from the remote Git repository
 > git config remote.origin.url https://git-wip-us.apache.org/repos/asf/incubator-commonsrdf.git
# timeout=10
Fetching upstream changes from https://git-wip-us.apache.org/repos/asf/incubator-commonsrdf.git
 > git --version # timeout=10
 > git fetch --tags --progress https://git-wip-us.apache.org/repos/asf/incubator-commonsrdf.git
+refs/heads/*:refs/remotes/origin/*
 > git rev-parse refs/remotes/origin/master^{commit} # timeout=10
 > git rev-parse refs/remotes/origin/origin/master^{commit} # timeout=10
Checking out Revision 51e7bdd653bb45589cd852e0d03a0c0979ca93ae (refs/remotes/origin/master)
 > git config core.sparsecheckout # timeout=10
 > git checkout -f 51e7bdd653bb45589cd852e0d03a0c0979ca93ae
 > git rev-list 7a0de10a11430f63f42202be71c82bdd75985445 # timeout=10
Parsing POMs
Modules changed, recalculating dependency graph
maven31-agent.jar already up to date
maven31-interceptor.jar already up to date
maven3-interceptor-commons.jar already up to date
[incubator-commonsrdf] $ /home/jenkins/tools/java/jdk1.8.0/bin/java -Xmx2g -Xms256m -XX:MaxPermSize=512m
-cp /home/jenkins/jenkins-slave/maven31-agent.jar:/home/jenkins/jenkins-slave/tools/hudson.tasks.Maven_MavenInstallation/maven-3.2.1/boot/plexus-classworlds-2.5.1.jar:/home/jenkins/jenkins-slave/tools/hudson.tasks.Maven_MavenInstallation/maven-3.2.1/conf/logging
jenkins.maven3.agent.Maven31Main /home/jenkins/jenkins-slave/tools/hudson.tasks.Maven_MavenInstallation/maven-3.2.1
/home/jenkins/jenkins-slave/slave.jar /home/jenkins/jenkins-slave/maven31-interceptor.jar
/home/jenkins/jenkins-slave/maven3-interceptor-commons.jar 47950
Java HotSpot(TM) 64-Bit Server VM warning: ignoring option MaxPermSize=512m; support was removed
in 8.0
<===[JENKINS REMOTING CAPACITY]===>   channel started
Executing Maven:  -B -f <https://builds.apache.org/job/incubator-commonsrdf/ws/pom.xml>
-Dmaven.repo.local=<https://builds.apache.org/job/incubator-commonsrdf/ws/.repository>
clean verify
[INFO] Scanning for projects...
[INFO] ------------------------------------------------------------------------
[INFO] Reactor Build Order:
[INFO] 
[INFO] Commons RDF
[INFO] Commons RDF: API
[INFO] Commons RDF: Simple Implementation
[INFO] 
[INFO] Using the builder org.apache.maven.lifecycle.internal.builder.singlethreaded.SingleThreadedBuilder
with a thread count of 1
[INFO]                                                                         
[INFO] ------------------------------------------------------------------------
[INFO] Building Commons RDF 0.1.0-incubating-SNAPSHOT
[INFO] ------------------------------------------------------------------------
[INFO] Downloading: http://repo.maven.apache.org/maven2/org/apache/maven/plugins/maven-gpg-plugin/1.6/maven-gpg-plugin-1.6.pom
[INFO] Downloaded: http://repo.maven.apache.org/maven2/org/apache/maven/plugins/maven-gpg-plugin/1.6/maven-gpg-plugin-1.6.pom
(6 KB at 16.6 KB/sec)
[INFO] Downloading: http://repo.maven.apache.org/maven2/org/apache/maven/plugins/maven-gpg-plugin/1.6/maven-gpg-plugin-1.6.jar
[INFO] Downloaded: http://repo.maven.apache.org/maven2/org/apache/maven/plugins/maven-gpg-plugin/1.6/maven-gpg-plugin-1.6.jar
(47 KB at 453.1 KB/sec)
[INFO] 
[INFO] --- maven-clean-plugin:2.6.1:clean (default-clean) @ commons-rdf-parent ---
[INFO] Deleting <https://builds.apache.org/job/incubator-commonsrdf/ws/target>
[INFO] 
[INFO] --- maven-enforcer-plugin:1.3.1:enforce (enforce-maven-3) @ commons-rdf-parent ---
[INFO] 
[INFO] --- build-helper-maven-plugin:1.8:parse-version (parse-version) @ commons-rdf-parent
---
[INFO] 
[INFO] --- jacoco-maven-plugin:0.7.2.201409121644:prepare-agent (prepare-agent) @ commons-rdf-parent
---
[INFO] argLine set to -javaagent:<https://builds.apache.org/job/incubator-commonsrdf/ws/.repository/org/jacoco/org.jacoco.agent/0.7.2.201409121644/org.jacoco.agent-0.7.2.201409121644-runtime.jar=destfile=/home/jenkins/jenkins-slave/workspace/incubator-commonsrdf/target/jacoco.exec>
[INFO] 
[INFO] --- maven-antrun-plugin:1.8:run (javadoc.resources) @ commons-rdf-parent ---
[INFO] Executing tasks

main:
[INFO] Executed tasks
[INFO] 
[INFO] --- maven-remote-resources-plugin:1.5:process (default) @ commons-rdf-parent ---
[INFO] 
[INFO] --- buildnumber-maven-plugin:1.3:create (default) @ commons-rdf-parent ---
[INFO] Executing: /bin/sh -c cd <https://builds.apache.org/job/incubator-commonsrdf/ws/>
&& git rev-parse --verify HEAD
[INFO] Working directory: <https://builds.apache.org/job/incubator-commonsrdf/ws/>
[INFO] Storing buildNumber: null at timestamp: 1430902450677
[WARNING] Cannot get the branch information from the git repository: 
Detecting the current branch failed: fatal: ref HEAD is not a symbolic ref

[INFO] Executing: /bin/sh -c cd <https://builds.apache.org/job/incubator-commonsrdf/ws/>
&& git rev-parse --verify HEAD
[INFO] Working directory: <https://builds.apache.org/job/incubator-commonsrdf/ws/>
[INFO] Storing buildScmBranch: UNKNOWN
[INFO] 
[INFO] --- maven-bundle-plugin:2.5.3:manifest (bundle-manifest) @ commons-rdf-parent ---
[WARNING] Ignoring project type pom - supportedProjectTypes = [jar, bundle]
[INFO] 
[INFO] --- animal-sniffer-maven-plugin:1.13:check (checkAPIcompatibility) @ commons-rdf-parent
---
[INFO] Signature checking is skipped.
[INFO] 
[INFO] --- maven-site-plugin:3.4:attach-descriptor (attach-descriptor) @ commons-rdf-parent
---
[INFO] 
[INFO] >>> maven-source-plugin:2.4:jar (default) @ commons-rdf-parent >>>
[INFO] 
[INFO] --- maven-enforcer-plugin:1.3.1:enforce (enforce-maven-3) @ commons-rdf-parent ---
[INFO] 
[INFO] --- build-helper-maven-plugin:1.8:parse-version (parse-version) @ commons-rdf-parent
---
[INFO] 
[INFO] --- jacoco-maven-plugin:0.7.2.201409121644:prepare-agent (prepare-agent) @ commons-rdf-parent
---
[INFO] argLine set to -javaagent:<https://builds.apache.org/job/incubator-commonsrdf/ws/.repository/org/jacoco/org.jacoco.agent/0.7.2.201409121644/org.jacoco.agent-0.7.2.201409121644-runtime.jar=destfile=/home/jenkins/jenkins-slave/workspace/incubator-commonsrdf/target/jacoco.exec>
[INFO] 
[INFO] --- maven-antrun-plugin:1.8:run (javadoc.resources) @ commons-rdf-parent ---
[INFO] Executing tasks

main:
[INFO] Executed tasks
[WARNING] Failed to getClass for org.apache.maven.plugin.source.SourceJarMojo
[INFO] 
[INFO] <<< maven-source-plugin:2.4:jar (default) @ commons-rdf-parent <<<
[INFO] 
[INFO] --- maven-source-plugin:2.4:jar (default) @ commons-rdf-parent ---
[INFO] 
[INFO] >>> maven-source-plugin:2.4:test-jar (default) @ commons-rdf-parent >>>
[INFO] 
[INFO] --- maven-enforcer-plugin:1.3.1:enforce (enforce-maven-3) @ commons-rdf-parent ---
[INFO] 
[INFO] --- build-helper-maven-plugin:1.8:parse-version (parse-version) @ commons-rdf-parent
---
[INFO] 
[INFO] --- jacoco-maven-plugin:0.7.2.201409121644:prepare-agent (prepare-agent) @ commons-rdf-parent
---
[INFO] argLine set to -javaagent:<https://builds.apache.org/job/incubator-commonsrdf/ws/.repository/org/jacoco/org.jacoco.agent/0.7.2.201409121644/org.jacoco.agent-0.7.2.201409121644-runtime.jar=destfile=/home/jenkins/jenkins-slave/workspace/incubator-commonsrdf/target/jacoco.exec>
[INFO] 
[INFO] --- maven-antrun-plugin:1.8:run (javadoc.resources) @ commons-rdf-parent ---
[INFO] Executing tasks

main:
[INFO] Executed tasks
[WARNING] Failed to getClass for org.apache.maven.plugin.source.TestSourceJarMojo
[INFO] 
[INFO] <<< maven-source-plugin:2.4:test-jar (default) @ commons-rdf-parent <<<
[INFO] 
[INFO] --- maven-source-plugin:2.4:test-jar (default) @ commons-rdf-parent ---
[INFO] 
[INFO] --- maven-javadoc-plugin:2.10.1:jar (attach-javadocs) @ commons-rdf-parent ---
[INFO] Not executing Javadoc as the project is not a Java classpath-capable package
[INFO] 
[INFO] --- maven-gpg-plugin:1.6:sign (sign-artifacts) @ commons-rdf-parent ---
[INFO] Downloading: http://repo.maven.apache.org/maven2/org/sonatype/plexus/plexus-sec-dispatcher/1.4/plexus-sec-dispatcher-1.4.pom
[INFO] Downloaded: http://repo.maven.apache.org/maven2/org/sonatype/plexus/plexus-sec-dispatcher/1.4/plexus-sec-dispatcher-1.4.pom
(3 KB at 52.6 KB/sec)
[INFO] Downloading: http://repo.maven.apache.org/maven2/org/sonatype/plexus/plexus-sec-dispatcher/1.4/plexus-sec-dispatcher-1.4.jar
[INFO] Downloaded: http://repo.maven.apache.org/maven2/org/sonatype/plexus/plexus-sec-dispatcher/1.4/plexus-sec-dispatcher-1.4.jar
(28 KB at 351.3 KB/sec)
gpg: no default secret key: secret key not available
gpg: signing failed: secret key not available
[INFO] ------------------------------------------------------------------------
[INFO] Reactor Summary:
[INFO] 
[INFO] Commons RDF ....................................... FAILURE [  8.285 s]
[INFO] Commons RDF: API .................................. SKIPPED
[INFO] Commons RDF: Simple Implementation ................ SKIPPED
[INFO] ------------------------------------------------------------------------
[INFO] BUILD FAILURE
[INFO] ------------------------------------------------------------------------
[INFO] Total time: 10.126 s
[INFO] Finished at: 2015-05-06T08:54:15+00:00
[INFO] Final Memory: 26M/348M
[INFO] ------------------------------------------------------------------------
[ERROR] Failed to execute goal org.apache.maven.plugins:maven-gpg-plugin:1.6:sign (sign-artifacts)
on project commons-rdf-parent: Exit code: 2 -> [Help 1]
[ERROR] 
[ERROR] To see the full stack trace of the errors, re-run Maven with the -e switch.
[ERROR] Re-run Maven using the -X switch to enable full debug logging.
[ERROR] 
[ERROR] For more information about the errors and possible solutions, please read the following
articles:
[ERROR] [Help 1] http://cwiki.apache.org/confluence/display/MAVEN/MojoExecutionException
[JENKINS] Archiving <https://builds.apache.org/job/incubator-commonsrdf/ws/simple/pom.xml>
to org.apache.commons/commons-rdf-simple/0.1.0-incubating-SNAPSHOT/commons-rdf-simple-0.1.0-incubating-SNAPSHOT.pom
Sending artifact delta relative to incubator-commonsrdf » Commons RDF: Simple Implementation
#44
Archived 1 artifacts
Archive block size is 32768
Received 0 blocks and 2331 bytes
Compression is 0.0%
Took 0.26 sec
[JENKINS] Archiving <https://builds.apache.org/job/incubator-commonsrdf/ws/api/pom.xml>
to org.apache.commons/commons-rdf-api/0.1-incubating-SNAPSHOT/commons-rdf-api-0.1-incubating-SNAPSHOT.pom
Sending artifact delta relative to incubator-commonsrdf » Commons RDF: API #44
Archived 1 artifacts
Archive block size is 32768
Received 0 blocks and 2436 bytes
Compression is 0.0%
Took 0.17 sec
[JENKINS] Archiving <https://builds.apache.org/job/incubator-commonsrdf/ws/pom.xml>
to org.apache.commons/commons-rdf-parent/0.1.0-incubating-SNAPSHOT/commons-rdf-parent-0.1.0-incubating-SNAPSHOT.pom
[JENKINS] Archiving <https://builds.apache.org/job/incubator-commonsrdf/ws/target/commons-rdf-parent-0.1.0-incubating-SNAPSHOT-site.xml>
to org.apache.commons/commons-rdf-parent/0.1.0-incubating-SNAPSHOT/commons-rdf-parent-0.1.0-incubating-SNAPSHOT-site.xml
Sending artifact delta relative to incubator-commonsrdf » Commons RDF #44
Archived 2 artifacts
Archive block size is 32768
Received 0 blocks and 22332 bytes
Compression is 0.0%
Took 0.1 sec
channel stopped

Mime
View raw message