commonsrdf-commits mailing list archives

Site index · List index
Message view « Date » · « Thread »
Top « Date » · « Thread »
From Apache Jenkins Server <jenk...@builds.apache.org>
Subject Build failed in Jenkins: incubator-commonsrdf #20
Date Mon, 20 Apr 2015 17:06:57 GMT
See <https://builds.apache.org/job/incubator-commonsrdf/20/changes>

Changes:

[wikier] COMMONSRDF-9: moved site to git, since apache commons components do not use the cms

[wikier] COMMONSRDF-9: added javadoc reports

[wikier] COMMONSRDF-9: removed duplicated items from the menu also added by commons-parent

[wikier] COMMONSRDF-9: checked reporting

[wikier] COMMONSRDF-9: latest adaptations from commons-parent

------------------------------------------
Started by an SCM change
Building remotely on H1 (Mapreduce Hadoop Pig Hdfs) in workspace <https://builds.apache.org/job/incubator-commonsrdf/ws/>
 > git rev-parse --is-inside-work-tree # timeout=10
Fetching changes from the remote Git repository
 > git config remote.origin.url https://git-wip-us.apache.org/repos/asf/incubator-commonsrdf.git
# timeout=10
Fetching upstream changes from https://git-wip-us.apache.org/repos/asf/incubator-commonsrdf.git
 > git --version # timeout=10
 > git fetch --tags --progress https://git-wip-us.apache.org/repos/asf/incubator-commonsrdf.git
+refs/heads/*:refs/remotes/origin/*
 > git rev-parse refs/remotes/origin/master^{commit} # timeout=10
 > git rev-parse refs/remotes/origin/origin/master^{commit} # timeout=10
Checking out Revision 1066057b1ad3ecd693ffc5be4a99d3da78721c66 (refs/remotes/origin/master)
 > git config core.sparsecheckout # timeout=10
 > git checkout -f 1066057b1ad3ecd693ffc5be4a99d3da78721c66
 > git rev-list b08ef1ad949769795a900e0e4afd39173ef6ba2c # timeout=10
Parsing POMs
Modules changed, recalculating dependency graph
maven31-agent.jar already up to date
maven31-interceptor.jar already up to date
maven3-interceptor-commons.jar already up to date
[incubator-commonsrdf] $ /home/jenkins/tools/java/jdk1.8.0/bin/java -Xmx2g -Xms256m -XX:MaxPermSize=512m
-cp /home/jenkins/jenkins-slave/maven31-agent.jar:/home/jenkins/jenkins-slave/tools/hudson.tasks.Maven_MavenInstallation/maven-3.2.1/boot/plexus-classworlds-2.5.1.jar:/home/jenkins/jenkins-slave/tools/hudson.tasks.Maven_MavenInstallation/maven-3.2.1/conf/logging
jenkins.maven3.agent.Maven31Main /home/jenkins/jenkins-slave/tools/hudson.tasks.Maven_MavenInstallation/maven-3.2.1
/home/jenkins/jenkins-slave/slave.jar /home/jenkins/jenkins-slave/maven31-interceptor.jar
/home/jenkins/jenkins-slave/maven3-interceptor-commons.jar 34866
Java HotSpot(TM) 64-Bit Server VM warning: ignoring option MaxPermSize=512m; support was removed
in 8.0
<===[JENKINS REMOTING CAPACITY]===>   channel started
Executing Maven:  -B -f <https://builds.apache.org/job/incubator-commonsrdf/ws/pom.xml>
-Dmaven.repo.local=<https://builds.apache.org/job/incubator-commonsrdf/ws/.repository>
clean verify
[INFO] Scanning for projects...
[INFO] ------------------------------------------------------------------------
[INFO] Reactor Build Order:
[INFO] 
[INFO] Commons RDF
[INFO] Commons RDF: API
[INFO] Commons RDF: Simple Implementation
[INFO] 
[INFO] Using the builder org.apache.maven.lifecycle.internal.builder.singlethreaded.SingleThreadedBuilder
with a thread count of 1
[INFO]                                                                         
[INFO] ------------------------------------------------------------------------
[INFO] Building Commons RDF 0.1.0-incubating-SNAPSHOT
[INFO] ------------------------------------------------------------------------
[INFO] 
[INFO] --- maven-clean-plugin:2.6.1:clean (default-clean) @ commons-rdf-parent ---
[INFO] Deleting <https://builds.apache.org/job/incubator-commonsrdf/ws/target>
[INFO] 
[INFO] --- maven-enforcer-plugin:1.3.1:enforce (enforce-maven-3) @ commons-rdf-parent ---
[INFO] 
[INFO] --- build-helper-maven-plugin:1.8:parse-version (parse-version) @ commons-rdf-parent
---
[INFO] 
[INFO] --- jacoco-maven-plugin:0.7.2.201409121644:prepare-agent (prepare-agent) @ commons-rdf-parent
---
[INFO] argLine set to -javaagent:<https://builds.apache.org/job/incubator-commonsrdf/ws/.repository/org/jacoco/org.jacoco.agent/0.7.2.201409121644/org.jacoco.agent-0.7.2.201409121644-runtime.jar=destfile=/home/jenkins/jenkins-slave/workspace/incubator-commonsrdf/target/jacoco.exec>
[INFO] 
[INFO] --- maven-antrun-plugin:1.8:run (javadoc.resources) @ commons-rdf-parent ---
[INFO] Executing tasks

main:
[INFO] Executed tasks
[INFO] 
[INFO] --- maven-remote-resources-plugin:1.5:process (default) @ commons-rdf-parent ---
[INFO] 
[INFO] --- buildnumber-maven-plugin:1.3:create (default) @ commons-rdf-parent ---
[INFO] Executing: /bin/sh -c cd <https://builds.apache.org/job/incubator-commonsrdf/ws/>
&& git rev-parse --verify HEAD
[INFO] Working directory: <https://builds.apache.org/job/incubator-commonsrdf/ws/>
[INFO] Storing buildNumber: null at timestamp: 1429549601549
[WARNING] Cannot get the branch information from the git repository: 
Detecting the current branch failed: fatal: ref HEAD is not a symbolic ref

[INFO] Executing: /bin/sh -c cd <https://builds.apache.org/job/incubator-commonsrdf/ws/>
&& git rev-parse --verify HEAD
[INFO] Working directory: <https://builds.apache.org/job/incubator-commonsrdf/ws/>
[INFO] Storing buildScmBranch: UNKNOWN
[INFO] 
[INFO] --- maven-bundle-plugin:2.5.3:manifest (bundle-manifest) @ commons-rdf-parent ---
[WARNING] Ignoring project type pom - supportedProjectTypes = [jar, bundle]
[INFO] 
[INFO] --- animal-sniffer-maven-plugin:1.13:check (checkAPIcompatibility) @ commons-rdf-parent
---
[INFO] Signature checking is skipped.
[INFO] 
[INFO] --- maven-site-plugin:3.4:attach-descriptor (attach-descriptor) @ commons-rdf-parent
---
[INFO] 
[INFO] >>> maven-source-plugin:2.2.1:jar (default) @ commons-rdf-parent >>>
[INFO] 
[INFO] --- maven-enforcer-plugin:1.3.1:enforce (enforce-maven-3) @ commons-rdf-parent ---
[INFO] 
[INFO] --- build-helper-maven-plugin:1.8:parse-version (parse-version) @ commons-rdf-parent
---
[INFO] 
[INFO] --- jacoco-maven-plugin:0.7.2.201409121644:prepare-agent (prepare-agent) @ commons-rdf-parent
---
[INFO] argLine set to -javaagent:<https://builds.apache.org/job/incubator-commonsrdf/ws/.repository/org/jacoco/org.jacoco.agent/0.7.2.201409121644/org.jacoco.agent-0.7.2.201409121644-runtime.jar=destfile=/home/jenkins/jenkins-slave/workspace/incubator-commonsrdf/target/jacoco.exec>
[INFO] 
[INFO] --- maven-antrun-plugin:1.8:run (javadoc.resources) @ commons-rdf-parent ---
[INFO] Executing tasks

main:
[INFO] Executed tasks
[WARNING] Failed to getClass for org.apache.maven.plugin.source.SourceJarMojo
[INFO] 
[INFO] <<< maven-source-plugin:2.2.1:jar (default) @ commons-rdf-parent <<<
[INFO] 
[INFO] --- maven-source-plugin:2.2.1:jar (default) @ commons-rdf-parent ---
[INFO] 
[INFO] >>> maven-source-plugin:2.2.1:test-jar (default) @ commons-rdf-parent >>>
[INFO] 
[INFO] --- maven-enforcer-plugin:1.3.1:enforce (enforce-maven-3) @ commons-rdf-parent ---
[INFO] 
[INFO] --- build-helper-maven-plugin:1.8:parse-version (parse-version) @ commons-rdf-parent
---
[INFO] 
[INFO] --- jacoco-maven-plugin:0.7.2.201409121644:prepare-agent (prepare-agent) @ commons-rdf-parent
---
[INFO] argLine set to -javaagent:<https://builds.apache.org/job/incubator-commonsrdf/ws/.repository/org/jacoco/org.jacoco.agent/0.7.2.201409121644/org.jacoco.agent-0.7.2.201409121644-runtime.jar=destfile=/home/jenkins/jenkins-slave/workspace/incubator-commonsrdf/target/jacoco.exec>
[INFO] 
[INFO] --- maven-antrun-plugin:1.8:run (javadoc.resources) @ commons-rdf-parent ---
[INFO] Executing tasks

main:
[INFO] Executed tasks
[WARNING] Failed to getClass for org.apache.maven.plugin.source.TestSourceJarMojo
[INFO] 
[INFO] <<< maven-source-plugin:2.2.1:test-jar (default) @ commons-rdf-parent <<<
[INFO] 
[INFO] --- maven-source-plugin:2.2.1:test-jar (default) @ commons-rdf-parent ---
[INFO] 
[INFO] --- maven-javadoc-plugin:2.9.1:jar (attach-javadocs) @ commons-rdf-parent ---
[INFO] Not executing Javadoc as the project is not a Java classpath-capable package
[INFO] 
[INFO] --- license-maven-plugin:2.8:check (default) @ commons-rdf-parent ---
[INFO] Downloading: http://repo.maven.apache.org/maven2/org/springframework/spring-core/3.1.3.RELEASE/spring-core-3.1.3.RELEASE.jar
[INFO] Downloading: http://repo.maven.apache.org/maven2/org/apache/commons/commons-pool2/2.2/commons-pool2-2.2.jar
[INFO] Downloading: http://repo.maven.apache.org/maven2/com/mycila/mycila-xmltool/4.4.ga/mycila-xmltool-4.4.ga.jar
[INFO] Downloading: http://repo.maven.apache.org/maven2/org/apache/maven/maven-project-builder/3.0-alpha-2/maven-project-builder-3.0-alpha-2.jar
[INFO] Downloading: http://repo.maven.apache.org/maven2/org/springframework/spring-asm/3.1.3.RELEASE/spring-asm-3.1.3.RELEASE.jar
[INFO] Downloaded: http://repo.maven.apache.org/maven2/org/springframework/spring-asm/3.1.3.RELEASE/spring-asm-3.1.3.RELEASE.jar
(52 KB at 9.7 KB/sec)
[INFO] Downloaded: http://repo.maven.apache.org/maven2/com/mycila/mycila-xmltool/4.4.ga/mycila-xmltool-4.4.ga.jar
(59 KB at 11.0 KB/sec)
[INFO] Downloaded: http://repo.maven.apache.org/maven2/org/apache/commons/commons-pool2/2.2/commons-pool2-2.2.jar
(106 KB at 19.6 KB/sec)
[INFO] Downloaded: http://repo.maven.apache.org/maven2/org/apache/maven/maven-project-builder/3.0-alpha-2/maven-project-builder-3.0-alpha-2.jar
(166 KB at 30.6 KB/sec)
[INFO] Downloaded: http://repo.maven.apache.org/maven2/org/springframework/spring-core/3.1.3.RELEASE/spring-core-3.1.3.RELEASE.jar
(441 KB at 80.2 KB/sec)
[INFO] Checking licenses...
[WARNING] Missing header in: <https://builds.apache.org/job/incubator-commonsrdf/ws/src/site/site.xml>
[INFO] ------------------------------------------------------------------------
[INFO] Reactor Summary:
[INFO] 
[INFO] Commons RDF ....................................... FAILURE [ 11.091 s]
[INFO] Commons RDF: API .................................. SKIPPED
[INFO] Commons RDF: Simple Implementation ................ SKIPPED
[INFO] ------------------------------------------------------------------------
[INFO] BUILD FAILURE
[INFO] ------------------------------------------------------------------------
[INFO] Total time: 12.830 s
[INFO] Finished at: 2015-04-20T17:06:51+00:00
[INFO] Final Memory: 26M/365M
[INFO] ------------------------------------------------------------------------
[ERROR] Failed to execute goal com.mycila:license-maven-plugin:2.8:check (default) on project
commons-rdf-parent: Some files do not have the expected license header -> [Help 1]
[ERROR] 
[ERROR] To see the full stack trace of the errors, re-run Maven with the -e switch.
[ERROR] Re-run Maven using the -X switch to enable full debug logging.
[ERROR] 
[ERROR] For more information about the errors and possible solutions, please read the following
articles:
[ERROR] [Help 1] http://cwiki.apache.org/confluence/display/MAVEN/MojoExecutionException
[JENKINS] Archiving <https://builds.apache.org/job/incubator-commonsrdf/ws/simple/pom.xml>
to org.apache.commons/commons-rdf-simple/0.1.0-incubating-SNAPSHOT/commons-rdf-simple-0.1.0-incubating-SNAPSHOT.pom
Sending artifact delta relative to incubator-commonsrdf » Commons RDF: Simple Implementation
#14
Archived 1 artifacts
Archive block size is 32768
Received 0 blocks and 2292 bytes
Compression is 0.0%
Took 0.28 sec
[JENKINS] Archiving <https://builds.apache.org/job/incubator-commonsrdf/ws/api/pom.xml>
to org.apache.commons/commons-rdf-api/0.1-incubating-SNAPSHOT/commons-rdf-api-0.1-incubating-SNAPSHOT.pom
Sending artifact delta relative to incubator-commonsrdf » Commons RDF: API #14
Archived 1 artifacts
Archive block size is 32768
Received 0 blocks and 2397 bytes
Compression is 0.0%
Took 0.13 sec
[JENKINS] Archiving <https://builds.apache.org/job/incubator-commonsrdf/ws/pom.xml>
to org.apache.commons/commons-rdf-parent/0.1.0-incubating-SNAPSHOT/commons-rdf-parent-0.1.0-incubating-SNAPSHOT.pom
[JENKINS] Archiving <https://builds.apache.org/job/incubator-commonsrdf/ws/target/commons-rdf-parent-0.1.0-incubating-SNAPSHOT-site.xml>
to org.apache.commons/commons-rdf-parent/0.1.0-incubating-SNAPSHOT/commons-rdf-parent-0.1.0-incubating-SNAPSHOT-site.xml
Sending artifact delta relative to incubator-commonsrdf » Commons RDF #14
Archived 2 artifacts
Archive block size is 32768
Received 0 blocks and 20747 bytes
Compression is 0.0%
Took 37 ms
channel stopped

Mime
View raw message