commonsrdf-commits mailing list archives

Site index · List index
Message view « Date » · « Thread »
Top « Date » · « Thread »
From Apache Jenkins Server <jenk...@builds.apache.org>
Subject Build failed in Jenkins: incubator-commonsrdf #1
Date Sun, 05 Apr 2015 21:58:38 GMT
See <https://builds.apache.org/job/incubator-commonsrdf/1/>

------------------------------------------
[...truncated 2050 lines...]
[INFO] Executing tasks

main:
[INFO] Executed tasks
[WARNING] Failed to getClass for org.apache.maven.plugin.source.SourceJarMojo
[INFO] 
[INFO] <<< maven-source-plugin:2.2.1:jar (default) @ commons-rdf-api <<<
[INFO] 
[INFO] --- maven-source-plugin:2.2.1:jar (default) @ commons-rdf-api ---
[INFO] Building jar: <https://builds.apache.org/job/incubator-commonsrdf/ws/api/target/commons-rdf-api-0.0.3-SNAPSHOT-sources.jar>
[INFO] 
[INFO] >>> maven-source-plugin:2.2.1:test-jar (default) @ commons-rdf-api >>>
[INFO] 
[INFO] --- maven-enforcer-plugin:1.3.1:enforce (enforce-maven-3) @ commons-rdf-api ---
[INFO] 
[INFO] --- build-helper-maven-plugin:1.8:parse-version (parse-version) @ commons-rdf-api ---
[INFO] 
[INFO] --- jacoco-maven-plugin:0.7.2.201409121644:prepare-agent (prepare-agent) @ commons-rdf-api
---
[INFO] argLine set to -javaagent:<https://builds.apache.org/job/incubator-commonsrdf/ws/.repository/org/jacoco/org.jacoco.agent/0.7.2.201409121644/org.jacoco.agent-0.7.2.201409121644-runtime.jar=destfile=/home/jenkins/jenkins-slave/workspace/incubator-commonsrdf/api/target/jacoco.exec>
[INFO] 
[INFO] --- maven-antrun-plugin:1.8:run (javadoc.resources) @ commons-rdf-api ---
[INFO] Executing tasks

main:
[INFO] Executed tasks
[WARNING] Failed to getClass for org.apache.maven.plugin.source.TestSourceJarMojo
[INFO] 
[INFO] <<< maven-source-plugin:2.2.1:test-jar (default) @ commons-rdf-api <<<
[INFO] 
[INFO] --- maven-source-plugin:2.2.1:test-jar (default) @ commons-rdf-api ---
[INFO] Building jar: <https://builds.apache.org/job/incubator-commonsrdf/ws/api/target/commons-rdf-api-0.0.3-SNAPSHOT-test-sources.jar>
[INFO] 
[INFO] --- maven-javadoc-plugin:2.9.1:jar (default) @ commons-rdf-api ---
[INFO] 
2 warnings
[WARNING] Javadoc Warnings
[WARNING] javadoc: warning - Error fetching URL: http://docs.oracle.com/javase/7/docs/api
[WARNING] javadoc: warning - Error fetching URL: http://docs.oracle.com/javaee/6/api
[INFO] Building jar: <https://builds.apache.org/job/incubator-commonsrdf/ws/api/target/commons-rdf-api-0.0.3-SNAPSHOT-javadoc.jar>
[INFO] 
[INFO] --- maven-jar-plugin:2.6:jar (jar-and-test-jar) @ commons-rdf-api ---
[INFO] 
[INFO] --- maven-jar-plugin:2.6:test-jar (jar-and-test-jar) @ commons-rdf-api ---
[INFO] Building jar: <https://builds.apache.org/job/incubator-commonsrdf/ws/api/target/commons-rdf-api-0.0.3-SNAPSHOT-tests.jar>
[INFO] 
[INFO] --- license-maven-plugin:2.8:check (default) @ commons-rdf-api ---
[INFO] Checking licenses...
[INFO] 
[INFO] --- maven-install-plugin:2.5.2:install (default-install) @ commons-rdf-api ---
[INFO] Installing <https://builds.apache.org/job/incubator-commonsrdf/ws/api/target/commons-rdf-api-0.0.3-SNAPSHOT.jar>
to <https://builds.apache.org/job/incubator-commonsrdf/ws/.repository/org/apache/commons/commons-rdf-api/0.0.3-SNAPSHOT/commons-rdf-api-0.0.3-SNAPSHOT.jar>
[INFO] Installing <https://builds.apache.org/job/incubator-commonsrdf/ws/api/pom.xml>
to <https://builds.apache.org/job/incubator-commonsrdf/ws/.repository/org/apache/commons/commons-rdf-api/0.0.3-SNAPSHOT/commons-rdf-api-0.0.3-SNAPSHOT.pom>
[INFO] Installing <https://builds.apache.org/job/incubator-commonsrdf/ws/api/target/commons-rdf-api-0.0.3-SNAPSHOT-sources.jar>
to <https://builds.apache.org/job/incubator-commonsrdf/ws/.repository/org/apache/commons/commons-rdf-api/0.0.3-SNAPSHOT/commons-rdf-api-0.0.3-SNAPSHOT-sources.jar>
[INFO] Installing <https://builds.apache.org/job/incubator-commonsrdf/ws/api/target/commons-rdf-api-0.0.3-SNAPSHOT-test-sources.jar>
to <https://builds.apache.org/job/incubator-commonsrdf/ws/.repository/org/apache/commons/commons-rdf-api/0.0.3-SNAPSHOT/commons-rdf-api-0.0.3-SNAPSHOT-test-sources.jar>
[INFO] Installing <https://builds.apache.org/job/incubator-commonsrdf/ws/api/target/commons-rdf-api-0.0.3-SNAPSHOT-javadoc.jar>
to <https://builds.apache.org/job/incubator-commonsrdf/ws/.repository/org/apache/commons/commons-rdf-api/0.0.3-SNAPSHOT/commons-rdf-api-0.0.3-SNAPSHOT-javadoc.jar>
[INFO] Installing <https://builds.apache.org/job/incubator-commonsrdf/ws/api/target/commons-rdf-api-0.0.3-SNAPSHOT-tests.jar>
to <https://builds.apache.org/job/incubator-commonsrdf/ws/.repository/org/apache/commons/commons-rdf-api/0.0.3-SNAPSHOT/commons-rdf-api-0.0.3-SNAPSHOT-tests.jar>
[INFO]                                                                         
[INFO] ------------------------------------------------------------------------
[INFO] Building Commons RDF: Simple Implementation 0.0.3-SNAPSHOT
[INFO] ------------------------------------------------------------------------
[INFO] 
[INFO] --- maven-clean-plugin:2.6.1:clean (default-clean) @ commons-rdf-simple ---
[INFO] 
[INFO] --- maven-enforcer-plugin:1.3.1:enforce (enforce-maven-3) @ commons-rdf-simple ---
[INFO] 
[INFO] --- build-helper-maven-plugin:1.8:parse-version (parse-version) @ commons-rdf-simple
---
[INFO] 
[INFO] --- jacoco-maven-plugin:0.7.2.201409121644:prepare-agent (prepare-agent) @ commons-rdf-simple
---
[INFO] argLine set to -javaagent:<https://builds.apache.org/job/incubator-commonsrdf/ws/.repository/org/jacoco/org.jacoco.agent/0.7.2.201409121644/org.jacoco.agent-0.7.2.201409121644-runtime.jar=destfile=/home/jenkins/jenkins-slave/workspace/incubator-commonsrdf/simple/target/jacoco.exec>
[INFO] 
[INFO] --- maven-antrun-plugin:1.8:run (javadoc.resources) @ commons-rdf-simple ---
[INFO] Executing tasks

main:
[INFO] Executed tasks
[INFO] 
[INFO] --- maven-remote-resources-plugin:1.5:process (default) @ commons-rdf-simple ---
[INFO] 
[INFO] --- buildnumber-maven-plugin:1.3:create (default) @ commons-rdf-simple ---
[INFO] Executing: /bin/sh -c cd <https://builds.apache.org/job/incubator-commonsrdf/ws/simple>
&& git rev-parse --verify HEAD
[INFO] Working directory: <https://builds.apache.org/job/incubator-commonsrdf/ws/simple>
[INFO] Storing buildNumber: null at timestamp: 1428271098003
[WARNING] Cannot get the branch information from the git repository: 
Detecting the current branch failed: fatal: ref HEAD is not a symbolic ref

[INFO] Executing: /bin/sh -c cd <https://builds.apache.org/job/incubator-commonsrdf/ws/simple>
&& git rev-parse --verify HEAD
[INFO] Working directory: <https://builds.apache.org/job/incubator-commonsrdf/ws/simple>
[INFO] Storing buildScmBranch: UNKNOWN
[INFO] 
[INFO] --- maven-resources-plugin:2.7:resources (default-resources) @ commons-rdf-simple ---
[INFO] Using 'UTF-8' encoding to copy filtered resources.
[INFO] skip non existing resourceDirectory <https://builds.apache.org/job/incubator-commonsrdf/ws/simple/src/main/resources>
[INFO] Copying 0 resource to META-INF
[INFO] 
[INFO] --- maven-compiler-plugin:3.1:compile (default-compile) @ commons-rdf-simple ---
[INFO] Changes detected - recompiling the module!
[INFO] Compiling 8 source files to <https://builds.apache.org/job/incubator-commonsrdf/ws/simple/target/classes>
[INFO] 
[INFO] --- maven-bundle-plugin:2.5.3:manifest (bundle-manifest) @ commons-rdf-simple ---
[INFO] 
[INFO] --- animal-sniffer-maven-plugin:1.13:check (checkAPIcompatibility) @ commons-rdf-simple
---
[INFO] Signature checking is skipped.
[INFO] 
[INFO] --- maven-resources-plugin:2.7:testResources (default-testResources) @ commons-rdf-simple
---
[INFO] Using 'UTF-8' encoding to copy filtered resources.
[INFO] skip non existing resourceDirectory <https://builds.apache.org/job/incubator-commonsrdf/ws/simple/src/test/resources>
[INFO] Copying 0 resource to META-INF
[INFO] 
[INFO] --- maven-compiler-plugin:3.1:testCompile (default-testCompile) @ commons-rdf-simple
---
[INFO] Changes detected - recompiling the module!
[INFO] Compiling 7 source files to <https://builds.apache.org/job/incubator-commonsrdf/ws/simple/target/test-classes>
[INFO] 
[INFO] --- maven-surefire-plugin:2.18:test (default-test) @ commons-rdf-simple ---
[INFO] Surefire report directory: <https://builds.apache.org/job/incubator-commonsrdf/ws/simple/target/surefire-reports>

-------------------------------------------------------
 T E S T S
-------------------------------------------------------
Running org.apache.commons.rdf.simple.SimpleRDFTermFactoryTest
Tests run: 19, Failures: 0, Errors: 0, Skipped: 0, Time elapsed: 0.067 sec - in org.apache.commons.rdf.simple.SimpleRDFTermFactoryTest
Running org.apache.commons.rdf.simple.TestWritingGraph
Counted - 200000
Tests run: 5, Failures: 0, Errors: 0, Skipped: 0, Time elapsed: 2.61 sec - in org.apache.commons.rdf.simple.TestWritingGraph
Running org.apache.commons.rdf.simple.SimpleGraphTest
<http://example.com/alice> <http://xmlns.com/foaf/0.1/knows> <http://example.com/bob>
.
<http://example.com/bob> <http://xmlns.com/foaf/0.1/member> _:de173690-81bb-3f30-8f74-ebb68457d6f6
.
<http://example.com/alice> <http://xmlns.com/foaf/0.1/member> _:5a27659e-98cd-38dd-9f5e-a86d3ce495d0
.
<http://example.com/alice> <http://xmlns.com/foaf/0.1/name> "Alice" .
<http://example.com/bob> <http://xmlns.com/foaf/0.1/name> "Bob"@en-us .
<http://example.com/bob> <http://xmlns.com/foaf/0.1/member> _:5a27659e-98cd-38dd-9f5e-a86d3ce495d0
.
_:5a27659e-98cd-38dd-9f5e-a86d3ce495d0 <http://xmlns.com/foaf/0.1/name> "The Secret
Club" .
_:de173690-81bb-3f30-8f74-ebb68457d6f6 <http://xmlns.com/foaf/0.1/name> "A company"
.
Tests run: 8, Failures: 0, Errors: 0, Skipped: 0, Time elapsed: 0.071 sec - in org.apache.commons.rdf.simple.SimpleGraphTest
Running org.apache.commons.rdf.simple.BlankNodeImplTest
Tests run: 4, Failures: 0, Errors: 0, Skipped: 0, Time elapsed: 0.007 sec - in org.apache.commons.rdf.simple.BlankNodeImplTest
Running org.apache.commons.rdf.simple.SimpleNoRelativeIRIRDFTermFactoryTest
Tests run: 19, Failures: 0, Errors: 0, Skipped: 1, Time elapsed: 0.017 sec - in org.apache.commons.rdf.simple.SimpleNoRelativeIRIRDFTermFactoryTest
Running org.apache.commons.rdf.simple.DefaultGraphTest
Tests run: 8, Failures: 0, Errors: 0, Skipped: 7, Time elapsed: 0.01 sec - in org.apache.commons.rdf.simple.DefaultGraphTest
Running org.apache.commons.rdf.simple.TypesTest
Tests run: 3, Failures: 0, Errors: 0, Skipped: 0, Time elapsed: 0 sec - in org.apache.commons.rdf.simple.TypesTest

Results :




Tests run: 66, Failures: 0, Errors: 0, Skipped: 8

[JENKINS] Recording test results
[INFO] 
[INFO] --- maven-jar-plugin:2.6:jar (default-jar) @ commons-rdf-simple ---
[INFO] Building jar: <https://builds.apache.org/job/incubator-commonsrdf/ws/simple/target/commons-rdf-simple-0.0.3-SNAPSHOT.jar>
[INFO] 
[INFO] --- maven-site-plugin:3.4:attach-descriptor (attach-descriptor) @ commons-rdf-simple
---
[INFO] 
[INFO] >>> maven-source-plugin:2.2.1:jar (default) @ commons-rdf-simple >>>
[INFO] 
[INFO] --- maven-enforcer-plugin:1.3.1:enforce (enforce-maven-3) @ commons-rdf-simple ---
[INFO] 
[INFO] --- build-helper-maven-plugin:1.8:parse-version (parse-version) @ commons-rdf-simple
---
[INFO] 
[INFO] --- jacoco-maven-plugin:0.7.2.201409121644:prepare-agent (prepare-agent) @ commons-rdf-simple
---
[INFO] argLine set to -javaagent:<https://builds.apache.org/job/incubator-commonsrdf/ws/.repository/org/jacoco/org.jacoco.agent/0.7.2.201409121644/org.jacoco.agent-0.7.2.201409121644-runtime.jar=destfile=/home/jenkins/jenkins-slave/workspace/incubator-commonsrdf/simple/target/jacoco.exec>
[INFO] 
[INFO] --- maven-antrun-plugin:1.8:run (javadoc.resources) @ commons-rdf-simple ---
[INFO] Executing tasks

main:
[INFO] Executed tasks
[WARNING] Failed to getClass for org.apache.maven.plugin.source.SourceJarMojo
[INFO] 
[INFO] <<< maven-source-plugin:2.2.1:jar (default) @ commons-rdf-simple <<<
[INFO] 
[INFO] --- maven-source-plugin:2.2.1:jar (default) @ commons-rdf-simple ---
[INFO] Building jar: <https://builds.apache.org/job/incubator-commonsrdf/ws/simple/target/commons-rdf-simple-0.0.3-SNAPSHOT-sources.jar>
[INFO] 
[INFO] >>> maven-source-plugin:2.2.1:test-jar (default) @ commons-rdf-simple >>>
[INFO] 
[INFO] --- maven-enforcer-plugin:1.3.1:enforce (enforce-maven-3) @ commons-rdf-simple ---
[INFO] 
[INFO] --- build-helper-maven-plugin:1.8:parse-version (parse-version) @ commons-rdf-simple
---
[INFO] 
[INFO] --- jacoco-maven-plugin:0.7.2.201409121644:prepare-agent (prepare-agent) @ commons-rdf-simple
---
[INFO] argLine set to -javaagent:<https://builds.apache.org/job/incubator-commonsrdf/ws/.repository/org/jacoco/org.jacoco.agent/0.7.2.201409121644/org.jacoco.agent-0.7.2.201409121644-runtime.jar=destfile=/home/jenkins/jenkins-slave/workspace/incubator-commonsrdf/simple/target/jacoco.exec>
[INFO] 
[INFO] --- maven-antrun-plugin:1.8:run (javadoc.resources) @ commons-rdf-simple ---
[INFO] Executing tasks

main:
[INFO] Executed tasks
[WARNING] Failed to getClass for org.apache.maven.plugin.source.TestSourceJarMojo
[INFO] 
[INFO] <<< maven-source-plugin:2.2.1:test-jar (default) @ commons-rdf-simple <<<
[INFO] 
[INFO] --- maven-source-plugin:2.2.1:test-jar (default) @ commons-rdf-simple ---
[INFO] Building jar: <https://builds.apache.org/job/incubator-commonsrdf/ws/simple/target/commons-rdf-simple-0.0.3-SNAPSHOT-test-sources.jar>
[INFO] 
[INFO] --- maven-javadoc-plugin:2.9.1:jar (default) @ commons-rdf-simple ---
[INFO] 
1 error
2 warnings
[INFO] ------------------------------------------------------------------------
[INFO] Reactor Summary:
[INFO] 
[INFO] Commons RDF ....................................... SUCCESS [01:02 min]
[INFO] Commons RDF: API .................................. SUCCESS [ 18.086 s]
[INFO] Commons RDF: Simple Implementation ................ FAILURE [  8.697 s]
[INFO] ------------------------------------------------------------------------
[INFO] BUILD FAILURE
[INFO] ------------------------------------------------------------------------
[INFO] Total time: 01:32 min
[INFO] Finished at: 2015-04-05T21:58:27+00:00
[INFO] Final Memory: 37M/346M
[INFO] ------------------------------------------------------------------------
[ERROR] Failed to execute goal org.apache.maven.plugins:maven-javadoc-plugin:2.9.1:jar (default)
on project commons-rdf-simple: MavenReportException: Error while creating archive:
[ERROR] Exit code: 1 - javadoc: warning - Error fetching URL: http://docs.oracle.com/javase/7/docs/api
[ERROR] javadoc: warning - Error fetching URL: http://docs.oracle.com/javaee/6/api
[ERROR] <https://builds.apache.org/job/incubator-commonsrdf/ws/simple/src/main/java/org/apache/commons/rdf/simple/SimpleRDFTermFactory.java>:24:
error: self-closing element not allowed
[ERROR] * <p/>
[ERROR] ^
[ERROR] 
[ERROR] Command line was: /home/jenkins/tools/java/jdk1.8.0/jre/../bin/javadoc @options @packages
[ERROR] 
[ERROR] Refer to the generated Javadoc files in '<https://builds.apache.org/job/incubator-commonsrdf/ws/simple/target/apidocs'>
dir.
[ERROR] -> [Help 1]
[ERROR] 
[ERROR] To see the full stack trace of the errors, re-run Maven with the -e switch.
[ERROR] Re-run Maven using the -X switch to enable full debug logging.
[ERROR] 
[ERROR] For more information about the errors and possible solutions, please read the following
articles:
[ERROR] [Help 1] http://cwiki.apache.org/confluence/display/MAVEN/MojoExecutionException
[ERROR] 
[ERROR] After correcting the problems, you can resume the build with the command
[ERROR]   mvn <goals> -rf :commons-rdf-simple
[JENKINS] Archiving <https://builds.apache.org/job/incubator-commonsrdf/ws/simple/pom.xml>
to org.apache.commons/commons-rdf-simple/0.0.3-SNAPSHOT/commons-rdf-simple-0.0.3-SNAPSHOT.pom
[JENKINS] Archiving <https://builds.apache.org/job/incubator-commonsrdf/ws/simple/target/commons-rdf-simple-0.0.3-SNAPSHOT.jar>
to org.apache.commons/commons-rdf-simple/0.0.3-SNAPSHOT/commons-rdf-simple-0.0.3-SNAPSHOT.jar
[JENKINS] Archiving <https://builds.apache.org/job/incubator-commonsrdf/ws/simple/target/commons-rdf-simple-0.0.3-SNAPSHOT-sources.jar>
to org.apache.commons/commons-rdf-simple/0.0.3-SNAPSHOT/commons-rdf-simple-0.0.3-SNAPSHOT-sources.jar
[JENKINS] Archiving <https://builds.apache.org/job/incubator-commonsrdf/ws/simple/target/commons-rdf-simple-0.0.3-SNAPSHOT-test-sources.jar>
to org.apache.commons/commons-rdf-simple/0.0.3-SNAPSHOT/commons-rdf-simple-0.0.3-SNAPSHOT-test-sources.jar
No prior successful build to compare, so performing full copy of artifacts
[JENKINS] Archiving <https://builds.apache.org/job/incubator-commonsrdf/ws/api/pom.xml>
to org.apache.commons/commons-rdf-api/0.0.3-SNAPSHOT/commons-rdf-api-0.0.3-SNAPSHOT.pom
[JENKINS] Archiving <https://builds.apache.org/job/incubator-commonsrdf/ws/api/target/commons-rdf-api-0.0.3-SNAPSHOT.jar>
to org.apache.commons/commons-rdf-api/0.0.3-SNAPSHOT/commons-rdf-api-0.0.3-SNAPSHOT.jar
[JENKINS] Archiving <https://builds.apache.org/job/incubator-commonsrdf/ws/api/target/commons-rdf-api-0.0.3-SNAPSHOT-sources.jar>
to org.apache.commons/commons-rdf-api/0.0.3-SNAPSHOT/commons-rdf-api-0.0.3-SNAPSHOT-sources.jar
[JENKINS] Archiving <https://builds.apache.org/job/incubator-commonsrdf/ws/api/target/commons-rdf-api-0.0.3-SNAPSHOT-test-sources.jar>
to org.apache.commons/commons-rdf-api/0.0.3-SNAPSHOT/commons-rdf-api-0.0.3-SNAPSHOT-test-sources.jar
[JENKINS] Archiving <https://builds.apache.org/job/incubator-commonsrdf/ws/api/target/commons-rdf-api-0.0.3-SNAPSHOT-javadoc.jar>
to org.apache.commons/commons-rdf-api/0.0.3-SNAPSHOT/commons-rdf-api-0.0.3-SNAPSHOT-javadoc.jar
[JENKINS] Archiving <https://builds.apache.org/job/incubator-commonsrdf/ws/api/target/commons-rdf-api-0.0.3-SNAPSHOT-tests.jar>
to org.apache.commons/commons-rdf-api/0.0.3-SNAPSHOT/commons-rdf-api-0.0.3-SNAPSHOT-tests.jar
No prior successful build to compare, so performing full copy of artifacts
[JENKINS] Archiving <https://builds.apache.org/job/incubator-commonsrdf/ws/pom.xml>
to org.apache.commons/commons-rdf-parent/0.0.3-SNAPSHOT/commons-rdf-parent-0.0.3-SNAPSHOT.pom
No prior successful build to compare, so performing full copy of artifacts
channel stopped

Mime
View raw message