commons-notifications mailing list archives

Site index · List index
Message view « Date » · « Thread »
Top « Date » · « Thread »
From Apache Jenkins Server <jenk...@builds.apache.org>
Subject Build failed in Jenkins: commons-lang #315
Date Sun, 07 Jan 2018 01:32:22 GMT
See <https://builds.apache.org/job/commons-lang/315/display/redirect?page=changes>

Changes:

[chtompki] Happy New Year

------------------------------------------
[...truncated 30.76 KB...]
Tests run: 4, Failures: 0, Errors: 0, Skipped: 0, Time elapsed: 0.005 sec - in org.apache.commons.lang3.text.translate.NumericEntityEscaperTest
Running org.apache.commons.lang3.text.translate.NumericEntityUnescaperTest
Tests run: 3, Failures: 0, Errors: 0, Skipped: 0, Time elapsed: 0.001 sec - in org.apache.commons.lang3.text.translate.NumericEntityUnescaperTest
Running org.apache.commons.lang3.text.translate.OctalUnescaperTest
Tests run: 1, Failures: 0, Errors: 0, Skipped: 0, Time elapsed: 0.001 sec - in org.apache.commons.lang3.text.translate.OctalUnescaperTest
Running org.apache.commons.lang3.text.translate.UnicodeEscaperTest
Tests run: 3, Failures: 0, Errors: 0, Skipped: 0, Time elapsed: 0.001 sec - in org.apache.commons.lang3.text.translate.UnicodeEscaperTest
Running org.apache.commons.lang3.text.translate.UnicodeUnescaperTest
Tests run: 3, Failures: 0, Errors: 0, Skipped: 0, Time elapsed: 0.003 sec - in org.apache.commons.lang3.text.translate.UnicodeUnescaperTest
Running org.apache.commons.lang3.text.translate.UnicodeUnpairedSurrogateRemoverTest
Tests run: 2, Failures: 0, Errors: 0, Skipped: 0, Time elapsed: 0 sec - in org.apache.commons.lang3.text.translate.UnicodeUnpairedSurrogateRemoverTest
Running org.apache.commons.lang3.text.WordUtilsTest
Tests run: 15, Failures: 0, Errors: 0, Skipped: 0, Time elapsed: 0.003 sec - in org.apache.commons.lang3.text.WordUtilsTest
Running org.apache.commons.lang3.ThreadUtilsTest
Tests run: 27, Failures: 0, Errors: 0, Skipped: 0, Time elapsed: 0.041 sec - in org.apache.commons.lang3.ThreadUtilsTest
Running org.apache.commons.lang3.time.DateFormatUtilsTest
Tests run: 12, Failures: 0, Errors: 0, Skipped: 0, Time elapsed: 0.108 sec - in org.apache.commons.lang3.time.DateFormatUtilsTest
Running org.apache.commons.lang3.time.DateUtilsFragmentTest
Tests run: 57, Failures: 0, Errors: 0, Skipped: 0, Time elapsed: 0.016 sec - in org.apache.commons.lang3.time.DateUtilsFragmentTest
Running org.apache.commons.lang3.time.DateUtilsRoundingTest
Tests run: 22, Failures: 0, Errors: 0, Skipped: 0, Time elapsed: 0.034 sec - in org.apache.commons.lang3.time.DateUtilsRoundingTest
Running org.apache.commons.lang3.time.DateUtilsTest
Tests run: 63, Failures: 0, Errors: 0, Skipped: 0, Time elapsed: 0.12 sec - in org.apache.commons.lang3.time.DateUtilsTest
Running org.apache.commons.lang3.time.DurationFormatUtilsTest
Tests run: 25, Failures: 0, Errors: 0, Skipped: 0, Time elapsed: 0.697 sec - in org.apache.commons.lang3.time.DurationFormatUtilsTest
Running org.apache.commons.lang3.time.FastDateFormatTest
>>FastDateFormatTest: FastDatePrinter:503  SimpleDateFormat:2934
>>FastDateFormatTest: FastDateParser:682  SimpleDateFormat:2917
Tests run: 16, Failures: 0, Errors: 0, Skipped: 0, Time elapsed: 0.967 sec - in org.apache.commons.lang3.time.FastDateFormatTest
Running org.apache.commons.lang3.time.FastDateFormat_ParserTest
Tests run: 37, Failures: 0, Errors: 0, Skipped: 0, Time elapsed: 1.254 sec - in org.apache.commons.lang3.time.FastDateFormat_ParserTest
Running org.apache.commons.lang3.time.FastDateFormat_PrinterTest
Tests run: 22, Failures: 0, Errors: 0, Skipped: 0, Time elapsed: 0.018 sec - in org.apache.commons.lang3.time.FastDateFormat_PrinterTest
Running org.apache.commons.lang3.time.FastDateParserSDFTest
Tests run: 276, Failures: 0, Errors: 0, Skipped: 0, Time elapsed: 0.233 sec - in org.apache.commons.lang3.time.FastDateParserSDFTest
Running org.apache.commons.lang3.time.FastDateParserTest
Tests run: 37, Failures: 0, Errors: 0, Skipped: 0, Time elapsed: 0.443 sec - in org.apache.commons.lang3.time.FastDateParserTest
Running org.apache.commons.lang3.time.FastDateParser_MoreOrLessTest
Tests run: 7, Failures: 0, Errors: 0, Skipped: 0, Time elapsed: 0.001 sec - in org.apache.commons.lang3.time.FastDateParser_MoreOrLessTest
Running org.apache.commons.lang3.time.FastDateParser_TimeZoneStrategyTest
Tests run: 2, Failures: 0, Errors: 0, Skipped: 0, Time elapsed: 4.526 sec - in org.apache.commons.lang3.time.FastDateParser_TimeZoneStrategyTest
Running org.apache.commons.lang3.time.FastDatePrinterTest
Tests run: 22, Failures: 0, Errors: 0, Skipped: 0, Time elapsed: 0.008 sec - in org.apache.commons.lang3.time.FastDatePrinterTest
Running org.apache.commons.lang3.time.FastDatePrinterTimeZonesTest
Tests run: 628, Failures: 0, Errors: 0, Skipped: 0, Time elapsed: 0.173 sec - in org.apache.commons.lang3.time.FastDatePrinterTimeZonesTest
Running org.apache.commons.lang3.time.FastTimeZoneTest
Tests run: 10, Failures: 0, Errors: 0, Skipped: 0, Time elapsed: 0 sec - in org.apache.commons.lang3.time.FastTimeZoneTest
Running org.apache.commons.lang3.time.GmtTimeZoneTest
Tests run: 12, Failures: 0, Errors: 0, Skipped: 0, Time elapsed: 0 sec - in org.apache.commons.lang3.time.GmtTimeZoneTest
Running org.apache.commons.lang3.time.StopWatchTest
Tests run: 10, Failures: 0, Errors: 0, Skipped: 0, Time elapsed: 4.751 sec - in org.apache.commons.lang3.time.StopWatchTest
Running org.apache.commons.lang3.time.WeekYearTest
Tests run: 32, Failures: 0, Errors: 0, Skipped: 0, Time elapsed: 0.008 sec - in org.apache.commons.lang3.time.WeekYearTest
Running org.apache.commons.lang3.tuple.ImmutablePairTest
Tests run: 13, Failures: 0, Errors: 0, Skipped: 0, Time elapsed: 0.002 sec - in org.apache.commons.lang3.tuple.ImmutablePairTest
Running org.apache.commons.lang3.tuple.ImmutableTripleTest
Tests run: 12, Failures: 0, Errors: 0, Skipped: 0, Time elapsed: 0.004 sec - in org.apache.commons.lang3.tuple.ImmutableTripleTest
Running org.apache.commons.lang3.tuple.MutablePairTest
Tests run: 8, Failures: 0, Errors: 0, Skipped: 0, Time elapsed: 0.002 sec - in org.apache.commons.lang3.tuple.MutablePairTest
Running org.apache.commons.lang3.tuple.MutableTripleTest
Tests run: 8, Failures: 0, Errors: 0, Skipped: 0, Time elapsed: 0.001 sec - in org.apache.commons.lang3.tuple.MutableTripleTest
Running org.apache.commons.lang3.tuple.PairTest
Tests run: 9, Failures: 0, Errors: 0, Skipped: 0, Time elapsed: 0.001 sec - in org.apache.commons.lang3.tuple.PairTest
Running org.apache.commons.lang3.tuple.TripleTest
Tests run: 10, Failures: 0, Errors: 0, Skipped: 0, Time elapsed: 0 sec - in org.apache.commons.lang3.tuple.TripleTest
Running org.apache.commons.lang3.ValidateTest
Tests run: 67, Failures: 0, Errors: 0, Skipped: 0, Time elapsed: 0.011 sec - in org.apache.commons.lang3.ValidateTest

Results :

Tests run: 4078, Failures: 0, Errors: 0, Skipped: 5

[JENKINS] Recording test results
[INFO] 
[INFO] --- maven-jar-plugin:3.0.0:jar (default-jar) @ commons-lang3 ---
[INFO] Building jar: <https://builds.apache.org/job/commons-lang/ws/target\commons-lang3-3.8-SNAPSHOT.jar>
[INFO] 
[INFO] --- maven-site-plugin:3.6:attach-descriptor (attach-descriptor) @ commons-lang3 ---
[INFO] Skipping because packaging 'jar' is not pom.
[INFO] 
[INFO] >>> maven-javadoc-plugin:2.10.4:javadoc (create-javadoc-jar) > generate-sources
@ commons-lang3 >>>
[INFO] 
[INFO] --- maven-enforcer-plugin:1.4.1:enforce (enforce-maven-3) @ commons-lang3 ---
[INFO] 
[INFO] --- build-helper-maven-plugin:1.10:parse-version (parse-version) @ commons-lang3 ---
[INFO] 
[INFO] --- maven-antrun-plugin:1.8:run (javadoc.resources) @ commons-lang3 ---
[INFO] Executing tasks

main:
[INFO] Executed tasks
[WARNING] Failed to getClass for org.apache.maven.plugin.javadoc.JavadocReport
[INFO] 
[INFO] <<< maven-javadoc-plugin:2.10.4:javadoc (create-javadoc-jar) < generate-sources
@ commons-lang3 <<<
[INFO] 
[INFO] 
[INFO] --- maven-javadoc-plugin:2.10.4:javadoc (create-javadoc-jar) @ commons-lang3 ---
[JENKINS] Archiving  javadoc
[INFO] 
[INFO] --- maven-javadoc-plugin:2.10.4:jar (create-javadoc-jar) @ commons-lang3 ---
[INFO] Building jar: <https://builds.apache.org/job/commons-lang/ws/target\commons-lang3-3.8-SNAPSHOT-javadoc.jar>
[INFO] 
[INFO] >>> maven-source-plugin:3.0.1:jar (create-source-jar) > generate-sources
@ commons-lang3 >>>
[INFO] 
[INFO] --- maven-enforcer-plugin:1.4.1:enforce (enforce-maven-3) @ commons-lang3 ---
[INFO] 
[INFO] --- build-helper-maven-plugin:1.10:parse-version (parse-version) @ commons-lang3 ---
[INFO] 
[INFO] --- maven-antrun-plugin:1.8:run (javadoc.resources) @ commons-lang3 ---
[INFO] Executing tasks

main:
[INFO] Executed tasks
[WARNING] Failed to getClass for org.apache.maven.plugins.source.SourceJarMojo
[INFO] 
[INFO] <<< maven-source-plugin:3.0.1:jar (create-source-jar) < generate-sources
@ commons-lang3 <<<
[INFO] 
[INFO] 
[INFO] --- maven-source-plugin:3.0.1:jar (create-source-jar) @ commons-lang3 ---
[INFO] Building jar: <https://builds.apache.org/job/commons-lang/ws/target\commons-lang3-3.8-SNAPSHOT-sources.jar>
[INFO] 
[INFO] >>> maven-source-plugin:3.0.1:test-jar (create-source-jar) > generate-sources
@ commons-lang3 >>>
[INFO] 
[INFO] --- maven-enforcer-plugin:1.4.1:enforce (enforce-maven-3) @ commons-lang3 ---
[INFO] 
[INFO] --- build-helper-maven-plugin:1.10:parse-version (parse-version) @ commons-lang3 ---
[INFO] 
[INFO] --- maven-antrun-plugin:1.8:run (javadoc.resources) @ commons-lang3 ---
[INFO] Executing tasks

main:
[INFO] Executed tasks
[WARNING] Failed to getClass for org.apache.maven.plugins.source.TestSourceJarMojo
[INFO] 
[INFO] <<< maven-source-plugin:3.0.1:test-jar (create-source-jar) < generate-sources
@ commons-lang3 <<<
[INFO] 
[INFO] 
[INFO] --- maven-source-plugin:3.0.1:test-jar (create-source-jar) @ commons-lang3 ---
[INFO] Building jar: <https://builds.apache.org/job/commons-lang/ws/target\commons-lang3-3.8-SNAPSHOT-test-sources.jar>
[INFO] 
[INFO] --- maven-jar-plugin:3.0.0:test-jar (default) @ commons-lang3 ---
[INFO] Building jar: <https://builds.apache.org/job/commons-lang/ws/target\commons-lang3-3.8-SNAPSHOT-tests.jar>
[INFO] 
[INFO] --- maven-assembly-plugin:2.6:single (default) @ commons-lang3 ---
[INFO] Reading assembly descriptor: src/assembly/bin.xml
[INFO] Reading assembly descriptor: src/assembly/src.xml
[INFO] Building tar: <https://builds.apache.org/job/commons-lang/ws/target\commons-lang3-3.8-SNAPSHOT-bin.tar.gz>
[INFO] Building zip: <https://builds.apache.org/job/commons-lang/ws/target\commons-lang3-3.8-SNAPSHOT-bin.zip>
[INFO] Building tar: <https://builds.apache.org/job/commons-lang/ws/target\commons-lang3-3.8-SNAPSHOT-src.tar.gz>
[INFO] Building zip: <https://builds.apache.org/job/commons-lang/ws/target\commons-lang3-3.8-SNAPSHOT-src.zip>
[INFO] 
[INFO] --- maven-gpg-plugin:1.6:sign (sign-artifacts) @ commons-lang3 ---
[INFO] 
[INFO] --- maven-install-plugin:2.5.2:install (default-install) @ commons-lang3 ---
[INFO] Installing <https://builds.apache.org/job/commons-lang/ws/target\commons-lang3-3.8-SNAPSHOT.jar>
to f:\jenkins\jenkins-slave\maven-repositories\1\org\apache\commons\commons-lang3\3.8-SNAPSHOT\commons-lang3-3.8-SNAPSHOT.jar
[INFO] Installing <https://builds.apache.org/job/commons-lang/ws/pom.xml> to f:\jenkins\jenkins-slave\maven-repositories\1\org\apache\commons\commons-lang3\3.8-SNAPSHOT\commons-lang3-3.8-SNAPSHOT.pom
[INFO] Installing <https://builds.apache.org/job/commons-lang/ws/target\commons-lang3-3.8-SNAPSHOT-javadoc.jar>
to f:\jenkins\jenkins-slave\maven-repositories\1\org\apache\commons\commons-lang3\3.8-SNAPSHOT\commons-lang3-3.8-SNAPSHOT-javadoc.jar
[INFO] Installing <https://builds.apache.org/job/commons-lang/ws/target\commons-lang3-3.8-SNAPSHOT-sources.jar>
to f:\jenkins\jenkins-slave\maven-repositories\1\org\apache\commons\commons-lang3\3.8-SNAPSHOT\commons-lang3-3.8-SNAPSHOT-sources.jar
[INFO] Installing <https://builds.apache.org/job/commons-lang/ws/target\commons-lang3-3.8-SNAPSHOT-test-sources.jar>
to f:\jenkins\jenkins-slave\maven-repositories\1\org\apache\commons\commons-lang3\3.8-SNAPSHOT\commons-lang3-3.8-SNAPSHOT-test-sources.jar
[INFO] Installing <https://builds.apache.org/job/commons-lang/ws/target\commons-lang3-3.8-SNAPSHOT-tests.jar>
to f:\jenkins\jenkins-slave\maven-repositories\1\org\apache\commons\commons-lang3\3.8-SNAPSHOT\commons-lang3-3.8-SNAPSHOT-tests.jar
[INFO] Installing <https://builds.apache.org/job/commons-lang/ws/target\commons-lang3-3.8-SNAPSHOT-bin.tar.gz>
to f:\jenkins\jenkins-slave\maven-repositories\1\org\apache\commons\commons-lang3\3.8-SNAPSHOT\commons-lang3-3.8-SNAPSHOT-bin.tar.gz
[INFO] Installing <https://builds.apache.org/job/commons-lang/ws/target\commons-lang3-3.8-SNAPSHOT-bin.zip>
to f:\jenkins\jenkins-slave\maven-repositories\1\org\apache\commons\commons-lang3\3.8-SNAPSHOT\commons-lang3-3.8-SNAPSHOT-bin.zip
[INFO] Installing <https://builds.apache.org/job/commons-lang/ws/target\commons-lang3-3.8-SNAPSHOT-src.tar.gz>
to f:\jenkins\jenkins-slave\maven-repositories\1\org\apache\commons\commons-lang3\3.8-SNAPSHOT\commons-lang3-3.8-SNAPSHOT-src.tar.gz
[INFO] Installing <https://builds.apache.org/job/commons-lang/ws/target\commons-lang3-3.8-SNAPSHOT-src.zip>
to f:\jenkins\jenkins-slave\maven-repositories\1\org\apache\commons\commons-lang3\3.8-SNAPSHOT\commons-lang3-3.8-SNAPSHOT-src.zip
[INFO] 
[INFO] >>> maven-javadoc-plugin:2.10.4:javadoc (default-cli) > generate-sources
@ commons-lang3 >>>
[INFO] 
[INFO] --- maven-enforcer-plugin:1.4.1:enforce (enforce-maven-3) @ commons-lang3 ---
[INFO] 
[INFO] --- build-helper-maven-plugin:1.10:parse-version (parse-version) @ commons-lang3 ---
[INFO] 
[INFO] --- maven-antrun-plugin:1.8:run (javadoc.resources) @ commons-lang3 ---
[INFO] Executing tasks

main:
[INFO] Executed tasks
[WARNING] Failed to getClass for org.apache.maven.plugin.javadoc.JavadocReport
[JENKINS] Archiving  javadoc
[INFO] 
[INFO] <<< maven-javadoc-plugin:2.10.4:javadoc (default-cli) < generate-sources
@ commons-lang3 <<<
[INFO] 
[INFO] 
[INFO] --- maven-javadoc-plugin:2.10.4:javadoc (default-cli) @ commons-lang3 ---
[JENKINS] Archiving  javadoc
[INFO] ------------------------------------------------------------------------
[INFO] BUILD SUCCESS
[INFO] ------------------------------------------------------------------------
[INFO] Total time: 01:46 min
[INFO] Finished at: 2018-01-07T01:32:10Z
[INFO] Final Memory: 57M/789M
[INFO] ------------------------------------------------------------------------
[JENKINS] Archiving <https://builds.apache.org/job/commons-lang/ws/pom.xml> to org.apache.commons/commons-lang3/3.8-SNAPSHOT/commons-lang3-3.8-SNAPSHOT.pom
[JENKINS] Archiving <https://builds.apache.org/job/commons-lang/ws/target\commons-lang3-3.8-SNAPSHOT.jar>
to org.apache.commons/commons-lang3/3.8-SNAPSHOT/commons-lang3-3.8-SNAPSHOT.jar
[JENKINS] Archiving <https://builds.apache.org/job/commons-lang/ws/target\commons-lang3-3.8-SNAPSHOT-javadoc.jar>
to org.apache.commons/commons-lang3/3.8-SNAPSHOT/commons-lang3-3.8-SNAPSHOT-javadoc.jar
[JENKINS] Archiving <https://builds.apache.org/job/commons-lang/ws/target\commons-lang3-3.8-SNAPSHOT-sources.jar>
to org.apache.commons/commons-lang3/3.8-SNAPSHOT/commons-lang3-3.8-SNAPSHOT-sources.jar
[JENKINS] Archiving <https://builds.apache.org/job/commons-lang/ws/target\commons-lang3-3.8-SNAPSHOT-test-sources.jar>
to org.apache.commons/commons-lang3/3.8-SNAPSHOT/commons-lang3-3.8-SNAPSHOT-test-sources.jar
[JENKINS] Archiving <https://builds.apache.org/job/commons-lang/ws/target\commons-lang3-3.8-SNAPSHOT-tests.jar>
to org.apache.commons/commons-lang3/3.8-SNAPSHOT/commons-lang3-3.8-SNAPSHOT-tests.jar
[JENKINS] Archiving <https://builds.apache.org/job/commons-lang/ws/target\commons-lang3-3.8-SNAPSHOT-bin.tar.gz>
to org.apache.commons/commons-lang3/3.8-SNAPSHOT/commons-lang3-3.8-SNAPSHOT-bin.tar.gz
[JENKINS] Archiving <https://builds.apache.org/job/commons-lang/ws/target\commons-lang3-3.8-SNAPSHOT-bin.zip>
to org.apache.commons/commons-lang3/3.8-SNAPSHOT/commons-lang3-3.8-SNAPSHOT-bin.zip
[JENKINS] Archiving <https://builds.apache.org/job/commons-lang/ws/target\commons-lang3-3.8-SNAPSHOT-src.tar.gz>
to org.apache.commons/commons-lang3/3.8-SNAPSHOT/commons-lang3-3.8-SNAPSHOT-src.tar.gz
[JENKINS] Archiving <https://builds.apache.org/job/commons-lang/ws/target\commons-lang3-3.8-SNAPSHOT-src.zip>
to org.apache.commons/commons-lang3/3.8-SNAPSHOT/commons-lang3-3.8-SNAPSHOT-src.zip
channel stopped
Maven RedeployPublisher use remote windows-2012-3 maven settings from : C:\Users\jenkins/.m2/settings.xml
[INFO] Deployment in https://repository.apache.org/content/repositories/snapshots (id=apache.snapshots.https,uniqueVersion=true)
Deploying the main artifact commons-lang3-3.8-SNAPSHOT.jar
Downloading: https://repository.apache.org/content/repositories/snapshots/org/apache/commons/commons-lang3/3.8-SNAPSHOT/maven-metadata.xml
Downloaded: https://repository.apache.org/content/repositories/snapshots/org/apache/commons/commons-lang3/3.8-SNAPSHOT/maven-metadata.xml
(3 KB at 3.1 KB/sec)
Uploading: https://repository.apache.org/content/repositories/snapshots/org/apache/commons/commons-lang3/3.8-SNAPSHOT/commons-lang3-3.8-20180107.013218-23.jar
Uploading: https://repository.apache.org/content/repositories/snapshots/org/apache/commons/commons-lang3/3.8-SNAPSHOT/commons-lang3-3.8-20180107.013218-23.pom
ERROR: Failed to deploy artifacts: Could not transfer artifact org.apache.commons:commons-lang3:jar:3.8-20180107.013218-23
from/to apache.snapshots.https (https://repository.apache.org/content/repositories/snapshots):
Failed to transfer file: https://repository.apache.org/content/repositories/snapshots/org/apache/commons/commons-lang3/3.8-SNAPSHOT/commons-lang3-3.8-20180107.013218-23.jar.
Return code is: 401, ReasonPhrase: Unauthorized.
org.apache.maven.artifact.deployer.ArtifactDeploymentException: Failed to deploy artifacts:
Could not transfer artifact org.apache.commons:commons-lang3:jar:3.8-20180107.013218-23 from/to
apache.snapshots.https (https://repository.apache.org/content/repositories/snapshots): Failed
to transfer file: https://repository.apache.org/content/repositories/snapshots/org/apache/commons/commons-lang3/3.8-SNAPSHOT/commons-lang3-3.8-20180107.013218-23.jar.
Return code is: 401, ReasonPhrase: Unauthorized.
	at org.apache.maven.artifact.deployer.DefaultArtifactDeployer.deploy(DefaultArtifactDeployer.java:143)
	at hudson.maven.reporters.MavenArtifactRecord.deploy(MavenArtifactRecord.java:193)
	at hudson.maven.RedeployPublisher.perform(RedeployPublisher.java:176)
	at hudson.tasks.BuildStepMonitor$1.perform(BuildStepMonitor.java:20)
	at hudson.model.AbstractBuild$AbstractBuildExecution.perform(AbstractBuild.java:744)
	at hudson.model.AbstractBuild$AbstractBuildExecution.performAllBuildSteps(AbstractBuild.java:690)
	at hudson.maven.MavenModuleSetBuild$MavenModuleSetBuildExecution.post2(MavenModuleSetBuild.java:1073)
	at hudson.model.AbstractBuild$AbstractBuildExecution.post(AbstractBuild.java:635)
	at hudson.model.Run.execute(Run.java:1749)
	at hudson.maven.MavenModuleSetBuild.run(MavenModuleSetBuild.java:543)
	at hudson.model.ResourceController.execute(ResourceController.java:97)
	at hudson.model.Executor.run(Executor.java:421)
Caused by: org.eclipse.aether.deployment.DeploymentException: Failed to deploy artifacts:
Could not transfer artifact org.apache.commons:commons-lang3:jar:3.8-20180107.013218-23 from/to
apache.snapshots.https (https://repository.apache.org/content/repositories/snapshots): Failed
to transfer file: https://repository.apache.org/content/repositories/snapshots/org/apache/commons/commons-lang3/3.8-SNAPSHOT/commons-lang3-3.8-20180107.013218-23.jar.
Return code is: 401, ReasonPhrase: Unauthorized.
	at org.eclipse.aether.internal.impl.DefaultDeployer.deploy(DefaultDeployer.java:317)
	at org.eclipse.aether.internal.impl.DefaultDeployer.deploy(DefaultDeployer.java:245)
	at org.eclipse.aether.internal.impl.DefaultRepositorySystem.deploy(DefaultRepositorySystem.java:420)
	at org.apache.maven.artifact.deployer.DefaultArtifactDeployer.deploy(DefaultArtifactDeployer.java:139)
	... 11 more
Caused by: org.eclipse.aether.transfer.ArtifactTransferException: Could not transfer artifact
org.apache.commons:commons-lang3:jar:3.8-20180107.013218-23 from/to apache.snapshots.https
(https://repository.apache.org/content/repositories/snapshots): Failed to transfer file: https://repository.apache.org/content/repositories/snapshots/org/apache/commons/commons-lang3/3.8-SNAPSHOT/commons-lang3-3.8-20180107.013218-23.jar.
Return code is: 401, ReasonPhrase: Unauthorized.
	at org.eclipse.aether.connector.basic.ArtifactTransportListener.transferFailed(ArtifactTransportListener.java:43)
	at org.eclipse.aether.connector.basic.BasicRepositoryConnector$TaskRunner.run(BasicRepositoryConnector.java:355)
	at org.eclipse.aether.connector.basic.BasicRepositoryConnector.put(BasicRepositoryConnector.java:274)
	at org.eclipse.aether.internal.impl.DefaultDeployer.deploy(DefaultDeployer.java:311)
	... 14 more
Caused by: org.apache.maven.wagon.TransferFailedException: Failed to transfer file: https://repository.apache.org/content/repositories/snapshots/org/apache/commons/commons-lang3/3.8-SNAPSHOT/commons-lang3-3.8-20180107.013218-23.jar.
Return code is: 401, ReasonPhrase: Unauthorized.
	at org.apache.maven.wagon.shared.http.AbstractHttpClientWagon.put(AbstractHttpClientWagon.java:635)
	at org.apache.maven.wagon.shared.http.AbstractHttpClientWagon.put(AbstractHttpClientWagon.java:557)
	at org.apache.maven.wagon.shared.http.AbstractHttpClientWagon.put(AbstractHttpClientWagon.java:539)
	at org.apache.maven.wagon.shared.http.AbstractHttpClientWagon.put(AbstractHttpClientWagon.java:533)
	at org.apache.maven.wagon.shared.http.AbstractHttpClientWagon.put(AbstractHttpClientWagon.java:513)
	at org.eclipse.aether.transport.wagon.WagonTransporter$PutTaskRunner.run(WagonTransporter.java:644)
	at org.eclipse.aether.transport.wagon.WagonTransporter.execute(WagonTransporter.java:427)
	at org.eclipse.aether.transport.wagon.WagonTransporter.put(WagonTransporter.java:410)
	at org.eclipse.aether.connector.basic.BasicRepositoryConnector$PutTaskRunner.runTask(BasicRepositoryConnector.java:510)
	at org.eclipse.aether.connector.basic.BasicRepositoryConnector$TaskRunner.run(BasicRepositoryConnector.java:350)
	... 16 more
[INFO] Deployment failed after 4.3 sec
Build step 'Deploy artifacts to Maven repository' changed build result to FAILURE

Mime
View raw message