commons-notifications mailing list archives

Site index · List index
Message view « Date » · « Thread »
Top « Date » · « Thread »
From Apache Jenkins Server <jenk...@builds.apache.org>
Subject Build failed in Jenkins: commons-beanutils #36
Date Wed, 27 Dec 2017 19:41:01 GMT
See <https://builds.apache.org/job/commons-beanutils/36/display/redirect?page=changes>

Changes:

[ggregory] [BEANUTILS-504] Update from Java 6 to 7. Remove redundant type arguments.

[ggregory] [BEANUTILS-504] Update from Java 6 to 7. Add missing '@Override' annotations.

[ggregory] [BEANUTILS-504] Update from Java 6 to 7.

[ggregory] Remove needless type casts.

[ggregory] Describe version 2.0.0.

[ggregory] Remove unused imports.

[ggregory] Use final.

[ggregory] Remove trailing whitespace.

------------------------------------------
Started by an SCM change
[EnvInject] - Loading node environment variables.
Building remotely on H16 (Hadoop xenial) in workspace <https://builds.apache.org/job/commons-beanutils/ws/>
Updating https://svn.apache.org/repos/asf/commons/proper/beanutils/trunk at revision '2017-12-27T19:40:12.482
+0000'
U         src/changes/changes.xml
U         src/test/java/org/apache/commons/beanutils/AbstractChild.java
U         src/test/java/org/apache/commons/beanutils/converters/ArrayConverterTestCase.java
U         src/test/java/org/apache/commons/beanutils/converters/BooleanConverterTestCase.java
U         src/test/java/org/apache/commons/beanutils/converters/MemoryTestCase.java
U         src/test/java/org/apache/commons/beanutils/converters/SqlTimestampConverterTestCase.java
U         src/test/java/org/apache/commons/beanutils/AlphaBean.java
U         src/test/java/org/apache/commons/beanutils/BeanIntrospectionDataTestCase.java
U         src/test/java/org/apache/commons/beanutils/bugs/Jira422TestCase.java
U         src/test/java/org/apache/commons/beanutils/bugs/Jira157TestCase.java
U         src/test/java/org/apache/commons/beanutils/bugs/Jira347TestCase.java
U         src/test/java/org/apache/commons/beanutils/bugs/Jira357TestCase.java
U         src/test/java/org/apache/commons/beanutils/bugs/Jira339TestCase.java
U         src/test/java/org/apache/commons/beanutils/bugs/Jira465TestCase.java
U         src/test/java/org/apache/commons/beanutils/bugs/Jira492TestCase.java
U         src/test/java/org/apache/commons/beanutils/bugs/Jira493TestCase.java
U         src/test/java/org/apache/commons/beanutils/bugs/Jira61TestCase.java
U         src/test/java/org/apache/commons/beanutils/bugs/other/Jira61BeanFactory.java
U         src/test/java/org/apache/commons/beanutils/bugs/other/Jira18BeanFactory.java
U         src/test/java/org/apache/commons/beanutils/bugs/other/Jira492IndexedListsSupport.java
U         src/test/java/org/apache/commons/beanutils/bugs/other/Jira87BeanFactory.java
U         src/test/java/org/apache/commons/beanutils/BeanUtilsTestCase.java
U         src/test/java/org/apache/commons/beanutils/BeanUtilsBenchCase.java
U         src/test/java/org/apache/commons/beanutils/BeanificationTestCase.java
U         src/test/java/org/apache/commons/beanutils/DynaBeanUtilsTestCase.java
U         src/test/java/org/apache/commons/beanutils/MappedPropertyTestBean.java
U         src/test/java/org/apache/commons/beanutils/IndexedPropertyTestCase.java
U         src/test/java/org/apache/commons/beanutils/LazyDynaListTestCase.java
U         src/test/java/org/apache/commons/beanutils/ConvertUtilsTestCase.java
U         src/test/java/org/apache/commons/beanutils/PropertyUtilsBenchCase.java
U         src/test/java/org/apache/commons/beanutils/BasicDynaBeanTestCase.java
U         src/test/java/org/apache/commons/beanutils/locale/LocaleBeanificationTestCase.java
U         src/test/java/org/apache/commons/beanutils/BeanComparatorTestCase.java
U         src/test/java/org/apache/commons/beanutils/SuppressPropertiesBeanIntrospectorTestCase.java
U         src/test/java/org/apache/commons/beanutils/BeanMapTestCase.java
U         src/test/java/org/apache/commons/beanutils/priv/PrivateBean.java
U         src/test/java/org/apache/commons/beanutils/PropertyUtilsTestCase.java
U         src/test/java/org/apache/commons/beanutils/TestBean.java
U         src/test/java/org/apache/commons/beanutils/DefaultIntrospectionContextTestCase.java
U         src/test/java/org/apache/commons/beanutils/memoryleaktests/MemoryLeakTestCase.java
U         src/test/java/org/apache/commons/beanutils/memoryleaktests/pojotests/SomeMappedPojo.java
U         src/test/java/org/apache/commons/beanutils/ThrowExceptionConverter.java
U         src/test/java/org/apache/commons/beanutils/DynaPropertyUtilsTestCase.java
U         src/test/java/org/apache/commons/beanutils/DynaBeanMapDecoratorTestCase.java
U         src/test/java/org/apache/commons/beanutils/TestResultSet.java
U         src/test/java/org/apache/commons/beanutils/TestResultSetMetaData.java
U         src/test/java/org/apache/commons/beanutils/FluentPropertyBeanIntrospectorTestCase.java
U         src/main/java/org/apache/commons/beanutils/BeanIntrospectionData.java
U         src/main/java/org/apache/commons/beanutils/LazyDynaClass.java
U         src/main/java/org/apache/commons/beanutils/BasicDynaBean.java
U         src/main/java/org/apache/commons/beanutils/RowSetDynaClass.java
U         src/main/java/org/apache/commons/beanutils/BeanUtils.java
U         src/main/java/org/apache/commons/beanutils/DefaultBeanIntrospector.java
U         src/main/java/org/apache/commons/beanutils/LazyDynaList.java
U         src/main/java/org/apache/commons/beanutils/MethodUtils.java
U         src/main/java/org/apache/commons/beanutils/BeanMap.java
U         src/main/java/org/apache/commons/beanutils/FluentPropertyBeanIntrospector.java
U         src/main/java/org/apache/commons/beanutils/PropertyUtils.java
U         src/main/java/org/apache/commons/beanutils/WeakFastHashMap.java
U         src/main/java/org/apache/commons/beanutils/MappedPropertyDescriptor.java
U         src/main/java/org/apache/commons/beanutils/DefaultIntrospectionContext.java
U         src/main/java/org/apache/commons/beanutils/WrapDynaBean.java
U         src/main/java/org/apache/commons/beanutils/ContextClassLoaderLocal.java
U         src/main/java/org/apache/commons/beanutils/BeanUtilsBean.java
U         src/main/java/org/apache/commons/beanutils/LazyDynaBean.java
U         src/main/java/org/apache/commons/beanutils/BasicDynaClass.java
U         src/main/java/org/apache/commons/beanutils/BeanPredicate.java
U         src/main/java/org/apache/commons/beanutils/ConvertUtilsBean.java
U         src/main/java/org/apache/commons/beanutils/LazyDynaMap.java
U         src/main/java/org/apache/commons/beanutils/PropertyUtilsBean.java
U         src/main/java/org/apache/commons/beanutils/BeanToPropertyValueTransformer.java
U         src/main/java/org/apache/commons/beanutils/BeanComparator.java
U         src/main/java/org/apache/commons/beanutils/BeanPropertyValueEqualsPredicate.java
U         src/main/java/org/apache/commons/beanutils/SuppressPropertiesBeanIntrospector.java
U         src/main/java/org/apache/commons/beanutils/JDBCDynaClass.java
U         src/main/java/org/apache/commons/beanutils/ResultSetIterator.java
U         src/main/java/org/apache/commons/beanutils/ConstructorUtils.java
U         src/main/java/org/apache/commons/beanutils/converters/AbstractArrayConverter.java
U         src/main/java/org/apache/commons/beanutils/converters/AbstractConverter.java
U         src/main/java/org/apache/commons/beanutils/converters/ConverterFacade.java
U         src/main/java/org/apache/commons/beanutils/converters/BooleanConverter.java
U         src/main/java/org/apache/commons/beanutils/converters/DateTimeConverter.java
U         src/main/java/org/apache/commons/beanutils/converters/ArrayConverter.java
U         src/main/java/org/apache/commons/beanutils/BeanPropertyValueChangeClosure.java
U         src/main/java/org/apache/commons/beanutils/WrapDynaClass.java
U         src/main/java/org/apache/commons/beanutils/BaseDynaBeanMapDecorator.java
U         src/main/java/org/apache/commons/beanutils/expression/DefaultResolver.java
U         src/main/java/org/apache/commons/beanutils/locale/BaseLocaleConverter.java
U         src/main/java/org/apache/commons/beanutils/locale/LocaleConvertUtilsBean.java
U         pom.xml
At revision 1819357

[EnvInject] - Injecting environment variables from a build step.
Setting JDK_1_6_LATEST__HOME=/home/jenkins/tools/java/latest1.6
[EnvInject] - Injecting as environment variables the properties content 
JAVA_1_6_HOME=/home/jenkins/tools/java/latest1.6

[EnvInject] - Variables injected successfully.
Setting JDK_1_6_LATEST__HOME=/home/jenkins/tools/java/latest1.6
Parsing POMs
Setting JDK_1_6_LATEST__HOME=/home/jenkins/tools/java/latest1.6
Setting JDK_1_6_LATEST__HOME=/home/jenkins/tools/java/latest1.6
Setting JDK_1_6_LATEST__HOME=/home/jenkins/tools/java/latest1.6
Setting JDK_1_6_LATEST__HOME=/home/jenkins/tools/java/latest1.6
Established TCP socket on 44623
maven32-agent.jar already up to date
maven32-interceptor.jar already up to date
maven3-interceptor-commons.jar already up to date
[commons-beanutils] $ /home/jenkins/tools/java/latest1.7/bin/java -Xmx2g -Xms256m -cp /home/jenkins/jenkins-slave/maven32-agent.jar:/home/jenkins/tools/maven/apache-maven-3.2.5/boot/plexus-classworlds-2.5.2.jar:/home/jenkins/tools/maven/apache-maven-3.2.5/conf/logging
jenkins.maven3.agent.Maven32Main /home/jenkins/tools/maven/apache-maven-3.2.5 /home/jenkins/jenkins-slave/slave.jar
/home/jenkins/jenkins-slave/maven32-interceptor.jar /home/jenkins/jenkins-slave/maven3-interceptor-commons.jar
44623
<===[JENKINS REMOTING CAPACITY]===>   channel started
ERROR: ================================================================================
ERROR: Invalid project setup: jenkins/security/MasterToSlaveCallable : Unsupported major.minor
version 52.0
ERROR: [JENKINS-18403][JENKINS-28294] JDK 'JDK 1.7 (latest)' not supported to run Maven projects.
ERROR: Maven projects have to be launched with a Java version greater or equal to the minimum
version required by the master.
ERROR: Use the Maven JDK Toolchains (plugin) to build your maven project with an older JDK.
ERROR: Retrying with slave Java and setting compile/test properties to point to /home/jenkins/tools/java/latest1.7.
ERROR: ================================================================================
Established TCP socket on 35057
maven32-agent.jar already up to date
maven32-interceptor.jar already up to date
maven3-interceptor-commons.jar already up to date
[commons-beanutils] $ /usr/local/asfpackages/java/jdk1.8.0_131/jre/bin/java -Xmx2g -Xms256m
-cp /home/jenkins/jenkins-slave/maven32-agent.jar:/home/jenkins/tools/maven/apache-maven-3.2.5/boot/plexus-classworlds-2.5.2.jar:/home/jenkins/tools/maven/apache-maven-3.2.5/conf/logging
jenkins.maven3.agent.Maven32Main /home/jenkins/tools/maven/apache-maven-3.2.5 /home/jenkins/jenkins-slave/slave.jar
/home/jenkins/jenkins-slave/maven32-interceptor.jar /home/jenkins/jenkins-slave/maven3-interceptor-commons.jar
35057
<===[JENKINS REMOTING CAPACITY]===>   channel started
Executing Maven:  -B -f <https://builds.apache.org/job/commons-beanutils/ws/pom.xml>
-Dmaven.repo.local=/home/jenkins/jenkins-slave/maven-repositories/1 clean deploy --batch-mode
-Dgpg.skip -Prelease -Pjava-1.6
[INFO] Scanning for projects...
[INFO]                                                                         
[INFO] ------------------------------------------------------------------------
[INFO] Building Apache Commons BeanUtils 1.9.4-SNAPSHOT
[INFO] ------------------------------------------------------------------------
[INFO] Downloading: https://repo.maven.apache.org/maven2/commons-collections/commons-collections-testframework/3.2.1/commons-collections-testframework-3.2.1.pom
[WARNING] The POM for commons-collections:commons-collections-testframework:jar:3.2.1 is missing,
no dependency information available
[INFO] 
[INFO] --- maven-clean-plugin:3.0.0:clean (default-clean) @ commons-beanutils ---
[INFO] Deleting <https://builds.apache.org/job/commons-beanutils/ws/target>
[INFO] 
[INFO] --- maven-enforcer-plugin:1.4.1:enforce (enforce-maven-3) @ commons-beanutils ---
[INFO] 
[INFO] --- build-helper-maven-plugin:1.10:parse-version (parse-version) @ commons-beanutils
---
[INFO] 
[INFO] --- maven-antrun-plugin:1.8:run (javadoc.resources) @ commons-beanutils ---
[INFO] Executing tasks

main:
     [copy] Copying 2 files to <https://builds.apache.org/job/commons-beanutils/ws/target/apidocs/META-INF>
[INFO] Executed tasks
[INFO] 
[INFO] --- maven-remote-resources-plugin:1.5:process (process-resource-bundles) @ commons-beanutils
---
[INFO] 
[INFO] --- buildnumber-maven-plugin:1.4:create (default) @ commons-beanutils ---
[INFO] Executing: /bin/sh -c cd '<https://builds.apache.org/job/commons-beanutils/ws/'>
&& 'svn' '--non-interactive' 'info'
[INFO] Working directory: <https://builds.apache.org/job/commons-beanutils/ws/>
[INFO] Storing buildNumber: 1819357 at timestamp: 1514403651399
[INFO] Executing: /bin/sh -c cd '<https://builds.apache.org/job/commons-beanutils/ws/'>
&& 'svn' '--non-interactive' 'info'
[INFO] Working directory: <https://builds.apache.org/job/commons-beanutils/ws/>
[INFO] Storing buildScmBranch: trunk
[INFO] 
[INFO] --- maven-resources-plugin:2.7:resources (default-resources) @ commons-beanutils ---
[INFO] Using 'utf-8' encoding to copy filtered resources.
[INFO] skip non existing resourceDirectory <https://builds.apache.org/job/commons-beanutils/ws/src/main/resources>
[INFO] Copying 2 resources to META-INF
[INFO] 
[INFO] --- maven-compiler-plugin:3.6.0:compile (default-compile) @ commons-beanutils ---
[INFO] Changes detected - recompiling the module!
[INFO] Compiling 111 source files to <https://builds.apache.org/job/commons-beanutils/ws/target/classes>
[INFO] -------------------------------------------------------------
[ERROR] COMPILATION ERROR : 
[INFO] -------------------------------------------------------------
[ERROR] javac: invalid target release: 1.7
Usage: javac <options> <source files>
use -help for a list of possible options

[INFO] 1 error
[INFO] -------------------------------------------------------------
[INFO] ------------------------------------------------------------------------
[INFO] BUILD FAILURE
[INFO] ------------------------------------------------------------------------
[INFO] Total time: 11.481 s
[INFO] Finished at: 2017-12-27T19:40:56+00:00
[INFO] Final Memory: 23M/294M
[INFO] ------------------------------------------------------------------------
Waiting for Jenkins to finish collecting data
[ERROR] Failed to execute goal org.apache.maven.plugins:maven-compiler-plugin:3.6.0:compile
(default-compile) on project commons-beanutils: Compilation failure
[ERROR] javac: invalid target release: 1.7
[ERROR] Usage: javac <options> <source files>
[ERROR] use -help for a list of possible options
[ERROR] -> [Help 1]
[ERROR] 
[ERROR] To see the full stack trace of the errors, re-run Maven with the -e switch.
[ERROR] Re-run Maven using the -X switch to enable full debug logging.
[ERROR] 
[ERROR] For more information about the errors and possible solutions, please read the following
articles:
[ERROR] [Help 1] http://cwiki.apache.org/confluence/display/MAVEN/MojoFailureException
[JENKINS] Archiving <https://builds.apache.org/job/commons-beanutils/ws/pom.xml> to
commons-beanutils/commons-beanutils/1.9.4-SNAPSHOT/commons-beanutils-1.9.4-SNAPSHOT.pom
Sending e-mails to: notifications@commons.apache.org
channel stopped
Setting JDK_1_6_LATEST__HOME=/home/jenkins/tools/java/latest1.6
Setting JDK_1_6_LATEST__HOME=/home/jenkins/tools/java/latest1.6

Mime
View raw message