commons-notifications mailing list archives

Site index · List index
Message view « Date » · « Thread »
Top « Date » · « Thread »
From Apache Jenkins Server <jenk...@builds.apache.org>
Subject Build failed in Jenkins: commons-beanutils #32
Date Sat, 23 Dec 2017 23:23:03 GMT
See <https://builds.apache.org/job/commons-beanutils/32/display/redirect?page=changes>

Changes:

[dbrosius] BEANUTILS-500: upgrade to commons-collections4

------------------------------------------
[...truncated 36.62 KB...]
Running org.apache.commons.beanutils.DynaRowSetTestCase
Tests run: 9, Failures: 0, Errors: 0, Skipped: 0, Time elapsed: 0.292 sec - in org.apache.commons.beanutils.DynaRowSetTestCase
Running org.apache.commons.beanutils.memoryleaktests.MemoryLeakTestCase
Tests run: 8, Failures: 0, Errors: 0, Skipped: 0, Time elapsed: 43.566 sec - in org.apache.commons.beanutils.memoryleaktests.MemoryLeakTestCase
Running org.apache.commons.beanutils.LazyDynaMapTestCase
Tests run: 17, Failures: 0, Errors: 0, Skipped: 0, Time elapsed: 0.429 sec - in org.apache.commons.beanutils.LazyDynaMapTestCase
Running org.apache.commons.beanutils.LazyDynaListTestCase
Tests run: 15, Failures: 0, Errors: 0, Skipped: 0, Time elapsed: 0.577 sec - in org.apache.commons.beanutils.LazyDynaListTestCase
Running org.apache.commons.beanutils.BeanMapTestCase
Tests run: 132, Failures: 0, Errors: 0, Skipped: 0, Time elapsed: 0.62 sec - in org.apache.commons.beanutils.BeanMapTestCase
Running org.apache.commons.beanutils.BasicDynaBeanTestCase
Tests run: 35, Failures: 0, Errors: 0, Skipped: 0, Time elapsed: 0.176 sec - in org.apache.commons.beanutils.BasicDynaBeanTestCase
Running org.apache.commons.beanutils.SuppressPropertiesBeanIntrospectorTestCase
Tests run: 4, Failures: 0, Errors: 0, Skipped: 0, Time elapsed: 0.086 sec - in org.apache.commons.beanutils.SuppressPropertiesBeanIntrospectorTestCase
Running org.apache.commons.beanutils.DynaBeanMapDecoratorTestCase
Tests run: 13, Failures: 0, Errors: 0, Skipped: 0, Time elapsed: 0.126 sec - in org.apache.commons.beanutils.DynaBeanMapDecoratorTestCase
Running org.apache.commons.beanutils.WrapDynaBeanTestCase
Tests run: 43, Failures: 0, Errors: 0, Skipped: 0, Time elapsed: 0.521 sec - in org.apache.commons.beanutils.WrapDynaBeanTestCase
Running org.apache.commons.beanutils.DynaPropertyTestCase
Tests run: 2, Failures: 0, Errors: 0, Skipped: 0, Time elapsed: 0.086 sec - in org.apache.commons.beanutils.DynaPropertyTestCase
Running org.apache.commons.beanutils.LazyDynaClassTestCase
Tests run: 15, Failures: 0, Errors: 0, Skipped: 0, Time elapsed: 0.136 sec - in org.apache.commons.beanutils.LazyDynaClassTestCase
Running org.apache.commons.beanutils.BeanUtilsTestCase
Tests run: 55, Failures: 0, Errors: 0, Skipped: 0, Time elapsed: 0.831 sec - in org.apache.commons.beanutils.BeanUtilsTestCase
Running org.apache.commons.beanutils.converters.SqlDateConverterTestCase
Tests run: 12, Failures: 0, Errors: 0, Skipped: 0, Time elapsed: 0.237 sec - in org.apache.commons.beanutils.converters.SqlDateConverterTestCase
Running org.apache.commons.beanutils.converters.FloatConverterTestCase
Tests run: 20, Failures: 0, Errors: 0, Skipped: 0, Time elapsed: 0.394 sec - in org.apache.commons.beanutils.converters.FloatConverterTestCase
Running org.apache.commons.beanutils.converters.ClassReloaderTestCase
Tests run: 1, Failures: 0, Errors: 0, Skipped: 0, Time elapsed: 0.085 sec - in org.apache.commons.beanutils.converters.ClassReloaderTestCase
Running org.apache.commons.beanutils.converters.ArrayConverterTestCase
Tests run: 7, Failures: 0, Errors: 0, Skipped: 0, Time elapsed: 0.241 sec - in org.apache.commons.beanutils.converters.ArrayConverterTestCase
Running org.apache.commons.beanutils.converters.ShortConverterTestCase
Tests run: 20, Failures: 0, Errors: 0, Skipped: 0, Time elapsed: 0.432 sec - in org.apache.commons.beanutils.converters.ShortConverterTestCase
Running org.apache.commons.beanutils.converters.StringConverterTestCase
Tests run: 3, Failures: 0, Errors: 0, Skipped: 0, Time elapsed: 0.165 sec - in org.apache.commons.beanutils.converters.StringConverterTestCase
Running org.apache.commons.beanutils.converters.ByteConverterTestCase
Tests run: 20, Failures: 0, Errors: 0, Skipped: 0, Time elapsed: 0.387 sec - in org.apache.commons.beanutils.converters.ByteConverterTestCase
Running org.apache.commons.beanutils.converters.BigDecimalConverterTestCase
Tests run: 19, Failures: 0, Errors: 0, Skipped: 0, Time elapsed: 0.403 sec - in org.apache.commons.beanutils.converters.BigDecimalConverterTestCase
Running org.apache.commons.beanutils.converters.StringArrayConverterTestCase
Tests run: 1, Failures: 0, Errors: 0, Skipped: 0, Time elapsed: 0.115 sec - in org.apache.commons.beanutils.converters.StringArrayConverterTestCase
Running org.apache.commons.beanutils.converters.FileConverterTestCase
Tests run: 2, Failures: 0, Errors: 0, Skipped: 0, Time elapsed: 0.168 sec - in org.apache.commons.beanutils.converters.FileConverterTestCase
Running org.apache.commons.beanutils.converters.LongConverterTestCase
Tests run: 19, Failures: 0, Errors: 0, Skipped: 0, Time elapsed: 0.345 sec - in org.apache.commons.beanutils.converters.LongConverterTestCase
Running org.apache.commons.beanutils.converters.CharacterConverterTestCase
Tests run: 6, Failures: 0, Errors: 0, Skipped: 0, Time elapsed: 0.169 sec - in org.apache.commons.beanutils.converters.CharacterConverterTestCase
Running org.apache.commons.beanutils.converters.IntegerConverterTestCase
Tests run: 21, Failures: 0, Errors: 0, Skipped: 0, Time elapsed: 0.425 sec - in org.apache.commons.beanutils.converters.IntegerConverterTestCase
Running org.apache.commons.beanutils.converters.BooleanArrayConverterTestCase
Tests run: 9, Failures: 0, Errors: 0, Skipped: 0, Time elapsed: 0.369 sec - in org.apache.commons.beanutils.converters.BooleanArrayConverterTestCase
Running org.apache.commons.beanutils.converters.CalendarConverterTestCase
Tests run: 11, Failures: 0, Errors: 0, Skipped: 0, Time elapsed: 0.255 sec - in org.apache.commons.beanutils.converters.CalendarConverterTestCase
Running org.apache.commons.beanutils.converters.ClassConverterTestCase
Tests run: 7, Failures: 0, Errors: 0, Skipped: 0, Time elapsed: 0.382 sec - in org.apache.commons.beanutils.converters.ClassConverterTestCase
Running org.apache.commons.beanutils.converters.BigIntegerConverterTestCase
Tests run: 19, Failures: 0, Errors: 0, Skipped: 0, Time elapsed: 0.395 sec - in org.apache.commons.beanutils.converters.BigIntegerConverterTestCase
Running org.apache.commons.beanutils.converters.DoubleConverterTestCase
Tests run: 19, Failures: 0, Errors: 0, Skipped: 0, Time elapsed: 0.386 sec - in org.apache.commons.beanutils.converters.DoubleConverterTestCase
Running org.apache.commons.beanutils.converters.SqlTimestampConverterTestCase
Tests run: 11, Failures: 0, Errors: 0, Skipped: 0, Time elapsed: 0.248 sec - in org.apache.commons.beanutils.converters.SqlTimestampConverterTestCase
Running org.apache.commons.beanutils.converters.BooleanConverterTestCase
Tests run: 7, Failures: 0, Errors: 0, Skipped: 0, Time elapsed: 0.185 sec - in org.apache.commons.beanutils.converters.BooleanConverterTestCase
Running org.apache.commons.beanutils.converters.DateConverterTestCase
Tests run: 11, Failures: 0, Errors: 0, Skipped: 0, Time elapsed: 0.228 sec - in org.apache.commons.beanutils.converters.DateConverterTestCase
Running org.apache.commons.beanutils.converters.SqlTimeConverterTestCase
Tests run: 11, Failures: 0, Errors: 0, Skipped: 0, Time elapsed: 0.244 sec - in org.apache.commons.beanutils.converters.SqlTimeConverterTestCase
Running org.apache.commons.beanutils.converters.URLConverterTestCase
Tests run: 2, Failures: 0, Errors: 0, Skipped: 0, Time elapsed: 0.415 sec - in org.apache.commons.beanutils.converters.URLConverterTestCase
Running org.apache.commons.beanutils.expression.DefaultResolverTestCase
Tests run: 7, Failures: 0, Errors: 0, Skipped: 0, Time elapsed: 0.101 sec - in org.apache.commons.beanutils.expression.DefaultResolverTestCase
Running org.apache.commons.beanutils.BeanToPropertyValueTransformerTestCase
Tests run: 17, Failures: 0, Errors: 0, Skipped: 0, Time elapsed: 0.414 sec - in org.apache.commons.beanutils.BeanToPropertyValueTransformerTestCase
Running org.apache.commons.beanutils.PropertyUtilsTestCase
Tests run: 116, Failures: 0, Errors: 0, Skipped: 0, Time elapsed: 0.89 sec - in org.apache.commons.beanutils.PropertyUtilsTestCase
Running org.apache.commons.beanutils.BeanificationTestCase
Tests run: 8, Failures: 0, Errors: 0, Skipped: 0, Time elapsed: 1.415 sec - in org.apache.commons.beanutils.BeanificationTestCase
Running org.apache.commons.beanutils.MappedPropertyTestCase
Tests run: 17, Failures: 0, Errors: 0, Skipped: 0, Time elapsed: 0.409 sec - in org.apache.commons.beanutils.MappedPropertyTestCase
Running org.apache.commons.beanutils.BeanComparatorTestCase
Tests run: 8, Failures: 0, Errors: 0, Skipped: 0, Time elapsed: 0.427 sec - in org.apache.commons.beanutils.BeanComparatorTestCase
Running org.apache.commons.beanutils.BeanPropertyValueEqualsPredicateTestCase
Tests run: 17, Failures: 0, Errors: 0, Skipped: 0, Time elapsed: 0.42 sec - in org.apache.commons.beanutils.BeanPropertyValueEqualsPredicateTestCase
Running org.apache.commons.beanutils.IndexedPropertyTestCase
Tests run: 29, Failures: 0, Errors: 0, Skipped: 0, Time elapsed: 0.516 sec - in org.apache.commons.beanutils.IndexedPropertyTestCase
Running org.apache.commons.beanutils.BeanUtils2TestCase
Tests run: 55, Failures: 0, Errors: 0, Skipped: 0, Time elapsed: 0.787 sec - in org.apache.commons.beanutils.BeanUtils2TestCase
Running org.apache.commons.beanutils.ConstructorUtilsTestCase
Tests run: 11, Failures: 0, Errors: 0, Skipped: 0, Time elapsed: 0.145 sec - in org.apache.commons.beanutils.ConstructorUtilsTestCase
Running org.apache.commons.beanutils.LazyDynaBeanTestCase
Tests run: 16, Failures: 0, Errors: 0, Skipped: 0, Time elapsed: 0.439 sec - in org.apache.commons.beanutils.LazyDynaBeanTestCase
Running org.apache.commons.beanutils.ConvertUtilsTestCase
Tests run: 13, Failures: 0, Errors: 0, Skipped: 0, Time elapsed: 0.566 sec - in org.apache.commons.beanutils.ConvertUtilsTestCase
Running org.apache.commons.beanutils.BeanPropertyValueChangeClosureTestCase
Tests run: 26, Failures: 0, Errors: 0, Skipped: 0, Time elapsed: 0.44 sec - in org.apache.commons.beanutils.BeanPropertyValueChangeClosureTestCase
Running org.apache.commons.beanutils.BeanIntrospectionDataTestCase
Tests run: 4, Failures: 0, Errors: 0, Skipped: 0, Time elapsed: 0.282 sec - in org.apache.commons.beanutils.BeanIntrospectionDataTestCase
Running org.apache.commons.beanutils.bugs.Jira463TestCase
Tests run: 1, Failures: 0, Errors: 0, Skipped: 0, Time elapsed: 0.454 sec - in org.apache.commons.beanutils.bugs.Jira463TestCase
Running org.apache.commons.beanutils.bugs.Jira368TestCase
Tests run: 1, Failures: 0, Errors: 0, Skipped: 0, Time elapsed: 0.377 sec - in org.apache.commons.beanutils.bugs.Jira368TestCase
Running org.apache.commons.beanutils.bugs.Jira422TestCase
Tests run: 2, Failures: 0, Errors: 0, Skipped: 0, Time elapsed: 0.453 sec - in org.apache.commons.beanutils.bugs.Jira422TestCase
Running org.apache.commons.beanutils.bugs.Jira359TestCase
Tests run: 4, Failures: 0, Errors: 0, Skipped: 0, Time elapsed: 0.399 sec - in org.apache.commons.beanutils.bugs.Jira359TestCase
Running org.apache.commons.beanutils.bugs.Jira349TestCase
Tests run: 1, Failures: 0, Errors: 0, Skipped: 0, Time elapsed: 0.398 sec - in org.apache.commons.beanutils.bugs.Jira349TestCase
Running org.apache.commons.beanutils.bugs.Jira422bTestCase
Tests run: 2, Failures: 0, Errors: 0, Skipped: 0, Time elapsed: 0.422 sec - in org.apache.commons.beanutils.bugs.Jira422bTestCase
Running org.apache.commons.beanutils.bugs.Jira381TestCase
Tests run: 1, Failures: 0, Errors: 0, Skipped: 0, Time elapsed: 0.167 sec - in org.apache.commons.beanutils.bugs.Jira381TestCase
Running org.apache.commons.beanutils.bugs.Jira454TestCase
Tests run: 1, Failures: 0, Errors: 0, Skipped: 0, Time elapsed: 0.366 sec - in org.apache.commons.beanutils.bugs.Jira454TestCase
Running org.apache.commons.beanutils.bugs.Jira492TestCase
Tests run: 8, Failures: 0, Errors: 0, Skipped: 0, Time elapsed: 0.48 sec - in org.apache.commons.beanutils.bugs.Jira492TestCase
Running org.apache.commons.beanutils.bugs.Jira273TestCase
Tests run: 6, Failures: 0, Errors: 0, Skipped: 0, Time elapsed: 0.409 sec - in org.apache.commons.beanutils.bugs.Jira273TestCase
Running org.apache.commons.beanutils.bugs.Jira298TestCase
Tests run: 3, Failures: 0, Errors: 0, Skipped: 0, Time elapsed: 0.394 sec - in org.apache.commons.beanutils.bugs.Jira298TestCase
Running org.apache.commons.beanutils.bugs.Jira87TestCase
Tests run: 1, Failures: 0, Errors: 0, Skipped: 0, Time elapsed: 0.349 sec - in org.apache.commons.beanutils.bugs.Jira87TestCase
Running org.apache.commons.beanutils.bugs.Jira61TestCase
Tests run: 16, Failures: 0, Errors: 0, Skipped: 0, Time elapsed: 0.43 sec - in org.apache.commons.beanutils.bugs.Jira61TestCase
Running org.apache.commons.beanutils.bugs.Jira18TestCase
Tests run: 12, Failures: 0, Errors: 0, Skipped: 0, Time elapsed: 0.401 sec - in org.apache.commons.beanutils.bugs.Jira18TestCase
Running org.apache.commons.beanutils.bugs.Jira358TestCase
Tests run: 2, Failures: 0, Errors: 0, Skipped: 0, Time elapsed: 0.422 sec - in org.apache.commons.beanutils.bugs.Jira358TestCase
Running org.apache.commons.beanutils.bugs.Jira458TestCase
Tests run: 2, Failures: 0, Errors: 0, Skipped: 0, Time elapsed: 0.177 sec - in org.apache.commons.beanutils.bugs.Jira458TestCase
Running org.apache.commons.beanutils.bugs.Jira357TestCase
Tests run: 3, Failures: 0, Errors: 0, Skipped: 0, Time elapsed: 0.378 sec - in org.apache.commons.beanutils.bugs.Jira357TestCase
Running org.apache.commons.beanutils.bugs.Jira157TestCase
Tests run: 3, Failures: 0, Errors: 0, Skipped: 0, Time elapsed: 0.39 sec - in org.apache.commons.beanutils.bugs.Jira157TestCase
Running org.apache.commons.beanutils.bugs.Jira345TestCase
Tests run: 2, Failures: 0, Errors: 0, Skipped: 0, Time elapsed: 0.377 sec - in org.apache.commons.beanutils.bugs.Jira345TestCase
Running org.apache.commons.beanutils.bugs.Jira411TestCase
Tests run: 1, Failures: 0, Errors: 0, Skipped: 0, Time elapsed: 0.38 sec - in org.apache.commons.beanutils.bugs.Jira411TestCase
Running org.apache.commons.beanutils.bugs.Jira456TestCase
Tests run: 2, Failures: 0, Errors: 0, Skipped: 0, Time elapsed: 0.299 sec - in org.apache.commons.beanutils.bugs.Jira456TestCase
Running org.apache.commons.beanutils.bugs.Jira339TestCase
Tests run: 2, Failures: 0, Errors: 0, Skipped: 0, Time elapsed: 0.403 sec - in org.apache.commons.beanutils.bugs.Jira339TestCase
Running org.apache.commons.beanutils.bugs.Jira493TestCase
Tests run: 1, Failures: 0, Errors: 0, Skipped: 0, Time elapsed: 0.445 sec - in org.apache.commons.beanutils.bugs.Jira493TestCase
Running org.apache.commons.beanutils.bugs.Jira347TestCase
Tests run: 1, Failures: 0, Errors: 0, Skipped: 0, Time elapsed: 3.126 sec - in org.apache.commons.beanutils.bugs.Jira347TestCase
Running org.apache.commons.beanutils.bugs.Jira465TestCase
Tests run: 4, Failures: 0, Errors: 0, Skipped: 0, Time elapsed: 0.402 sec - in org.apache.commons.beanutils.bugs.Jira465TestCase
Running org.apache.commons.beanutils.bugs.Jira92TestCase
Tests run: 1, Failures: 0, Errors: 0, Skipped: 0, Time elapsed: 0.442 sec - in org.apache.commons.beanutils.bugs.Jira92TestCase
Running org.apache.commons.beanutils.bugs.Jira369TestCase
Tests run: 3, Failures: 0, Errors: 0, Skipped: 0, Time elapsed: 0.414 sec - in org.apache.commons.beanutils.bugs.Jira369TestCase
Running org.apache.commons.beanutils.DefaultIntrospectionContextTestCase
Tests run: 9, Failures: 0, Errors: 0, Skipped: 0, Time elapsed: 0.092 sec - in org.apache.commons.beanutils.DefaultIntrospectionContextTestCase
Running org.apache.commons.beanutils.DynaResultSetTestCase
Tests run: 7, Failures: 0, Errors: 0, Skipped: 0, Time elapsed: 0.243 sec - in org.apache.commons.beanutils.DynaResultSetTestCase
Running org.apache.commons.beanutils.locale.LocaleConvertUtilsTestCase
Tests run: 6, Failures: 0, Errors: 0, Skipped: 0, Time elapsed: 0.455 sec - in org.apache.commons.beanutils.locale.LocaleConvertUtilsTestCase
Running org.apache.commons.beanutils.locale.converters.BigDecimalLocaleConverterTestCase
Tests run: 10, Failures: 0, Errors: 0, Skipped: 0, Time elapsed: 0.209 sec - in org.apache.commons.beanutils.locale.converters.BigDecimalLocaleConverterTestCase
Running org.apache.commons.beanutils.locale.converters.DoubleLocaleConverterTestCase
Tests run: 10, Failures: 0, Errors: 0, Skipped: 0, Time elapsed: 0.206 sec - in org.apache.commons.beanutils.locale.converters.DoubleLocaleConverterTestCase
Running org.apache.commons.beanutils.locale.converters.BaseLocaleConverterTestCase
Tests run: 1, Failures: 0, Errors: 0, Skipped: 0, Time elapsed: 0.087 sec - in org.apache.commons.beanutils.locale.converters.BaseLocaleConverterTestCase
Running org.apache.commons.beanutils.locale.converters.FloatLocaleConverterTestCase
Tests run: 12, Failures: 0, Errors: 0, Skipped: 0, Time elapsed: 0.418 sec - in org.apache.commons.beanutils.locale.converters.FloatLocaleConverterTestCase
Running org.apache.commons.beanutils.locale.converters.ShortLocaleConverterTestCase
Tests run: 10, Failures: 0, Errors: 0, Skipped: 0, Time elapsed: 0.189 sec - in org.apache.commons.beanutils.locale.converters.ShortLocaleConverterTestCase
Running org.apache.commons.beanutils.locale.converters.ByteLocaleConverterTestCase
Tests run: 10, Failures: 0, Errors: 0, Skipped: 0, Time elapsed: 0.203 sec - in org.apache.commons.beanutils.locale.converters.ByteLocaleConverterTestCase
Running org.apache.commons.beanutils.locale.converters.LongLocaleConverterTestCase
Tests run: 10, Failures: 0, Errors: 0, Skipped: 0, Time elapsed: 0.198 sec - in org.apache.commons.beanutils.locale.converters.LongLocaleConverterTestCase
Running org.apache.commons.beanutils.locale.converters.IntegerLocaleConverterTestCase
Tests run: 12, Failures: 0, Errors: 0, Skipped: 0, Time elapsed: 0.211 sec - in org.apache.commons.beanutils.locale.converters.IntegerLocaleConverterTestCase
Running org.apache.commons.beanutils.locale.converters.DateLocaleConverterTestCase
Tests run: 14, Failures: 0, Errors: 0, Skipped: 0, Time elapsed: 0.228 sec - in org.apache.commons.beanutils.locale.converters.DateLocaleConverterTestCase
Running org.apache.commons.beanutils.locale.converters.BigIntegerLocaleConverterTestCase
Tests run: 11, Failures: 0, Errors: 0, Skipped: 0, Time elapsed: 0.203 sec - in org.apache.commons.beanutils.locale.converters.BigIntegerLocaleConverterTestCase
Running org.apache.commons.beanutils.locale.LocaleBeanUtilsTestCase
Tests run: 2, Failures: 0, Errors: 0, Skipped: 0, Time elapsed: 0.449 sec - in org.apache.commons.beanutils.locale.LocaleBeanUtilsTestCase
Running org.apache.commons.beanutils.locale.LocaleBeanificationTestCase
Tests run: 9, Failures: 0, Errors: 0, Skipped: 0, Time elapsed: 1.439 sec - in org.apache.commons.beanutils.locale.LocaleBeanificationTestCase

Results :

Tests run: 1292, Failures: 0, Errors: 0, Skipped: 0

[JENKINS] Recording test results
[INFO] 
[INFO] --- maven-jar-plugin:3.0.0:jar (default-jar) @ commons-beanutils ---
[INFO] Building jar: <https://builds.apache.org/job/commons-beanutils/ws/target/commons-beanutils-1.9.4-SNAPSHOT.jar>
[INFO] 
[INFO] --- maven-site-plugin:3.6:attach-descriptor (attach-descriptor) @ commons-beanutils
---
[INFO] Skipping because packaging 'jar' is not pom.
[INFO] 
[INFO] >>> maven-javadoc-plugin:2.10.4:javadoc (create-javadoc-jar) > generate-sources
@ commons-beanutils >>>
[INFO] 
[INFO] --- maven-enforcer-plugin:1.4.1:enforce (enforce-maven-3) @ commons-beanutils ---
[INFO] 
[INFO] --- build-helper-maven-plugin:1.10:parse-version (parse-version) @ commons-beanutils
---
[INFO] 
[INFO] --- maven-antrun-plugin:1.8:run (javadoc.resources) @ commons-beanutils ---
[INFO] Executing tasks

main:
[INFO] Executed tasks
[WARNING] Failed to getClass for org.apache.maven.plugin.javadoc.JavadocReport
[INFO] 
[INFO] <<< maven-javadoc-plugin:2.10.4:javadoc (create-javadoc-jar) < generate-sources
@ commons-beanutils <<<
[INFO] 
[INFO] --- maven-javadoc-plugin:2.10.4:javadoc (create-javadoc-jar) @ commons-beanutils ---
[INFO] 
3 errors
[JENKINS] Archiving  javadoc
[INFO] ------------------------------------------------------------------------
[INFO] BUILD FAILURE
[INFO] ------------------------------------------------------------------------
[INFO] Total time: 09:27 min
[INFO] Finished at: 2017-12-23T23:22:25+00:00
[INFO] Final Memory: 35M/826M
[INFO] ------------------------------------------------------------------------
Waiting for Jenkins to finish collecting data
[ERROR] Failed to execute goal org.apache.maven.plugins:maven-javadoc-plugin:2.10.4:javadoc
(create-javadoc-jar) on project commons-beanutils: An error has occurred in JavaDocs report
generation:
[ERROR] Exit code: 1 - <https://builds.apache.org/job/commons-beanutils/ws/src/main/java/org/apache/commons/beanutils/BeanPropertyValueChangeClosure.java>:78:
error: reference not found
[ERROR] * @see org.apache.commons.collections.Closure
[ERROR] ^
[ERROR] <https://builds.apache.org/job/commons-beanutils/ws/src/main/java/org/apache/commons/beanutils/BeanPropertyValueEqualsPredicate.java>:109:
error: reference not found
[ERROR] * @see org.apache.commons.collections.Predicate
[ERROR] ^
[ERROR] <https://builds.apache.org/job/commons-beanutils/ws/src/main/java/org/apache/commons/beanutils/BeanToPropertyValueTransformer.java>:70:
error: reference not found
[ERROR] * @see org.apache.commons.collections.Transformer
[ERROR] ^
[ERROR] 
[ERROR] Command line was: /usr/local/asfpackages/java/jdk1.8.0_131/jre/../bin/javadoc @options
@packages
[ERROR] 
[ERROR] Refer to the generated Javadoc files in '<https://builds.apache.org/job/commons-beanutils/ws/target/site/apidocs'>
dir.
[ERROR] -> [Help 1]
[ERROR] 
[ERROR] To see the full stack trace of the errors, re-run Maven with the -e switch.
[ERROR] Re-run Maven using the -X switch to enable full debug logging.
[ERROR] 
[ERROR] For more information about the errors and possible solutions, please read the following
articles:
[ERROR] [Help 1] http://cwiki.apache.org/confluence/display/MAVEN/MojoExecutionException
[JENKINS] Archiving <https://builds.apache.org/job/commons-beanutils/ws/pom.xml> to
commons-beanutils/commons-beanutils/1.9.4-SNAPSHOT/commons-beanutils-1.9.4-SNAPSHOT.pom
[JENKINS] Archiving <https://builds.apache.org/job/commons-beanutils/ws/target/commons-beanutils-1.9.4-SNAPSHOT.jar>
to commons-beanutils/commons-beanutils/1.9.4-SNAPSHOT/commons-beanutils-1.9.4-SNAPSHOT.jar
Sending e-mails to: notifications@commons.apache.org
channel stopped
Setting JDK_1_6_LATEST__HOME=/home/jenkins/tools/java/latest1.6
Setting JDK_1_6_LATEST__HOME=/home/jenkins/tools/java/latest1.6

Mime
View raw message