commons-notifications mailing list archives

Site index · List index
Message view « Date » · « Thread »
Top « Date » · « Thread »
From Apache Jenkins Server <jenk...@builds.apache.org>
Subject Build failed in Jenkins: Commons-Compress #348
Date Wed, 27 Dec 2017 14:20:07 GMT
See <https://builds.apache.org/job/Commons-Compress/348/display/redirect?page=changes>

Changes:

[bodewig] COMPRESS-435 Replaces instanceof checks with a type marker in LZ77

------------------------------------------
[...truncated 31.06 KB...]
Tests run: 5, Failures: 0, Errors: 0, Skipped: 0, Time elapsed: 0.013 sec - in org.apache.commons.compress.compressors.BZip2TestCase
Running org.apache.commons.compress.compressors.lz77support.AbstractLZ77CompressorInputStreamTest
Tests run: 3, Failures: 0, Errors: 0, Skipped: 0, Time elapsed: 0.002 sec - in org.apache.commons.compress.compressors.lz77support.AbstractLZ77CompressorInputStreamTest
Running org.apache.commons.compress.compressors.lz77support.LZ77CompressorTest
Tests run: 14, Failures: 0, Errors: 0, Skipped: 0, Time elapsed: 0.026 sec - in org.apache.commons.compress.compressors.lz77support.LZ77CompressorTest
Running org.apache.commons.compress.compressors.lz77support.ParametersTest
Tests run: 14, Failures: 0, Errors: 0, Skipped: 0, Time elapsed: 0.003 sec - in org.apache.commons.compress.compressors.lz77support.ParametersTest
Running org.apache.commons.compress.compressors.xz.XZUtilsTestCase
Tests run: 7, Failures: 0, Errors: 0, Skipped: 0, Time elapsed: 0.005 sec - in org.apache.commons.compress.compressors.xz.XZUtilsTestCase
Running org.apache.commons.compress.compressors.xz.XZCompressorInputStreamTest
Tests run: 1, Failures: 0, Errors: 0, Skipped: 0, Time elapsed: 0 sec - in org.apache.commons.compress.compressors.xz.XZCompressorInputStreamTest
Running org.apache.commons.compress.compressors.xz.XZCompressorOutputStreamTest
Tests run: 1, Failures: 0, Errors: 0, Skipped: 0, Time elapsed: 0.058 sec - in org.apache.commons.compress.compressors.xz.XZCompressorOutputStreamTest
Running org.apache.commons.compress.compressors.lz4.BlockLZ4CompressorRoundtripTest
Configuration: default
COMPRESS-256.7z written, uncompressed bytes: 4069842, compressed bytes: 4082684 after 670ms
COMPRESS-256.7z.block.lz4 read after 36ms
Configuration: default
lorem-ipsum.txt.gz written, uncompressed bytes: 38080, compressed bytes: 38231 after 3ms
lorem-ipsum.txt.gz.block.lz4 read after 0ms
Configuration: default
bla.tar written, uncompressed bytes: 10240, compressed bytes: 594 after 4ms
bla.tar.block.lz4 read after 1ms
Configuration: tuned for speed
COMPRESS-256.7z written, uncompressed bytes: 4069842, compressed bytes: 4082689 after 385ms
COMPRESS-256.7z.block.lz4 read after 28ms
Configuration: tuned for speed
lorem-ipsum.txt.gz written, uncompressed bytes: 38080, compressed bytes: 38231 after 2ms
lorem-ipsum.txt.gz.block.lz4 read after 0ms
Configuration: tuned for speed
bla.tar written, uncompressed bytes: 10240, compressed bytes: 600 after 2ms
bla.tar.block.lz4 read after 1ms
Configuration: tuned for compression ratio
COMPRESS-256.7z written, uncompressed bytes: 4069842, compressed bytes: 4082684 after 475ms
COMPRESS-256.7z.block.lz4 read after 30ms
Configuration: tuned for compression ratio
lorem-ipsum.txt.gz written, uncompressed bytes: 38080, compressed bytes: 38231 after 2ms
lorem-ipsum.txt.gz.block.lz4 read after 1ms
Configuration: tuned for compression ratio
bla.tar written, uncompressed bytes: 10240, compressed bytes: 594 after 2ms
bla.tar.block.lz4 read after 1ms
Tests run: 9, Failures: 0, Errors: 0, Skipped: 0, Time elapsed: 1.658 sec - in org.apache.commons.compress.compressors.lz4.BlockLZ4CompressorRoundtripTest
Running org.apache.commons.compress.compressors.lz4.FramedLZ4CompressorInputStreamTest
Tests run: 34, Failures: 0, Errors: 0, Skipped: 0, Time elapsed: 0.066 sec - in org.apache.commons.compress.compressors.lz4.FramedLZ4CompressorInputStreamTest
Running org.apache.commons.compress.compressors.lz4.BlockLZ4CompressorOutputStreamTest
Tests run: 20, Failures: 0, Errors: 0, Skipped: 2, Time elapsed: 0.014 sec - in org.apache.commons.compress.compressors.lz4.BlockLZ4CompressorOutputStreamTest
Running org.apache.commons.compress.compressors.lz4.FactoryTest
bla.tar written, uncompressed bytes: 10240, compressed bytes: 594 after 3ms
bla.tar.lz4-block.lz4 read after 1ms
bla.tar written, uncompressed bytes: 10240, compressed bytes: 610 after 5ms
bla.tar.lz4-framed.lz4 read after 1ms
Tests run: 2, Failures: 0, Errors: 0, Skipped: 0, Time elapsed: 0.011 sec - in org.apache.commons.compress.compressors.lz4.FactoryTest
Running org.apache.commons.compress.compressors.lz4.BlockLZ4CompressorInputStreamTest
Tests run: 1, Failures: 0, Errors: 0, Skipped: 0, Time elapsed: 0.001 sec - in org.apache.commons.compress.compressors.lz4.BlockLZ4CompressorInputStreamTest
Running org.apache.commons.compress.compressors.lz4.XXHash32Test
Tests run: 3, Failures: 0, Errors: 0, Skipped: 0, Time elapsed: 0.034 sec - in org.apache.commons.compress.compressors.lz4.XXHash32Test
Running org.apache.commons.compress.compressors.lz4.FramedLZ4CompressorRoundtripTest
COMPRESS-256.7z written, uncompressed bytes: 4069842, compressed bytes: 0 after 279ms
COMPRESS-256.7z.framed.lz4 read after 20ms
lorem-ipsum.txt.gz written, uncompressed bytes: 38080, compressed bytes: 0 after 3ms
lorem-ipsum.txt.gz.framed.lz4 read after 0ms
bla.tar written, uncompressed bytes: 10240, compressed bytes: 0 after 2ms
bla.tar.framed.lz4 read after 0ms
COMPRESS-256.7z written, uncompressed bytes: 4069842, compressed bytes: 0 after 442ms
COMPRESS-256.7z.framed.lz4 read after 19ms
lorem-ipsum.txt.gz written, uncompressed bytes: 38080, compressed bytes: 0 after 2ms
lorem-ipsum.txt.gz.framed.lz4 read after 1ms
bla.tar written, uncompressed bytes: 10240, compressed bytes: 0 after 3ms
bla.tar.framed.lz4 read after 0ms
COMPRESS-256.7z written, uncompressed bytes: 4069842, compressed bytes: 0 after 486ms
COMPRESS-256.7z.framed.lz4 read after 18ms
lorem-ipsum.txt.gz written, uncompressed bytes: 38080, compressed bytes: 0 after 3ms
lorem-ipsum.txt.gz.framed.lz4 read after 0ms
bla.tar written, uncompressed bytes: 10240, compressed bytes: 0 after 2ms
bla.tar.framed.lz4 read after 1ms
COMPRESS-256.7z written, uncompressed bytes: 4069842, compressed bytes: 0 after 504ms
COMPRESS-256.7z.framed.lz4 read after 15ms
lorem-ipsum.txt.gz written, uncompressed bytes: 38080, compressed bytes: 0 after 4ms
lorem-ipsum.txt.gz.framed.lz4 read after 0ms
bla.tar written, uncompressed bytes: 10240, compressed bytes: 0 after 2ms
bla.tar.framed.lz4 read after 1ms
COMPRESS-256.7z written, uncompressed bytes: 4069842, compressed bytes: 0 after 487ms
COMPRESS-256.7z.framed.lz4 read after 11ms
lorem-ipsum.txt.gz written, uncompressed bytes: 38080, compressed bytes: 0 after 3ms
lorem-ipsum.txt.gz.framed.lz4 read after 0ms
bla.tar written, uncompressed bytes: 10240, compressed bytes: 0 after 2ms
bla.tar.framed.lz4 read after 1ms
COMPRESS-256.7z written, uncompressed bytes: 4069842, compressed bytes: 0 after 463ms
COMPRESS-256.7z.framed.lz4 read after 19ms
lorem-ipsum.txt.gz written, uncompressed bytes: 38080, compressed bytes: 0 after 3ms
lorem-ipsum.txt.gz.framed.lz4 read after 1ms
bla.tar written, uncompressed bytes: 10240, compressed bytes: 0 after 2ms
bla.tar.framed.lz4 read after 1ms
COMPRESS-256.7z written, uncompressed bytes: 4069842, compressed bytes: 0 after 501ms
COMPRESS-256.7z.framed.lz4 read after 25ms
lorem-ipsum.txt.gz written, uncompressed bytes: 38080, compressed bytes: 0 after 2ms
lorem-ipsum.txt.gz.framed.lz4 read after 0ms
bla.tar written, uncompressed bytes: 10240, compressed bytes: 0 after 2ms
bla.tar.framed.lz4 read after 1ms
COMPRESS-256.7z written, uncompressed bytes: 4069842, compressed bytes: 0 after 320ms
COMPRESS-256.7z.framed.lz4 read after 15ms
lorem-ipsum.txt.gz written, uncompressed bytes: 38080, compressed bytes: 0 after 3ms
lorem-ipsum.txt.gz.framed.lz4 read after 0ms
bla.tar written, uncompressed bytes: 10240, compressed bytes: 0 after 2ms
bla.tar.framed.lz4 read after 1ms
Tests run: 24, Failures: 0, Errors: 0, Skipped: 0, Time elapsed: 3.701 sec - in org.apache.commons.compress.compressors.lz4.FramedLZ4CompressorRoundtripTest
Running org.apache.commons.compress.compressors.DetectCompressorTestCase
Tests run: 8, Failures: 0, Errors: 0, Skipped: 0, Time elapsed: 0.048 sec - in org.apache.commons.compress.compressors.DetectCompressorTestCase
Running org.apache.commons.compress.compressors.snappy.FramedSnappyCompressorInputStreamTest
Tests run: 8, Failures: 0, Errors: 0, Skipped: 0, Time elapsed: 0.225 sec - in org.apache.commons.compress.compressors.snappy.FramedSnappyCompressorInputStreamTest
Running org.apache.commons.compress.compressors.snappy.SnappyRoundtripTest
COMPRESS-256.7z written, uncompressed bytes: 4069842, compressed bytes: 4067498 after 373ms
COMPRESS-256.7z.raw.sz read after 17ms
Configuration: tuned for compression ratio
bla.tar written, uncompressed bytes: 10240, compressed bytes: 949 after 3ms
bla.tar.raw.sz read after 1ms
reallyBigLiteralTest written, uncompressed bytes: 524288, compressed bytes: 524311 after 42ms
reallyBigLiteralTest.raw.sz read after 2ms
byte array written, uncompressed bytes: 2097160, compressed bytes: 2097311 after 247ms
byte array read after 7ms
lorem-ipsum.txt.gz written, uncompressed bytes: 38080, compressed bytes: 38089 after 2ms
lorem-ipsum.txt.gz.raw.sz read after 0ms
Configuration: default
bla.tar written, uncompressed bytes: 10240, compressed bytes: 955 after 2ms
bla.tar.raw.sz read after 0ms
Configuration: tuned for speed
bla.tar written, uncompressed bytes: 10240, compressed bytes: 960 after 3ms
bla.tar.raw.sz read after 0ms
Tests run: 7, Failures: 0, Errors: 0, Skipped: 0, Time elapsed: 1.642 sec - in org.apache.commons.compress.compressors.snappy.SnappyRoundtripTest
Running org.apache.commons.compress.compressors.GzipUtilsTestCase
Tests run: 3, Failures: 0, Errors: 0, Skipped: 0, Time elapsed: 0.001 sec - in org.apache.commons.compress.compressors.GzipUtilsTestCase
Running org.apache.commons.compress.compressors.FramedSnappyTestCase
test.txt written, uncompressed bytes: 369, compressed bytes: 53 after 1ms
bla.tar written, uncompressed bytes: 10240, compressed bytes: 971 after 1ms
COMPRESS-256.7z written, uncompressed bytes: 4069842, compressed bytes: 4068310 after 253ms
bigChunkTest written, uncompressed bytes: 131072, compressed bytes: 131126 after 8ms
Tests run: 5, Failures: 0, Errors: 0, Skipped: 0, Time elapsed: 0.522 sec - in org.apache.commons.compress.compressors.FramedSnappyTestCase
Running org.apache.commons.compress.compressors.DeflateTestCase
Tests run: 4, Failures: 0, Errors: 0, Skipped: 0, Time elapsed: 0.003 sec - in org.apache.commons.compress.compressors.DeflateTestCase
Running org.apache.commons.compress.compressors.pack200.Pack200UtilsTest
Tests run: 2, Failures: 0, Errors: 0, Skipped: 0, Time elapsed: 0.046 sec - in org.apache.commons.compress.compressors.pack200.Pack200UtilsTest
Running org.apache.commons.compress.compressors.BZip2UtilsTestCase
Tests run: 3, Failures: 0, Errors: 0, Skipped: 0, Time elapsed: 0 sec - in org.apache.commons.compress.compressors.BZip2UtilsTestCase
Running org.apache.commons.compress.compressors.XZTestCase
XZTestCase: HeapMax=11253841920 bytes 10732.5 MB
Tests run: 4, Failures: 0, Errors: 0, Skipped: 0, Time elapsed: 0.044 sec - in org.apache.commons.compress.compressors.XZTestCase
Running org.apache.commons.compress.compressors.CompressorStreamFactoryRoundtripTest
Tests run: 4, Failures: 0, Errors: 0, Skipped: 0, Time elapsed: 0.066 sec - in org.apache.commons.compress.compressors.CompressorStreamFactoryRoundtripTest
Running org.apache.commons.compress.compressors.zstandard.ZstdUtilsTest
Tests run: 2, Failures: 0, Errors: 0, Skipped: 0, Time elapsed: 0.002 sec - in org.apache.commons.compress.compressors.zstandard.ZstdUtilsTest
Running org.apache.commons.compress.compressors.zstandard.ZstdCompressorInputStreamTest
Tests run: 8, Failures: 0, Errors: 0, Skipped: 0, Time elapsed: 0.012 sec - in org.apache.commons.compress.compressors.zstandard.ZstdCompressorInputStreamTest
Running org.apache.commons.compress.compressors.LZMATestCase
Tests run: 3, Failures: 0, Errors: 0, Skipped: 0, Time elapsed: 0.03 sec - in org.apache.commons.compress.compressors.LZMATestCase
Running org.apache.commons.compress.compressors.Pack200TestCase
Tests run: 11, Failures: 0, Errors: 0, Skipped: 0, Time elapsed: 0.071 sec - in org.apache.commons.compress.compressors.Pack200TestCase
Running org.apache.commons.compress.compressors.ZTestCase
Tests run: 4, Failures: 0, Errors: 0, Skipped: 0, Time elapsed: 0.016 sec - in org.apache.commons.compress.compressors.ZTestCase
Running org.apache.commons.compress.compressors.brotli.BrotliCompressorInputStreamTest
Tests run: 9, Failures: 0, Errors: 0, Skipped: 0, Time elapsed: 0.065 sec - in org.apache.commons.compress.compressors.brotli.BrotliCompressorInputStreamTest
Running org.apache.commons.compress.DetectArchiverTestCase
Tests run: 7, Failures: 0, Errors: 0, Skipped: 0, Time elapsed: 0.006 sec - in org.apache.commons.compress.DetectArchiverTestCase

Results :

Tests run: 878, Failures: 0, Errors: 0, Skipped: 4

[JENKINS] Recording test results
[INFO] 
[INFO] --- maven-jar-plugin:3.0.0:jar (default-jar) @ commons-compress ---
[INFO] Building jar: <https://builds.apache.org/job/Commons-Compress/ws/target/commons-compress-1.16-SNAPSHOT.jar>
[INFO] 
[INFO] --- maven-site-plugin:3.6:attach-descriptor (attach-descriptor) @ commons-compress
---
[INFO] Skipping because packaging 'jar' is not pom.
[INFO] 
[INFO] >>> maven-javadoc-plugin:2.10.4:javadoc (create-javadoc-jar) > generate-sources
@ commons-compress >>>
[INFO] 
[INFO] --- maven-enforcer-plugin:1.4.1:enforce (enforce-maven-3) @ commons-compress ---
[INFO] 
[INFO] --- build-helper-maven-plugin:1.10:parse-version (parse-version) @ commons-compress
---
[INFO] 
[INFO] --- maven-antrun-plugin:1.8:run (javadoc.resources) @ commons-compress ---
[INFO] Executing tasks

main:
[INFO] Executed tasks
[WARNING] Failed to getClass for org.apache.maven.plugin.javadoc.JavadocReport
[INFO] 
[INFO] <<< maven-javadoc-plugin:2.10.4:javadoc (create-javadoc-jar) < generate-sources
@ commons-compress <<<
[INFO] 
[INFO] 
[INFO] --- maven-javadoc-plugin:2.10.4:javadoc (create-javadoc-jar) @ commons-compress ---
[INFO] 
2 errors
[JENKINS] Archiving  javadoc
ERROR: Could not install JDK_1_7_LATEST__HOME
java.lang.NullPointerException
	at hudson.plugins.toolenv.ToolEnvBuildWrapper$1.buildEnvVars(ToolEnvBuildWrapper.java:46)
	at hudson.model.AbstractBuild.getEnvironment(AbstractBuild.java:887)
	at hudson.maven.AbstractMavenBuild.getEnvironment(AbstractMavenBuild.java:56)
	at hudson.maven.MavenModuleSetBuild.getEnvironment(MavenModuleSetBuild.java:168)
	at hudson.plugins.git.GitSCM.getParamExpandedRepos(GitSCM.java:421)
	at hudson.plugins.git.GitSCM.compareRemoteRevisionWithImpl(GitSCM.java:629)
	at hudson.plugins.git.GitSCM.compareRemoteRevisionWith(GitSCM.java:594)
	at hudson.scm.SCM.compareRemoteRevisionWith(SCM.java:391)
	at hudson.scm.SCM.poll(SCM.java:408)
	at hudson.model.AbstractProject._poll(AbstractProject.java:1394)
	at hudson.model.AbstractProject.poll(AbstractProject.java:1297)
	at jenkins.triggers.SCMTriggerItem$SCMTriggerItems$Bridge.poll(SCMTriggerItem.java:143)
	at hudson.triggers.SCMTrigger$Runner.runPolling(SCMTrigger.java:594)
	at hudson.triggers.SCMTrigger$Runner.run(SCMTrigger.java:640)
	at hudson.util.SequentialExecutionQueue$QueueEntry.run(SequentialExecutionQueue.java:119)
	at java.util.concurrent.Executors$RunnableAdapter.call(Executors.java:511)
	at java.util.concurrent.FutureTask.run(FutureTask.java:266)
	at java.util.concurrent.ThreadPoolExecutor.runWorker(ThreadPoolExecutor.java:1149)
	at java.util.concurrent.ThreadPoolExecutor$Worker.run(ThreadPoolExecutor.java:624)
	at java.lang.Thread.run(Thread.java:748)
[INFO] ------------------------------------------------------------------------
[INFO] BUILD FAILURE
[INFO] ------------------------------------------------------------------------
[INFO] Total time: 02:25 min
[INFO] Finished at: 2017-12-27T14:19:59Z
[INFO] Final Memory: 43M/809M
[INFO] ------------------------------------------------------------------------
Waiting for Jenkins to finish collecting data
[ERROR] Failed to execute goal org.apache.maven.plugins:maven-javadoc-plugin:2.10.4:javadoc
(create-javadoc-jar) on project commons-compress: An error has occurred in JavaDocs report
generation:
[ERROR] Exit code: 1 - <https://builds.apache.org/job/Commons-Compress/ws/src/main/java/org/apache/commons/compress/compressors/lz77support/LZ77Compressor.java>:302:
error: reference not found
[ERROR] * EOD}) but potentially multiple blocks to the callback during
[ERROR] ^
[ERROR] <https://builds.apache.org/job/Commons-Compress/ws/src/main/java/org/apache/commons/compress/compressors/lz77support/LZ77Compressor.java>:52:
error: reference not found
[ERROR] * BackReference back-references} or {@link EOD end of data
[ERROR] ^
[ERROR] 
[ERROR] Command line was: /usr/local/asfpackages/java/jdk1.8.0_131/jre/../bin/javadoc @options
@packages
[ERROR] 
[ERROR] Refer to the generated Javadoc files in '<https://builds.apache.org/job/Commons-Compress/ws/target/site/apidocs'>
dir.
[ERROR] -> [Help 1]
[ERROR] 
[ERROR] To see the full stack trace of the errors, re-run Maven with the -e switch.
[ERROR] Re-run Maven using the -X switch to enable full debug logging.
[ERROR] 
[ERROR] For more information about the errors and possible solutions, please read the following
articles:
[ERROR] [Help 1] http://cwiki.apache.org/confluence/display/MAVEN/MojoExecutionException
[JENKINS] Archiving <https://builds.apache.org/job/Commons-Compress/ws/pom.xml> to org.apache.commons/commons-compress/1.16-SNAPSHOT/commons-compress-1.16-SNAPSHOT.pom
[JENKINS] Archiving <https://builds.apache.org/job/Commons-Compress/ws/target/commons-compress-1.16-SNAPSHOT.jar>
to org.apache.commons/commons-compress/1.16-SNAPSHOT/commons-compress-1.16-SNAPSHOT.jar
Sending e-mails to: notifications@commons.apache.org
channel stopped
Setting JDK_1_7_LATEST__HOME=/home/jenkins/tools/java/latest1.7
Setting JDK_1_7_LATEST__HOME=/home/jenkins/tools/java/latest1.7

Mime
View raw message