commons-notifications mailing list archives

Site index · List index
Message view « Date » · « Thread »
Top « Date » · « Thread »
From Apache Jenkins Server <jenk...@builds.apache.org>
Subject Build failed in Jenkins: commons-net #77
Date Thu, 19 Oct 2017 16:57:14 GMT
See <https://builds.apache.org/job/commons-net/77/display/redirect?page=changes>

Changes:

[sebb] Fix help message

------------------------------------------
[...truncated 13.15 KB...]
Running NTP service on port 59169/UDP
NTP packet from 127.0.0.1 mode=Client
Tests run: 1, Failures: 0, Errors: 0, Skipped: 0, Time elapsed: 2.013 sec - in org.apache.commons.net.ntp.TestNtpClient
Running org.apache.commons.net.ntp.TestNtpPacket
Tests run: 7, Failures: 0, Errors: 0, Skipped: 0, Time elapsed: 0.032 sec - in org.apache.commons.net.ntp.TestNtpPacket
Running org.apache.commons.net.ntp.TimeStampTest
Tests run: 4, Failures: 0, Errors: 0, Skipped: 0, Time elapsed: 0.022 sec - in org.apache.commons.net.ntp.TimeStampTest
Running org.apache.commons.net.telnet.TelnetOptionTest
Tests run: 2, Failures: 0, Errors: 0, Skipped: 0, Time elapsed: 0 sec - in org.apache.commons.net.telnet.TelnetOptionTest
Running org.apache.commons.net.telnet.TerminalTypeOptionHandlerTest
Tests run: 5, Failures: 0, Errors: 0, Skipped: 0, Time elapsed: 0.002 sec - in org.apache.commons.net.telnet.TerminalTypeOptionHandlerTest
Running org.apache.commons.net.telnet.TelnetClientTest
Tests run: 9, Failures: 0, Errors: 0, Skipped: 0, Time elapsed: 46.831 sec - in org.apache.commons.net.telnet.TelnetClientTest
Running org.apache.commons.net.telnet.InvalidTelnetOptionExceptionTest
Tests run: 1, Failures: 0, Errors: 0, Skipped: 0, Time elapsed: 0.002 sec - in org.apache.commons.net.telnet.InvalidTelnetOptionExceptionTest
Running org.apache.commons.net.telnet.WindowSizeOptionHandlerTest
Tests run: 6, Failures: 0, Errors: 0, Skipped: 0, Time elapsed: 0 sec - in org.apache.commons.net.telnet.WindowSizeOptionHandlerTest
Running org.apache.commons.net.telnet.SuppressGAOptionHandlerTest
Tests run: 5, Failures: 0, Errors: 0, Skipped: 0, Time elapsed: 0.002 sec - in org.apache.commons.net.telnet.SuppressGAOptionHandlerTest
Running org.apache.commons.net.telnet.SimpleOptionHandlerTest
Tests run: 5, Failures: 0, Errors: 0, Skipped: 0, Time elapsed: 0.025 sec - in org.apache.commons.net.telnet.SimpleOptionHandlerTest
Running org.apache.commons.net.telnet.EchoOptionHandlerTest
Tests run: 5, Failures: 0, Errors: 0, Skipped: 0, Time elapsed: 0.001 sec - in org.apache.commons.net.telnet.EchoOptionHandlerTest
Running org.apache.commons.net.time.TimeTCPClientTest
Tests run: 2, Failures: 0, Errors: 0, Skipped: 0, Time elapsed: 1.031 sec - in org.apache.commons.net.time.TimeTCPClientTest
Running org.apache.commons.net.util.UtilTest
Tests run: 9, Failures: 0, Errors: 0, Skipped: 0, Time elapsed: 0.001 sec - in org.apache.commons.net.util.UtilTest
Running org.apache.commons.net.util.Base64Test
Tests run: 28, Failures: 0, Errors: 0, Skipped: 19, Time elapsed: 0.022 sec - in org.apache.commons.net.util.Base64Test

Results :

Tests run: 287, Failures: 0, Errors: 0, Skipped: 19

[JENKINS] Recording test results
[INFO] 
[INFO] --- maven-jar-plugin:3.0.0:jar (default-jar) @ commons-net ---
[INFO] Building jar: <https://builds.apache.org/job/commons-net/ws/target/commons-net-3.7-SNAPSHOT.jar>
[INFO] 
[INFO] --- maven-site-plugin:3.6:attach-descriptor (attach-descriptor) @ commons-net ---
[INFO] Skipping because packaging 'jar' is not pom.
[INFO] 
[INFO] >>> maven-javadoc-plugin:2.10.4:javadoc (create-javadoc-jar) > generate-sources
@ commons-net >>>
[INFO] 
[INFO] --- maven-enforcer-plugin:1.4.1:enforce (enforce-maven-3) @ commons-net ---
[INFO] 
[INFO] --- build-helper-maven-plugin:1.10:parse-version (parse-version) @ commons-net ---
[INFO] 
[INFO] --- maven-antrun-plugin:1.8:run (javadoc.resources) @ commons-net ---
[INFO] Executing tasks

main:
[INFO] Executed tasks
[WARNING] Failed to getClass for org.apache.maven.plugin.javadoc.JavadocReport
[INFO] 
[INFO] <<< maven-javadoc-plugin:2.10.4:javadoc (create-javadoc-jar) < generate-sources
@ commons-net <<<
[INFO] 
[INFO] --- maven-javadoc-plugin:2.10.4:javadoc (create-javadoc-jar) @ commons-net ---
[INFO] 
1 warning
[WARNING] Javadoc Warnings
[WARNING] <https://builds.apache.org/job/commons-net/ws/src/main/java/org/apache/commons/net/ftp/FTPClient.java>:281:
warning: empty <p> tag
[WARNING] * <p>
[WARNING] ^
[JENKINS] Archiving  javadoc
[INFO] 
[INFO] --- maven-javadoc-plugin:2.10.4:jar (create-javadoc-jar) @ commons-net ---
[INFO] 
1 warning
[WARNING] Javadoc Warnings
[WARNING] <https://builds.apache.org/job/commons-net/ws/src/main/java/org/apache/commons/net/ftp/FTPClient.java>:281:
warning: empty <p> tag
[WARNING] * <p>
[WARNING] ^
[INFO] Building jar: <https://builds.apache.org/job/commons-net/ws/target/commons-net-3.7-SNAPSHOT-javadoc.jar>
[INFO] 
[INFO] --- maven-antrun-plugin:1.8:run (default) @ commons-net ---
[INFO] Executing tasks

main:
      [jar] Building jar: <https://builds.apache.org/job/commons-net/ws/target/commons-net-ftp-3.7-SNAPSHOT.jar>
      [jar] Building jar: <https://builds.apache.org/job/commons-net/ws/target/commons-net-examples-3.7-SNAPSHOT.jar>
[INFO] Executed tasks
[INFO] 
[INFO] >>> maven-source-plugin:3.0.1:jar (create-source-jar) > generate-sources
@ commons-net >>>
[INFO] 
[INFO] --- maven-enforcer-plugin:1.4.1:enforce (enforce-maven-3) @ commons-net ---
[INFO] 
[INFO] --- build-helper-maven-plugin:1.10:parse-version (parse-version) @ commons-net ---
[INFO] 
[INFO] --- maven-antrun-plugin:1.8:run (javadoc.resources) @ commons-net ---
[INFO] Executing tasks

main:
[INFO] Executed tasks
[WARNING] Failed to getClass for org.apache.maven.plugins.source.SourceJarMojo
[INFO] 
[INFO] <<< maven-source-plugin:3.0.1:jar (create-source-jar) < generate-sources
@ commons-net <<<
[INFO] 
[INFO] --- maven-source-plugin:3.0.1:jar (create-source-jar) @ commons-net ---
[INFO] Building jar: <https://builds.apache.org/job/commons-net/ws/target/commons-net-3.7-SNAPSHOT-sources.jar>
[INFO] 
[INFO] >>> maven-source-plugin:3.0.1:test-jar (create-source-jar) > generate-sources
@ commons-net >>>
[INFO] 
[INFO] --- maven-enforcer-plugin:1.4.1:enforce (enforce-maven-3) @ commons-net ---
[INFO] 
[INFO] --- build-helper-maven-plugin:1.10:parse-version (parse-version) @ commons-net ---
[INFO] 
[INFO] --- maven-antrun-plugin:1.8:run (javadoc.resources) @ commons-net ---
[INFO] Executing tasks

main:
[INFO] Executed tasks
[WARNING] Failed to getClass for org.apache.maven.plugins.source.TestSourceJarMojo
[INFO] 
[INFO] <<< maven-source-plugin:3.0.1:test-jar (create-source-jar) < generate-sources
@ commons-net <<<
[INFO] 
[INFO] --- maven-source-plugin:3.0.1:test-jar (create-source-jar) @ commons-net ---
[INFO] Building jar: <https://builds.apache.org/job/commons-net/ws/target/commons-net-3.7-SNAPSHOT-test-sources.jar>
[INFO] 
[INFO] --- maven-jar-plugin:3.0.0:test-jar (default) @ commons-net ---
[INFO] Building jar: <https://builds.apache.org/job/commons-net/ws/target/commons-net-3.7-SNAPSHOT-tests.jar>
[INFO] 
[INFO] --- build-helper-maven-plugin:1.10:attach-artifact (attach-artifacts) @ commons-net
---
[INFO] 
[INFO] --- maven-assembly-plugin:2.6:single (default) @ commons-net ---
[INFO] Reading assembly descriptor: src/assembly/bin.xml
[INFO] Reading assembly descriptor: src/assembly/src.xml
[INFO] Building tar: <https://builds.apache.org/job/commons-net/ws/target/commons-net-3.7-SNAPSHOT-bin.tar.gz>
[INFO] Building zip: <https://builds.apache.org/job/commons-net/ws/target/commons-net-3.7-SNAPSHOT-bin.zip>
[INFO] Building tar: <https://builds.apache.org/job/commons-net/ws/target/commons-net-3.7-SNAPSHOT-src.tar.gz>
[INFO] Building zip: <https://builds.apache.org/job/commons-net/ws/target/commons-net-3.7-SNAPSHOT-src.zip>
[INFO] 
[INFO] --- maven-gpg-plugin:1.6:sign (sign-artifacts) @ commons-net ---
[INFO] 
[INFO] --- maven-install-plugin:2.5.2:install (default-install) @ commons-net ---
[INFO] Installing <https://builds.apache.org/job/commons-net/ws/target/commons-net-3.7-SNAPSHOT.jar>
to /home/jenkins/jenkins-slave/maven-repositories/0/commons-net/commons-net/3.7-SNAPSHOT/commons-net-3.7-SNAPSHOT.jar
[INFO] Installing <https://builds.apache.org/job/commons-net/ws/pom.xml> to /home/jenkins/jenkins-slave/maven-repositories/0/commons-net/commons-net/3.7-SNAPSHOT/commons-net-3.7-SNAPSHOT.pom
[INFO] Installing <https://builds.apache.org/job/commons-net/ws/target/commons-net-3.7-SNAPSHOT-javadoc.jar>
to /home/jenkins/jenkins-slave/maven-repositories/0/commons-net/commons-net/3.7-SNAPSHOT/commons-net-3.7-SNAPSHOT-javadoc.jar
[INFO] Installing <https://builds.apache.org/job/commons-net/ws/target/commons-net-3.7-SNAPSHOT-sources.jar>
to /home/jenkins/jenkins-slave/maven-repositories/0/commons-net/commons-net/3.7-SNAPSHOT/commons-net-3.7-SNAPSHOT-sources.jar
[INFO] Installing <https://builds.apache.org/job/commons-net/ws/target/commons-net-3.7-SNAPSHOT-test-sources.jar>
to /home/jenkins/jenkins-slave/maven-repositories/0/commons-net/commons-net/3.7-SNAPSHOT/commons-net-3.7-SNAPSHOT-test-sources.jar
[INFO] Installing <https://builds.apache.org/job/commons-net/ws/target/commons-net-3.7-SNAPSHOT-tests.jar>
to /home/jenkins/jenkins-slave/maven-repositories/0/commons-net/commons-net/3.7-SNAPSHOT/commons-net-3.7-SNAPSHOT-tests.jar
[INFO] Installing <https://builds.apache.org/job/commons-net/ws/target/commons-net-ftp-3.7-SNAPSHOT.jar>
to /home/jenkins/jenkins-slave/maven-repositories/0/commons-net/commons-net/3.7-SNAPSHOT/commons-net-3.7-SNAPSHOT-ftp.jar
[INFO] Installing <https://builds.apache.org/job/commons-net/ws/target/commons-net-examples-3.7-SNAPSHOT.jar>
to /home/jenkins/jenkins-slave/maven-repositories/0/commons-net/commons-net/3.7-SNAPSHOT/commons-net-3.7-SNAPSHOT-examples.jar
[INFO] Installing <https://builds.apache.org/job/commons-net/ws/target/commons-net-3.7-SNAPSHOT-bin.tar.gz>
to /home/jenkins/jenkins-slave/maven-repositories/0/commons-net/commons-net/3.7-SNAPSHOT/commons-net-3.7-SNAPSHOT-bin.tar.gz
[INFO] Installing <https://builds.apache.org/job/commons-net/ws/target/commons-net-3.7-SNAPSHOT-bin.zip>
to /home/jenkins/jenkins-slave/maven-repositories/0/commons-net/commons-net/3.7-SNAPSHOT/commons-net-3.7-SNAPSHOT-bin.zip
[INFO] Installing <https://builds.apache.org/job/commons-net/ws/target/commons-net-3.7-SNAPSHOT-src.tar.gz>
to /home/jenkins/jenkins-slave/maven-repositories/0/commons-net/commons-net/3.7-SNAPSHOT/commons-net-3.7-SNAPSHOT-src.tar.gz
[INFO] Installing <https://builds.apache.org/job/commons-net/ws/target/commons-net-3.7-SNAPSHOT-src.zip>
to /home/jenkins/jenkins-slave/maven-repositories/0/commons-net/commons-net/3.7-SNAPSHOT/commons-net-3.7-SNAPSHOT-src.zip
[INFO] ------------------------------------------------------------------------
[INFO] BUILD SUCCESS
[INFO] ------------------------------------------------------------------------
[INFO] Total time: 14:21 min
[INFO] Finished at: 2017-10-19T16:52:17+00:00
[INFO] Final Memory: 42M/751M
[INFO] ------------------------------------------------------------------------
Waiting for Jenkins to finish collecting data
[JENKINS] Archiving <https://builds.apache.org/job/commons-net/ws/pom.xml> to commons-net/commons-net/3.7-SNAPSHOT/commons-net-3.7-SNAPSHOT.pom
[JENKINS] Archiving <https://builds.apache.org/job/commons-net/ws/target/commons-net-3.7-SNAPSHOT.jar>
to commons-net/commons-net/3.7-SNAPSHOT/commons-net-3.7-SNAPSHOT.jar
[JENKINS] Archiving <https://builds.apache.org/job/commons-net/ws/target/commons-net-3.7-SNAPSHOT-javadoc.jar>
to commons-net/commons-net/3.7-SNAPSHOT/commons-net-3.7-SNAPSHOT-javadoc.jar
[JENKINS] Archiving <https://builds.apache.org/job/commons-net/ws/target/commons-net-3.7-SNAPSHOT-sources.jar>
to commons-net/commons-net/3.7-SNAPSHOT/commons-net-3.7-SNAPSHOT-sources.jar
[JENKINS] Archiving <https://builds.apache.org/job/commons-net/ws/target/commons-net-3.7-SNAPSHOT-test-sources.jar>
to commons-net/commons-net/3.7-SNAPSHOT/commons-net-3.7-SNAPSHOT-test-sources.jar
[JENKINS] Archiving <https://builds.apache.org/job/commons-net/ws/target/commons-net-3.7-SNAPSHOT-tests.jar>
to commons-net/commons-net/3.7-SNAPSHOT/commons-net-3.7-SNAPSHOT-tests.jar
[JENKINS] Archiving <https://builds.apache.org/job/commons-net/ws/target/commons-net-ftp-3.7-SNAPSHOT.jar>
to commons-net/commons-net/3.7-SNAPSHOT/commons-net-3.7-SNAPSHOT-ftp.jar
[JENKINS] Archiving <https://builds.apache.org/job/commons-net/ws/target/commons-net-examples-3.7-SNAPSHOT.jar>
to commons-net/commons-net/3.7-SNAPSHOT/commons-net-3.7-SNAPSHOT-examples.jar
[JENKINS] Archiving <https://builds.apache.org/job/commons-net/ws/target/commons-net-3.7-SNAPSHOT-bin.tar.gz>
to commons-net/commons-net/3.7-SNAPSHOT/commons-net-3.7-SNAPSHOT-bin.tar.gz
[JENKINS] Archiving <https://builds.apache.org/job/commons-net/ws/target/commons-net-3.7-SNAPSHOT-bin.zip>
to commons-net/commons-net/3.7-SNAPSHOT/commons-net-3.7-SNAPSHOT-bin.zip
[JENKINS] Archiving <https://builds.apache.org/job/commons-net/ws/target/commons-net-3.7-SNAPSHOT-src.tar.gz>
to commons-net/commons-net/3.7-SNAPSHOT/commons-net-3.7-SNAPSHOT-src.tar.gz
[JENKINS] Archiving <https://builds.apache.org/job/commons-net/ws/target/commons-net-3.7-SNAPSHOT-src.zip>
to commons-net/commons-net/3.7-SNAPSHOT/commons-net-3.7-SNAPSHOT-src.zip
channel stopped
Maven RedeployPublisher use remote beam4 maven settings from : /home/jenkins/.m2/settings.xml
[INFO] Deployment in https://repository.apache.org/content/repositories/snapshots (id=apache.snapshots.https,uniqueVersion=true)
Deploying the main artifact commons-net-3.7-SNAPSHOT.jar
Downloading: https://repository.apache.org/content/repositories/snapshots/commons-net/commons-net/3.7-SNAPSHOT/maven-metadata.xml
Downloaded: https://repository.apache.org/content/repositories/snapshots/commons-net/commons-net/3.7-SNAPSHOT/maven-metadata.xml
(3 KB at 0.2 KB/sec)
Uploading: https://repository.apache.org/content/repositories/snapshots/commons-net/commons-net/3.7-SNAPSHOT/commons-net-3.7-20171019.165358-40.jar
Uploaded: https://repository.apache.org/content/repositories/snapshots/commons-net/commons-net/3.7-SNAPSHOT/commons-net-3.7-20171019.165358-40.jar
(301 KB at 18.5 KB/sec)
Uploading: https://repository.apache.org/content/repositories/snapshots/commons-net/commons-net/3.7-SNAPSHOT/commons-net-3.7-20171019.165358-40.pom
Uploaded: https://repository.apache.org/content/repositories/snapshots/commons-net/commons-net/3.7-SNAPSHOT/commons-net-3.7-20171019.165358-40.pom
(21 KB at 1.5 KB/sec)
Downloading: https://repository.apache.org/content/repositories/snapshots/commons-net/commons-net/maven-metadata.xml
Downloaded: https://repository.apache.org/content/repositories/snapshots/commons-net/commons-net/maven-metadata.xml
(338 B at 0.6 KB/sec)
Uploading: https://repository.apache.org/content/repositories/snapshots/commons-net/commons-net/3.7-SNAPSHOT/maven-metadata.xml
Uploaded: https://repository.apache.org/content/repositories/snapshots/commons-net/commons-net/3.7-SNAPSHOT/maven-metadata.xml
(3 KB at 0.2 KB/sec)
Uploading: https://repository.apache.org/content/repositories/snapshots/commons-net/commons-net/maven-metadata.xml
Uploaded: https://repository.apache.org/content/repositories/snapshots/commons-net/commons-net/maven-metadata.xml
(338 B at 0.0 KB/sec)
Deploying the main artifact commons-net-3.7-SNAPSHOT-javadoc.jar
Uploading: https://repository.apache.org/content/repositories/snapshots/commons-net/commons-net/3.7-SNAPSHOT/commons-net-3.7-20171019.165358-40-javadoc.jar
Uploaded: https://repository.apache.org/content/repositories/snapshots/commons-net/commons-net/3.7-SNAPSHOT/commons-net-3.7-20171019.165358-40-javadoc.jar
(1267 KB at 48.8 KB/sec)
Uploading: https://repository.apache.org/content/repositories/snapshots/commons-net/commons-net/3.7-SNAPSHOT/maven-metadata.xml
Uploaded: https://repository.apache.org/content/repositories/snapshots/commons-net/commons-net/3.7-SNAPSHOT/maven-metadata.xml
(3 KB at 0.2 KB/sec)
Deploying the main artifact commons-net-3.7-SNAPSHOT-sources.jar
Uploading: https://repository.apache.org/content/repositories/snapshots/commons-net/commons-net/3.7-SNAPSHOT/commons-net-3.7-20171019.165358-40-sources.jar
Uploaded: https://repository.apache.org/content/repositories/snapshots/commons-net/commons-net/3.7-SNAPSHOT/commons-net-3.7-20171019.165358-40-sources.jar
(427 KB at 264.4 KB/sec)
Uploading: https://repository.apache.org/content/repositories/snapshots/commons-net/commons-net/3.7-SNAPSHOT/maven-metadata.xml
Uploaded: https://repository.apache.org/content/repositories/snapshots/commons-net/commons-net/3.7-SNAPSHOT/maven-metadata.xml
(3 KB at 0.2 KB/sec)
Deploying the main artifact commons-net-3.7-SNAPSHOT-test-sources.jar
Uploading: https://repository.apache.org/content/repositories/snapshots/commons-net/commons-net/3.7-SNAPSHOT/commons-net-3.7-20171019.165358-40-test-sources.jar
Uploaded: https://repository.apache.org/content/repositories/snapshots/commons-net/commons-net/3.7-SNAPSHOT/commons-net-3.7-20171019.165358-40-test-sources.jar
(128 KB at 9.4 KB/sec)
Uploading: https://repository.apache.org/content/repositories/snapshots/commons-net/commons-net/3.7-SNAPSHOT/maven-metadata.xml
Uploaded: https://repository.apache.org/content/repositories/snapshots/commons-net/commons-net/3.7-SNAPSHOT/maven-metadata.xml
(3 KB at 0.2 KB/sec)
Deploying the main artifact commons-net-3.7-SNAPSHOT-tests.jar
Uploading: https://repository.apache.org/content/repositories/snapshots/commons-net/commons-net/3.7-SNAPSHOT/commons-net-3.7-20171019.165358-40-tests.jar
Uploaded: https://repository.apache.org/content/repositories/snapshots/commons-net/commons-net/3.7-SNAPSHOT/commons-net-3.7-20171019.165358-40-tests.jar
(167 KB at 11.0 KB/sec)
Uploading: https://repository.apache.org/content/repositories/snapshots/commons-net/commons-net/3.7-SNAPSHOT/maven-metadata.xml
Uploaded: https://repository.apache.org/content/repositories/snapshots/commons-net/commons-net/3.7-SNAPSHOT/maven-metadata.xml
(3 KB at 0.2 KB/sec)
Deploying the main artifact commons-net-3.7-SNAPSHOT-ftp.jar
Uploading: https://repository.apache.org/content/repositories/snapshots/commons-net/commons-net/3.7-SNAPSHOT/commons-net-3.7-20171019.165358-40-ftp.jar
Uploaded: https://repository.apache.org/content/repositories/snapshots/commons-net/commons-net/3.7-SNAPSHOT/commons-net-3.7-20171019.165358-40-ftp.jar
(145 KB at 103.7 KB/sec)
Uploading: https://repository.apache.org/content/repositories/snapshots/commons-net/commons-net/3.7-SNAPSHOT/maven-metadata.xml
ERROR: Failed to deploy metadata: Could not transfer metadata commons-net:commons-net:3.7-SNAPSHOT/maven-metadata.xml
from/to apache.snapshots.https (https://repository.apache.org/content/repositories/snapshots):
Failed to transfer file: https://repository.apache.org/content/repositories/snapshots/commons-net/commons-net/3.7-SNAPSHOT/maven-metadata.xml.
Return code is: 400, ReasonPhrase: Bad Request.
org.apache.maven.artifact.deployer.ArtifactDeploymentException: Failed to deploy metadata:
Could not transfer metadata commons-net:commons-net:3.7-SNAPSHOT/maven-metadata.xml from/to
apache.snapshots.https (https://repository.apache.org/content/repositories/snapshots): Failed
to transfer file: https://repository.apache.org/content/repositories/snapshots/commons-net/commons-net/3.7-SNAPSHOT/maven-metadata.xml.
Return code is: 400, ReasonPhrase: Bad Request.
	at org.apache.maven.artifact.deployer.DefaultArtifactDeployer.deploy(DefaultArtifactDeployer.java:143)
	at hudson.maven.reporters.MavenArtifactRecord.deploy(MavenArtifactRecord.java:208)
	at hudson.maven.RedeployPublisher.perform(RedeployPublisher.java:176)
	at hudson.tasks.BuildStepMonitor$1.perform(BuildStepMonitor.java:20)
	at hudson.model.AbstractBuild$AbstractBuildExecution.perform(AbstractBuild.java:736)
	at hudson.model.AbstractBuild$AbstractBuildExecution.performAllBuildSteps(AbstractBuild.java:682)
	at hudson.maven.MavenModuleSetBuild$MavenModuleSetBuildExecution.post2(MavenModuleSetBuild.java:1073)
	at hudson.model.AbstractBuild$AbstractBuildExecution.post(AbstractBuild.java:627)
	at hudson.model.Run.execute(Run.java:1762)
	at hudson.maven.MavenModuleSetBuild.run(MavenModuleSetBuild.java:543)
	at hudson.model.ResourceController.execute(ResourceController.java:97)
	at hudson.model.Executor.run(Executor.java:419)
Caused by: org.eclipse.aether.deployment.DeploymentException: Failed to deploy metadata: Could
not transfer metadata commons-net:commons-net:3.7-SNAPSHOT/maven-metadata.xml from/to apache.snapshots.https
(https://repository.apache.org/content/repositories/snapshots): Failed to transfer file: https://repository.apache.org/content/repositories/snapshots/commons-net/commons-net/3.7-SNAPSHOT/maven-metadata.xml.
Return code is: 400, ReasonPhrase: Bad Request.
	at org.eclipse.aether.internal.impl.DefaultDeployer.deploy(DefaultDeployer.java:348)
	at org.eclipse.aether.internal.impl.DefaultDeployer.deploy(DefaultDeployer.java:245)
	at org.eclipse.aether.internal.impl.DefaultRepositorySystem.deploy(DefaultRepositorySystem.java:420)
	at org.apache.maven.artifact.deployer.DefaultArtifactDeployer.deploy(DefaultArtifactDeployer.java:139)
	... 11 more
Caused by: org.eclipse.aether.transfer.MetadataTransferException: Could not transfer metadata
commons-net:commons-net:3.7-SNAPSHOT/maven-metadata.xml from/to apache.snapshots.https (https://repository.apache.org/content/repositories/snapshots):
Failed to transfer file: https://repository.apache.org/content/repositories/snapshots/commons-net/commons-net/3.7-SNAPSHOT/maven-metadata.xml.
Return code is: 400, ReasonPhrase: Bad Request.
	at org.eclipse.aether.connector.basic.MetadataTransportListener.transferFailed(MetadataTransportListener.java:43)
	at org.eclipse.aether.connector.basic.BasicRepositoryConnector$TaskRunner.run(BasicRepositoryConnector.java:355)
	at org.eclipse.aether.connector.basic.BasicRepositoryConnector.put(BasicRepositoryConnector.java:288)
	at org.eclipse.aether.internal.impl.DefaultDeployer.deploy(DefaultDeployer.java:342)
	... 14 more
Caused by: org.apache.maven.wagon.TransferFailedException: Failed to transfer file: https://repository.apache.org/content/repositories/snapshots/commons-net/commons-net/3.7-SNAPSHOT/maven-metadata.xml.
Return code is: 400, ReasonPhrase: Bad Request.
	at org.apache.maven.wagon.shared.http.AbstractHttpClientWagon.put(AbstractHttpClientWagon.java:635)
	at org.apache.maven.wagon.shared.http.AbstractHttpClientWagon.put(AbstractHttpClientWagon.java:557)
	at org.apache.maven.wagon.shared.http.AbstractHttpClientWagon.put(AbstractHttpClientWagon.java:539)
	at org.apache.maven.wagon.shared.http.AbstractHttpClientWagon.put(AbstractHttpClientWagon.java:533)
	at org.apache.maven.wagon.shared.http.AbstractHttpClientWagon.put(AbstractHttpClientWagon.java:513)
	at org.eclipse.aether.transport.wagon.WagonTransporter$PutTaskRunner.run(WagonTransporter.java:644)
	at org.eclipse.aether.transport.wagon.WagonTransporter.execute(WagonTransporter.java:427)
	at org.eclipse.aether.transport.wagon.WagonTransporter.put(WagonTransporter.java:410)
	at org.eclipse.aether.connector.basic.BasicRepositoryConnector$PutTaskRunner.runTask(BasicRepositoryConnector.java:510)
	at org.eclipse.aether.connector.basic.BasicRepositoryConnector$TaskRunner.run(BasicRepositoryConnector.java:350)
	... 16 more
[INFO] Deployment failed after 3 min 30 sec
Build step 'Deploy artifacts to Maven repository' changed build result to FAILURE
Setting JDK_1_6_LATEST__HOME=/home/jenkins/tools/java/latest1.6
Setting JDK_1_6_LATEST__HOME=/home/jenkins/tools/java/latest1.6

Mime
View raw message