commons-notifications mailing list archives

Site index · List index
Message view « Date » · « Thread »
Top « Date » · « Thread »
From Apache Jenkins Server <jenk...@builds.apache.org>
Subject Build failed in Jenkins: commons-lang #268
Date Mon, 23 Oct 2017 16:44:54 GMT
See <https://builds.apache.org/job/commons-lang/268/display/redirect?page=changes>

Changes:

[ggregory] Sort members.

------------------------------------------
[...truncated 33.33 KB...]
Running org.apache.commons.lang3.concurrent.BackgroundInitializerTest
Tests run: 15, Failures: 0, Errors: 0, Skipped: 0, Time elapsed: 0.006 sec - in org.apache.commons.lang3.concurrent.BackgroundInitializerTest
Running org.apache.commons.lang3.concurrent.BasicThreadFactoryTest
Tests run: 15, Failures: 0, Errors: 0, Skipped: 0, Time elapsed: 0.007 sec - in org.apache.commons.lang3.concurrent.BasicThreadFactoryTest
Running org.apache.commons.lang3.concurrent.AtomicInitializerTest
Tests run: 3, Failures: 0, Errors: 0, Skipped: 0, Time elapsed: 0.003 sec - in org.apache.commons.lang3.concurrent.AtomicInitializerTest
Running org.apache.commons.lang3.concurrent.CircuitBreakingExceptionTest
Tests run: 7, Failures: 0, Errors: 0, Skipped: 0, Time elapsed: 0 sec - in org.apache.commons.lang3.concurrent.CircuitBreakingExceptionTest
Running org.apache.commons.lang3.concurrent.ConstantInitializerTest
Tests run: 7, Failures: 0, Errors: 0, Skipped: 0, Time elapsed: 0 sec - in org.apache.commons.lang3.concurrent.ConstantInitializerTest
Running org.apache.commons.lang3.concurrent.LazyInitializerTest
Tests run: 3, Failures: 0, Errors: 0, Skipped: 0, Time elapsed: 0.003 sec - in org.apache.commons.lang3.concurrent.LazyInitializerTest
Running org.apache.commons.lang3.CharUtilsTest
Tests run: 24, Failures: 0, Errors: 0, Skipped: 0, Time elapsed: 0.002 sec - in org.apache.commons.lang3.CharUtilsTest
Running org.apache.commons.lang3.ArrayUtilsRemoveTest
Tests run: 28, Failures: 0, Errors: 0, Skipped: 0, Time elapsed: 0.002 sec - in org.apache.commons.lang3.ArrayUtilsRemoveTest
Running org.apache.commons.lang3.StringUtilsStartsEndsWithTest
Tests run: 6, Failures: 0, Errors: 0, Skipped: 0, Time elapsed: 0.001 sec - in org.apache.commons.lang3.StringUtilsStartsEndsWithTest
Running org.apache.commons.lang3.reflect.TypeLiteralTest
Tests run: 4, Failures: 0, Errors: 0, Skipped: 0, Time elapsed: 0.004 sec - in org.apache.commons.lang3.reflect.TypeLiteralTest
Running org.apache.commons.lang3.reflect.MethodUtilsTest
Tests run: 40, Failures: 0, Errors: 0, Skipped: 0, Time elapsed: 0.02 sec - in org.apache.commons.lang3.reflect.MethodUtilsTest
Running org.apache.commons.lang3.reflect.ConstructorUtilsTest
Tests run: 8, Failures: 0, Errors: 0, Skipped: 0, Time elapsed: 0.003 sec - in org.apache.commons.lang3.reflect.ConstructorUtilsTest
Running org.apache.commons.lang3.reflect.InheritanceUtilsTest
Tests run: 9, Failures: 0, Errors: 0, Skipped: 0, Time elapsed: 0.001 sec - in org.apache.commons.lang3.reflect.InheritanceUtilsTest
Running org.apache.commons.lang3.reflect.FieldUtilsTest
Tests run: 64, Failures: 0, Errors: 0, Skipped: 0, Time elapsed: 0.013 sec - in org.apache.commons.lang3.reflect.FieldUtilsTest
Running org.apache.commons.lang3.reflect.TypeUtilsTest
Tests run: 23, Failures: 0, Errors: 0, Skipped: 0, Time elapsed: 0.013 sec - in org.apache.commons.lang3.reflect.TypeUtilsTest
Running org.apache.commons.lang3.StringEscapeUtilsTest
Tests run: 32, Failures: 0, Errors: 0, Skipped: 0, Time elapsed: 0.272 sec - in org.apache.commons.lang3.StringEscapeUtilsTest
Running org.apache.commons.lang3.CharRangeTest
Tests run: 17, Failures: 0, Errors: 0, Skipped: 0, Time elapsed: 0.016 sec - in org.apache.commons.lang3.CharRangeTest

Results :

Tests run: 4067, Failures: 0, Errors: 0, Skipped: 5

[JENKINS] Recording test results
[INFO] 
[INFO] --- maven-jar-plugin:3.0.0:jar (default-jar) @ commons-lang3 ---
[INFO] Building jar: <https://builds.apache.org/job/commons-lang/ws/target/commons-lang3-3.7-SNAPSHOT.jar>
[INFO] 
[INFO] --- maven-site-plugin:3.6:attach-descriptor (attach-descriptor) @ commons-lang3 ---
[INFO] Skipping because packaging 'jar' is not pom.
[INFO] 
[INFO] >>> maven-javadoc-plugin:2.10.4:javadoc (create-javadoc-jar) > generate-sources
@ commons-lang3 >>>
[INFO] 
[INFO] --- maven-enforcer-plugin:1.4.1:enforce (enforce-maven-3) @ commons-lang3 ---
[INFO] 
[INFO] --- build-helper-maven-plugin:1.10:parse-version (parse-version) @ commons-lang3 ---
[INFO] 
[INFO] --- maven-antrun-plugin:1.8:run (javadoc.resources) @ commons-lang3 ---
[INFO] Executing tasks

main:
[INFO] Executed tasks
[WARNING] Failed to getClass for org.apache.maven.plugin.javadoc.JavadocReport
[INFO] 
[INFO] <<< maven-javadoc-plugin:2.10.4:javadoc (create-javadoc-jar) < generate-sources
@ commons-lang3 <<<
[INFO] 
[INFO] 
[INFO] --- maven-javadoc-plugin:2.10.4:javadoc (create-javadoc-jar) @ commons-lang3 ---
[JENKINS] Archiving  javadoc
[INFO] 
[INFO] --- maven-javadoc-plugin:2.10.4:jar (create-javadoc-jar) @ commons-lang3 ---
[INFO] Building jar: <https://builds.apache.org/job/commons-lang/ws/target/commons-lang3-3.7-SNAPSHOT-javadoc.jar>
[INFO] 
[INFO] >>> maven-source-plugin:3.0.1:jar (create-source-jar) > generate-sources
@ commons-lang3 >>>
[INFO] 
[INFO] --- maven-enforcer-plugin:1.4.1:enforce (enforce-maven-3) @ commons-lang3 ---
[INFO] 
[INFO] --- build-helper-maven-plugin:1.10:parse-version (parse-version) @ commons-lang3 ---
[INFO] 
[INFO] --- maven-antrun-plugin:1.8:run (javadoc.resources) @ commons-lang3 ---
[INFO] Executing tasks

main:
[INFO] Executed tasks
[WARNING] Failed to getClass for org.apache.maven.plugins.source.SourceJarMojo
[INFO] 
[INFO] <<< maven-source-plugin:3.0.1:jar (create-source-jar) < generate-sources
@ commons-lang3 <<<
[INFO] 
[INFO] 
[INFO] --- maven-source-plugin:3.0.1:jar (create-source-jar) @ commons-lang3 ---
[INFO] Building jar: <https://builds.apache.org/job/commons-lang/ws/target/commons-lang3-3.7-SNAPSHOT-sources.jar>
[INFO] 
[INFO] >>> maven-source-plugin:3.0.1:test-jar (create-source-jar) > generate-sources
@ commons-lang3 >>>
[INFO] 
[INFO] --- maven-enforcer-plugin:1.4.1:enforce (enforce-maven-3) @ commons-lang3 ---
[INFO] 
[INFO] --- build-helper-maven-plugin:1.10:parse-version (parse-version) @ commons-lang3 ---
[INFO] 
[INFO] --- maven-antrun-plugin:1.8:run (javadoc.resources) @ commons-lang3 ---
[INFO] Executing tasks

main:
[INFO] Executed tasks
[WARNING] Failed to getClass for org.apache.maven.plugins.source.TestSourceJarMojo
[INFO] 
[INFO] <<< maven-source-plugin:3.0.1:test-jar (create-source-jar) < generate-sources
@ commons-lang3 <<<
[INFO] 
[INFO] 
[INFO] --- maven-source-plugin:3.0.1:test-jar (create-source-jar) @ commons-lang3 ---
[INFO] Building jar: <https://builds.apache.org/job/commons-lang/ws/target/commons-lang3-3.7-SNAPSHOT-test-sources.jar>
[INFO] 
[INFO] --- maven-jar-plugin:3.0.0:test-jar (default) @ commons-lang3 ---
[INFO] Building jar: <https://builds.apache.org/job/commons-lang/ws/target/commons-lang3-3.7-SNAPSHOT-tests.jar>
[INFO] 
[INFO] --- maven-assembly-plugin:2.6:single (default) @ commons-lang3 ---
[INFO] Reading assembly descriptor: src/assembly/bin.xml
[INFO] Reading assembly descriptor: src/assembly/src.xml
[INFO] Building tar: <https://builds.apache.org/job/commons-lang/ws/target/commons-lang3-3.7-SNAPSHOT-bin.tar.gz>
[INFO] Building zip: <https://builds.apache.org/job/commons-lang/ws/target/commons-lang3-3.7-SNAPSHOT-bin.zip>
[INFO] Building tar: <https://builds.apache.org/job/commons-lang/ws/target/commons-lang3-3.7-SNAPSHOT-src.tar.gz>
[INFO] Building zip: <https://builds.apache.org/job/commons-lang/ws/target/commons-lang3-3.7-SNAPSHOT-src.zip>
[INFO] 
[INFO] --- maven-gpg-plugin:1.6:sign (sign-artifacts) @ commons-lang3 ---
[INFO] 
[INFO] --- maven-install-plugin:2.5.2:install (default-install) @ commons-lang3 ---
[INFO] Installing <https://builds.apache.org/job/commons-lang/ws/target/commons-lang3-3.7-SNAPSHOT.jar>
to /home/jenkins/jenkins-slave/maven-repositories/0/org/apache/commons/commons-lang3/3.7-SNAPSHOT/commons-lang3-3.7-SNAPSHOT.jar
[INFO] Installing <https://builds.apache.org/job/commons-lang/ws/pom.xml> to /home/jenkins/jenkins-slave/maven-repositories/0/org/apache/commons/commons-lang3/3.7-SNAPSHOT/commons-lang3-3.7-SNAPSHOT.pom
[INFO] Installing <https://builds.apache.org/job/commons-lang/ws/target/commons-lang3-3.7-SNAPSHOT-javadoc.jar>
to /home/jenkins/jenkins-slave/maven-repositories/0/org/apache/commons/commons-lang3/3.7-SNAPSHOT/commons-lang3-3.7-SNAPSHOT-javadoc.jar
[INFO] Installing <https://builds.apache.org/job/commons-lang/ws/target/commons-lang3-3.7-SNAPSHOT-sources.jar>
to /home/jenkins/jenkins-slave/maven-repositories/0/org/apache/commons/commons-lang3/3.7-SNAPSHOT/commons-lang3-3.7-SNAPSHOT-sources.jar
[INFO] Installing <https://builds.apache.org/job/commons-lang/ws/target/commons-lang3-3.7-SNAPSHOT-test-sources.jar>
to /home/jenkins/jenkins-slave/maven-repositories/0/org/apache/commons/commons-lang3/3.7-SNAPSHOT/commons-lang3-3.7-SNAPSHOT-test-sources.jar
[INFO] Installing <https://builds.apache.org/job/commons-lang/ws/target/commons-lang3-3.7-SNAPSHOT-tests.jar>
to /home/jenkins/jenkins-slave/maven-repositories/0/org/apache/commons/commons-lang3/3.7-SNAPSHOT/commons-lang3-3.7-SNAPSHOT-tests.jar
[INFO] Installing <https://builds.apache.org/job/commons-lang/ws/target/commons-lang3-3.7-SNAPSHOT-bin.tar.gz>
to /home/jenkins/jenkins-slave/maven-repositories/0/org/apache/commons/commons-lang3/3.7-SNAPSHOT/commons-lang3-3.7-SNAPSHOT-bin.tar.gz
[INFO] Installing <https://builds.apache.org/job/commons-lang/ws/target/commons-lang3-3.7-SNAPSHOT-bin.zip>
to /home/jenkins/jenkins-slave/maven-repositories/0/org/apache/commons/commons-lang3/3.7-SNAPSHOT/commons-lang3-3.7-SNAPSHOT-bin.zip
[INFO] Installing <https://builds.apache.org/job/commons-lang/ws/target/commons-lang3-3.7-SNAPSHOT-src.tar.gz>
to /home/jenkins/jenkins-slave/maven-repositories/0/org/apache/commons/commons-lang3/3.7-SNAPSHOT/commons-lang3-3.7-SNAPSHOT-src.tar.gz
[INFO] Installing <https://builds.apache.org/job/commons-lang/ws/target/commons-lang3-3.7-SNAPSHOT-src.zip>
to /home/jenkins/jenkins-slave/maven-repositories/0/org/apache/commons/commons-lang3/3.7-SNAPSHOT/commons-lang3-3.7-SNAPSHOT-src.zip
[INFO] 
[INFO] >>> maven-javadoc-plugin:2.10.4:javadoc (default-cli) > generate-sources
@ commons-lang3 >>>
[INFO] 
[INFO] --- maven-enforcer-plugin:1.4.1:enforce (enforce-maven-3) @ commons-lang3 ---
[INFO] 
[INFO] --- build-helper-maven-plugin:1.10:parse-version (parse-version) @ commons-lang3 ---
[INFO] 
[INFO] --- maven-antrun-plugin:1.8:run (javadoc.resources) @ commons-lang3 ---
[INFO] Executing tasks

main:
[INFO] Executed tasks
[WARNING] Failed to getClass for org.apache.maven.plugin.javadoc.JavadocReport
[JENKINS] Archiving  javadoc
[INFO] 
[INFO] <<< maven-javadoc-plugin:2.10.4:javadoc (default-cli) < generate-sources
@ commons-lang3 <<<
[INFO] 
[INFO] 
[INFO] --- maven-javadoc-plugin:2.10.4:javadoc (default-cli) @ commons-lang3 ---
[JENKINS] Archiving  javadoc
[INFO] ------------------------------------------------------------------------
[INFO] BUILD SUCCESS
[INFO] ------------------------------------------------------------------------
[INFO] Total time: 05:12 min
[INFO] Finished at: 2017-10-23T16:43:54Z
[INFO] Final Memory: 48M/789M
[INFO] ------------------------------------------------------------------------
Waiting for Jenkins to finish collecting data
[JENKINS] Archiving <https://builds.apache.org/job/commons-lang/ws/pom.xml> to org.apache.commons/commons-lang3/3.7-SNAPSHOT/commons-lang3-3.7-SNAPSHOT.pom
[JENKINS] Archiving <https://builds.apache.org/job/commons-lang/ws/target/commons-lang3-3.7-SNAPSHOT.jar>
to org.apache.commons/commons-lang3/3.7-SNAPSHOT/commons-lang3-3.7-SNAPSHOT.jar
[JENKINS] Archiving <https://builds.apache.org/job/commons-lang/ws/target/commons-lang3-3.7-SNAPSHOT-javadoc.jar>
to org.apache.commons/commons-lang3/3.7-SNAPSHOT/commons-lang3-3.7-SNAPSHOT-javadoc.jar
[JENKINS] Archiving <https://builds.apache.org/job/commons-lang/ws/target/commons-lang3-3.7-SNAPSHOT-sources.jar>
to org.apache.commons/commons-lang3/3.7-SNAPSHOT/commons-lang3-3.7-SNAPSHOT-sources.jar
[JENKINS] Archiving <https://builds.apache.org/job/commons-lang/ws/target/commons-lang3-3.7-SNAPSHOT-test-sources.jar>
to org.apache.commons/commons-lang3/3.7-SNAPSHOT/commons-lang3-3.7-SNAPSHOT-test-sources.jar
[JENKINS] Archiving <https://builds.apache.org/job/commons-lang/ws/target/commons-lang3-3.7-SNAPSHOT-tests.jar>
to org.apache.commons/commons-lang3/3.7-SNAPSHOT/commons-lang3-3.7-SNAPSHOT-tests.jar
[JENKINS] Archiving <https://builds.apache.org/job/commons-lang/ws/target/commons-lang3-3.7-SNAPSHOT-bin.tar.gz>
to org.apache.commons/commons-lang3/3.7-SNAPSHOT/commons-lang3-3.7-SNAPSHOT-bin.tar.gz
[JENKINS] Archiving <https://builds.apache.org/job/commons-lang/ws/target/commons-lang3-3.7-SNAPSHOT-bin.zip>
to org.apache.commons/commons-lang3/3.7-SNAPSHOT/commons-lang3-3.7-SNAPSHOT-bin.zip
[JENKINS] Archiving <https://builds.apache.org/job/commons-lang/ws/target/commons-lang3-3.7-SNAPSHOT-src.tar.gz>
to org.apache.commons/commons-lang3/3.7-SNAPSHOT/commons-lang3-3.7-SNAPSHOT-src.tar.gz
[JENKINS] Archiving <https://builds.apache.org/job/commons-lang/ws/target/commons-lang3-3.7-SNAPSHOT-src.zip>
to org.apache.commons/commons-lang3/3.7-SNAPSHOT/commons-lang3-3.7-SNAPSHOT-src.zip
channel stopped
Maven RedeployPublisher use remote H10 maven settings from : /home/jenkins/.m2/settings.xml
[INFO] Deployment in https://repository.apache.org/content/repositories/snapshots (id=apache.snapshots.https,uniqueVersion=true)
Deploying the main artifact commons-lang3-3.7-SNAPSHOT.jar
Downloading: https://repository.apache.org/content/repositories/snapshots/org/apache/commons/commons-lang3/3.7-SNAPSHOT/maven-metadata.xml
Downloaded: https://repository.apache.org/content/repositories/snapshots/org/apache/commons/commons-lang3/3.7-SNAPSHOT/maven-metadata.xml
(3 KB at 3.0 KB/sec)
Uploading: https://repository.apache.org/content/repositories/snapshots/org/apache/commons/commons-lang3/3.7-SNAPSHOT/commons-lang3-3.7-20171023.164406-45.jar
Uploaded: https://repository.apache.org/content/repositories/snapshots/org/apache/commons/commons-lang3/3.7-SNAPSHOT/commons-lang3-3.7-20171023.164406-45.jar
(487 KB at 283.4 KB/sec)
Uploading: https://repository.apache.org/content/repositories/snapshots/org/apache/commons/commons-lang3/3.7-SNAPSHOT/commons-lang3-3.7-20171023.164406-45.pom
Uploaded: https://repository.apache.org/content/repositories/snapshots/org/apache/commons/commons-lang3/3.7-SNAPSHOT/commons-lang3-3.7-20171023.164406-45.pom
(27 KB at 21.2 KB/sec)
Downloading: https://repository.apache.org/content/repositories/snapshots/org/apache/commons/commons-lang3/maven-metadata.xml
Downloaded: https://repository.apache.org/content/repositories/snapshots/org/apache/commons/commons-lang3/maven-metadata.xml
(427 B at 0.8 KB/sec)
Uploading: https://repository.apache.org/content/repositories/snapshots/org/apache/commons/commons-lang3/3.7-SNAPSHOT/maven-metadata.xml
Uploaded: https://repository.apache.org/content/repositories/snapshots/org/apache/commons/commons-lang3/3.7-SNAPSHOT/maven-metadata.xml
(3 KB at 2.1 KB/sec)
Uploading: https://repository.apache.org/content/repositories/snapshots/org/apache/commons/commons-lang3/maven-metadata.xml
Uploaded: https://repository.apache.org/content/repositories/snapshots/org/apache/commons/commons-lang3/maven-metadata.xml
(427 B at 0.4 KB/sec)
Deploying the main artifact commons-lang3-3.7-SNAPSHOT-javadoc.jar
Uploading: https://repository.apache.org/content/repositories/snapshots/org/apache/commons/commons-lang3/3.7-SNAPSHOT/commons-lang3-3.7-20171023.164406-45-javadoc.jar
Uploaded: https://repository.apache.org/content/repositories/snapshots/org/apache/commons/commons-lang3/3.7-SNAPSHOT/commons-lang3-3.7-20171023.164406-45-javadoc.jar
(1300 KB at 784.7 KB/sec)
Uploading: https://repository.apache.org/content/repositories/snapshots/org/apache/commons/commons-lang3/3.7-SNAPSHOT/maven-metadata.xml
Uploaded: https://repository.apache.org/content/repositories/snapshots/org/apache/commons/commons-lang3/3.7-SNAPSHOT/maven-metadata.xml
(3 KB at 2.0 KB/sec)
Deploying the main artifact commons-lang3-3.7-SNAPSHOT-sources.jar
Uploading: https://repository.apache.org/content/repositories/snapshots/org/apache/commons/commons-lang3/3.7-SNAPSHOT/commons-lang3-3.7-20171023.164406-45-sources.jar
Uploaded: https://repository.apache.org/content/repositories/snapshots/org/apache/commons/commons-lang3/3.7-SNAPSHOT/commons-lang3-3.7-20171023.164406-45-sources.jar
(535 KB at 320.9 KB/sec)
Uploading: https://repository.apache.org/content/repositories/snapshots/org/apache/commons/commons-lang3/3.7-SNAPSHOT/maven-metadata.xml
Uploaded: https://repository.apache.org/content/repositories/snapshots/org/apache/commons/commons-lang3/3.7-SNAPSHOT/maven-metadata.xml
(3 KB at 2.3 KB/sec)
Deploying the main artifact commons-lang3-3.7-SNAPSHOT-test-sources.jar
Uploading: https://repository.apache.org/content/repositories/snapshots/org/apache/commons/commons-lang3/3.7-SNAPSHOT/commons-lang3-3.7-20171023.164406-45-test-sources.jar
Uploaded: https://repository.apache.org/content/repositories/snapshots/org/apache/commons/commons-lang3/3.7-SNAPSHOT/commons-lang3-3.7-20171023.164406-45-test-sources.jar
(437 KB at 258.7 KB/sec)
Uploading: https://repository.apache.org/content/repositories/snapshots/org/apache/commons/commons-lang3/3.7-SNAPSHOT/maven-metadata.xml
Uploaded: https://repository.apache.org/content/repositories/snapshots/org/apache/commons/commons-lang3/3.7-SNAPSHOT/maven-metadata.xml
(3 KB at 2.2 KB/sec)
Deploying the main artifact commons-lang3-3.7-SNAPSHOT-tests.jar
Uploading: https://repository.apache.org/content/repositories/snapshots/org/apache/commons/commons-lang3/3.7-SNAPSHOT/commons-lang3-3.7-20171023.164406-45-tests.jar
Uploaded: https://repository.apache.org/content/repositories/snapshots/org/apache/commons/commons-lang3/3.7-SNAPSHOT/commons-lang3-3.7-20171023.164406-45-tests.jar
(826 KB at 507.5 KB/sec)
Uploading: https://repository.apache.org/content/repositories/snapshots/org/apache/commons/commons-lang3/3.7-SNAPSHOT/maven-metadata.xml
Uploaded: https://repository.apache.org/content/repositories/snapshots/org/apache/commons/commons-lang3/3.7-SNAPSHOT/maven-metadata.xml
(3 KB at 2.2 KB/sec)
Deploying the main artifact commons-lang3-3.7-SNAPSHOT-bin.tar.gz
Uploading: https://repository.apache.org/content/repositories/snapshots/org/apache/commons/commons-lang3/3.7-SNAPSHOT/commons-lang3-3.7-20171023.164406-45-bin.tar.gz
Uploaded: https://repository.apache.org/content/repositories/snapshots/org/apache/commons/commons-lang3/3.7-SNAPSHOT/commons-lang3-3.7-20171023.164406-45-bin.tar.gz
(4169 KB at 225.7 KB/sec)
Uploading: https://repository.apache.org/content/repositories/snapshots/org/apache/commons/commons-lang3/3.7-SNAPSHOT/maven-metadata.xml
ERROR: Failed to deploy metadata: Could not transfer metadata org.apache.commons:commons-lang3:3.7-SNAPSHOT/maven-metadata.xml
from/to apache.snapshots.https (https://repository.apache.org/content/repositories/snapshots):
Failed to transfer file: https://repository.apache.org/content/repositories/snapshots/org/apache/commons/commons-lang3/3.7-SNAPSHOT/maven-metadata.xml.
Return code is: 400, ReasonPhrase: Bad Request.
org.apache.maven.artifact.deployer.ArtifactDeploymentException: Failed to deploy metadata:
Could not transfer metadata org.apache.commons:commons-lang3:3.7-SNAPSHOT/maven-metadata.xml
from/to apache.snapshots.https (https://repository.apache.org/content/repositories/snapshots):
Failed to transfer file: https://repository.apache.org/content/repositories/snapshots/org/apache/commons/commons-lang3/3.7-SNAPSHOT/maven-metadata.xml.
Return code is: 400, ReasonPhrase: Bad Request.
	at org.apache.maven.artifact.deployer.DefaultArtifactDeployer.deploy(DefaultArtifactDeployer.java:143)
	at hudson.maven.reporters.MavenArtifactRecord.deploy(MavenArtifactRecord.java:208)
	at hudson.maven.RedeployPublisher.perform(RedeployPublisher.java:176)
	at hudson.tasks.BuildStepMonitor$1.perform(BuildStepMonitor.java:20)
	at hudson.model.AbstractBuild$AbstractBuildExecution.perform(AbstractBuild.java:736)
	at hudson.model.AbstractBuild$AbstractBuildExecution.performAllBuildSteps(AbstractBuild.java:682)
	at hudson.maven.MavenModuleSetBuild$MavenModuleSetBuildExecution.post2(MavenModuleSetBuild.java:1073)
	at hudson.model.AbstractBuild$AbstractBuildExecution.post(AbstractBuild.java:627)
	at hudson.model.Run.execute(Run.java:1762)
	at hudson.maven.MavenModuleSetBuild.run(MavenModuleSetBuild.java:543)
	at hudson.model.ResourceController.execute(ResourceController.java:97)
	at hudson.model.Executor.run(Executor.java:419)
Caused by: org.eclipse.aether.deployment.DeploymentException: Failed to deploy metadata: Could
not transfer metadata org.apache.commons:commons-lang3:3.7-SNAPSHOT/maven-metadata.xml from/to
apache.snapshots.https (https://repository.apache.org/content/repositories/snapshots): Failed
to transfer file: https://repository.apache.org/content/repositories/snapshots/org/apache/commons/commons-lang3/3.7-SNAPSHOT/maven-metadata.xml.
Return code is: 400, ReasonPhrase: Bad Request.
	at org.eclipse.aether.internal.impl.DefaultDeployer.deploy(DefaultDeployer.java:348)
	at org.eclipse.aether.internal.impl.DefaultDeployer.deploy(DefaultDeployer.java:245)
	at org.eclipse.aether.internal.impl.DefaultRepositorySystem.deploy(DefaultRepositorySystem.java:420)
	at org.apache.maven.artifact.deployer.DefaultArtifactDeployer.deploy(DefaultArtifactDeployer.java:139)
	... 11 more
Caused by: org.eclipse.aether.transfer.MetadataTransferException: Could not transfer metadata
org.apache.commons:commons-lang3:3.7-SNAPSHOT/maven-metadata.xml from/to apache.snapshots.https
(https://repository.apache.org/content/repositories/snapshots): Failed to transfer file: https://repository.apache.org/content/repositories/snapshots/org/apache/commons/commons-lang3/3.7-SNAPSHOT/maven-metadata.xml.
Return code is: 400, ReasonPhrase: Bad Request.
	at org.eclipse.aether.connector.basic.MetadataTransportListener.transferFailed(MetadataTransportListener.java:43)
	at org.eclipse.aether.connector.basic.BasicRepositoryConnector$TaskRunner.run(BasicRepositoryConnector.java:355)
	at org.eclipse.aether.connector.basic.BasicRepositoryConnector.put(BasicRepositoryConnector.java:288)
	at org.eclipse.aether.internal.impl.DefaultDeployer.deploy(DefaultDeployer.java:342)
	... 14 more
Caused by: org.apache.maven.wagon.TransferFailedException: Failed to transfer file: https://repository.apache.org/content/repositories/snapshots/org/apache/commons/commons-lang3/3.7-SNAPSHOT/maven-metadata.xml.
Return code is: 400, ReasonPhrase: Bad Request.
	at org.apache.maven.wagon.shared.http.AbstractHttpClientWagon.put(AbstractHttpClientWagon.java:635)
	at org.apache.maven.wagon.shared.http.AbstractHttpClientWagon.put(AbstractHttpClientWagon.java:557)
	at org.apache.maven.wagon.shared.http.AbstractHttpClientWagon.put(AbstractHttpClientWagon.java:539)
	at org.apache.maven.wagon.shared.http.AbstractHttpClientWagon.put(AbstractHttpClientWagon.java:533)
	at org.apache.maven.wagon.shared.http.AbstractHttpClientWagon.put(AbstractHttpClientWagon.java:513)
	at org.eclipse.aether.transport.wagon.WagonTransporter$PutTaskRunner.run(WagonTransporter.java:644)
	at org.eclipse.aether.transport.wagon.WagonTransporter.execute(WagonTransporter.java:427)
	at org.eclipse.aether.transport.wagon.WagonTransporter.put(WagonTransporter.java:410)
	at org.eclipse.aether.connector.basic.BasicRepositoryConnector$PutTaskRunner.runTask(BasicRepositoryConnector.java:510)
	at org.eclipse.aether.connector.basic.BasicRepositoryConnector$TaskRunner.run(BasicRepositoryConnector.java:350)
	... 16 more
[INFO] Deployment failed after 48 sec
Build step 'Deploy artifacts to Maven repository' changed build result to FAILURE

Mime
View raw message