commons-notifications mailing list archives

Site index · List index
Message view « Date » · « Thread »
Top « Date » · « Thread »
From Apache Jenkins Server <jenk...@builds.apache.org>
Subject Build failed in Jenkins: Commons-Compress #327
Date Mon, 11 Sep 2017 19:18:50 GMT
See <https://builds.apache.org/job/Commons-Compress/327/display/redirect?page=changes>

Changes:

[garydgregory] Typos.

------------------------------------------
[...truncated 43.01 KB...]
Results :

Tests run: 868, Failures: 0, Errors: 0, Skipped: 4

[JENKINS] Recording test results
[INFO] 
[INFO] --- maven-jar-plugin:3.0.0:jar (default-jar) @ commons-compress ---
[INFO] Building jar: <https://builds.apache.org/job/Commons-Compress/ws/target/commons-compress-1.15-SNAPSHOT.jar>
[INFO] 
[INFO] --- maven-site-plugin:3.6:attach-descriptor (attach-descriptor) @ commons-compress
---
[INFO] Skipping because packaging 'jar' is not pom.
[INFO] 
[INFO] >>> maven-javadoc-plugin:2.10.4:javadoc (create-javadoc-jar) > generate-sources
@ commons-compress >>>
[INFO] 
[INFO] --- maven-enforcer-plugin:1.4.1:enforce (enforce-maven-3) @ commons-compress ---
[INFO] 
[INFO] --- build-helper-maven-plugin:1.10:parse-version (parse-version) @ commons-compress
---
[INFO] 
[INFO] --- maven-antrun-plugin:1.8:run (javadoc.resources) @ commons-compress ---
[INFO] Executing tasks

main:
[INFO] Executed tasks
[WARNING] Failed to getClass for org.apache.maven.plugin.javadoc.JavadocReport
[INFO] 
[INFO] <<< maven-javadoc-plugin:2.10.4:javadoc (create-javadoc-jar) < generate-sources
@ commons-compress <<<
[INFO] 
[INFO] --- maven-javadoc-plugin:2.10.4:javadoc (create-javadoc-jar) @ commons-compress ---
[INFO] 
2 warnings
[WARNING] Javadoc Warnings
[WARNING] <https://builds.apache.org/job/Commons-Compress/ws/src/main/java/org/apache/commons/compress/archivers/zip/ZipLong.java>:127:
warning: no description for @return
[WARNING] * @return
[WARNING] ^
[WARNING] <https://builds.apache.org/job/Commons-Compress/ws/src/main/java/org/apache/commons/compress/archivers/zip/ZipLong.java>:86:
warning: no description for @param
[WARNING] * @param value
[WARNING] ^
[JENKINS] Archiving  javadoc
[INFO] 
[INFO] --- maven-javadoc-plugin:2.10.4:jar (create-javadoc-jar) @ commons-compress ---
[INFO] 
2 warnings
[WARNING] Javadoc Warnings
[WARNING] <https://builds.apache.org/job/Commons-Compress/ws/src/main/java/org/apache/commons/compress/archivers/zip/ZipLong.java>:127:
warning: no description for @return
[WARNING] * @return
[WARNING] ^
[WARNING] <https://builds.apache.org/job/Commons-Compress/ws/src/main/java/org/apache/commons/compress/archivers/zip/ZipLong.java>:86:
warning: no description for @param
[WARNING] * @param value
[WARNING] ^
[INFO] Building jar: <https://builds.apache.org/job/Commons-Compress/ws/target/commons-compress-1.15-SNAPSHOT-javadoc.jar>
[INFO] 
[INFO] >>> maven-source-plugin:3.0.1:jar (create-source-jar) > generate-sources
@ commons-compress >>>
[INFO] 
[INFO] --- maven-enforcer-plugin:1.4.1:enforce (enforce-maven-3) @ commons-compress ---
[INFO] 
[INFO] --- build-helper-maven-plugin:1.10:parse-version (parse-version) @ commons-compress
---
[INFO] 
[INFO] --- maven-antrun-plugin:1.8:run (javadoc.resources) @ commons-compress ---
[INFO] Executing tasks

main:
[INFO] Executed tasks
[WARNING] Failed to getClass for org.apache.maven.plugins.source.SourceJarMojo
[INFO] 
[INFO] <<< maven-source-plugin:3.0.1:jar (create-source-jar) < generate-sources
@ commons-compress <<<
[INFO] 
[INFO] --- maven-source-plugin:3.0.1:jar (create-source-jar) @ commons-compress ---
[INFO] Building jar: <https://builds.apache.org/job/Commons-Compress/ws/target/commons-compress-1.15-SNAPSHOT-sources.jar>
[INFO] 
[INFO] >>> maven-source-plugin:3.0.1:test-jar (create-source-jar) > generate-sources
@ commons-compress >>>
[INFO] 
[INFO] --- maven-enforcer-plugin:1.4.1:enforce (enforce-maven-3) @ commons-compress ---
[INFO] 
[INFO] --- build-helper-maven-plugin:1.10:parse-version (parse-version) @ commons-compress
---
[INFO] 
[INFO] --- maven-antrun-plugin:1.8:run (javadoc.resources) @ commons-compress ---
[INFO] Executing tasks

main:
[INFO] Executed tasks
[WARNING] Failed to getClass for org.apache.maven.plugins.source.TestSourceJarMojo
[INFO] 
[INFO] <<< maven-source-plugin:3.0.1:test-jar (create-source-jar) < generate-sources
@ commons-compress <<<
[INFO] 
[INFO] --- maven-source-plugin:3.0.1:test-jar (create-source-jar) @ commons-compress ---
[INFO] Building jar: <https://builds.apache.org/job/Commons-Compress/ws/target/commons-compress-1.15-SNAPSHOT-test-sources.jar>
[INFO] 
[INFO] --- maven-jar-plugin:3.0.0:test-jar (default) @ commons-compress ---
[INFO] Building jar: <https://builds.apache.org/job/Commons-Compress/ws/target/commons-compress-1.15-SNAPSHOT-tests.jar>
[INFO] 
[INFO] --- maven-assembly-plugin:2.6:single (default) @ commons-compress ---
[INFO] Reading assembly descriptor: src/assembly/bin.xml
[INFO] Reading assembly descriptor: src/assembly/src.xml
[INFO] Building tar: <https://builds.apache.org/job/Commons-Compress/ws/target/commons-compress-1.15-SNAPSHOT-bin.tar.gz>
[INFO] Building zip: <https://builds.apache.org/job/Commons-Compress/ws/target/commons-compress-1.15-SNAPSHOT-bin.zip>
[INFO] Building tar: <https://builds.apache.org/job/Commons-Compress/ws/target/commons-compress-1.15-SNAPSHOT-src.tar.gz>
[INFO] Building zip: <https://builds.apache.org/job/Commons-Compress/ws/target/commons-compress-1.15-SNAPSHOT-src.zip>
[INFO] 
[INFO] --- maven-gpg-plugin:1.6:sign (sign-artifacts) @ commons-compress ---
[INFO] 
[INFO] --- jacoco-maven-plugin:0.7.7.201606060606:check (check) @ commons-compress ---
[INFO] Loading execution data file <https://builds.apache.org/job/Commons-Compress/ws/target/jacoco.exec>
[INFO] Analyzed bundle 'commons-compress' with 266 classes
[WARNING] Rule violated for bundle commons-compress: classes covered ratio is 0.96, but expected
minimum is 1.00
[WARNING] Rule violated for bundle commons-compress: instructions covered ratio is 0.82, but
expected minimum is 0.90
[WARNING] Rule violated for bundle commons-compress: methods covered ratio is 0.83, but expected
minimum is 0.95
[WARNING] Rule violated for bundle commons-compress: branches covered ratio is 0.73, but expected
minimum is 0.85
[WARNING] Rule violated for bundle commons-compress: lines covered ratio is 0.85, but expected
minimum is 0.90
[WARNING] Rule violated for bundle commons-compress: complexity covered ratio is 0.69, but
expected minimum is 0.85
[WARNING] Coverage checks have not been met. See log for details.
[INFO] 
[INFO] --- japicmp-maven-plugin:0.9.3:cmp (default) @ commons-compress ---
[INFO] artifact org.apache.commons:commons-compress: checking for updates from Nexus
[INFO] artifact org.apache.commons:commons-compress: checking for updates from central
[INFO] Written file '<https://builds.apache.org/job/Commons-Compress/ws/target/japicmp/japicmp.diff'.>
[INFO] Written file '<https://builds.apache.org/job/Commons-Compress/ws/target/japicmp/japicmp.xml'.>
[INFO] Written file '<https://builds.apache.org/job/Commons-Compress/ws/target/japicmp/japicmp.html'.>
[INFO] 
[INFO] --- maven-install-plugin:2.5.2:install (default-install) @ commons-compress ---
[INFO] Installing <https://builds.apache.org/job/Commons-Compress/ws/target/commons-compress-1.15-SNAPSHOT.jar>
to /home/jenkins/jenkins-slave/maven-repositories/0/org/apache/commons/commons-compress/1.15-SNAPSHOT/commons-compress-1.15-SNAPSHOT.jar
[INFO] Installing <https://builds.apache.org/job/Commons-Compress/ws/pom.xml> to /home/jenkins/jenkins-slave/maven-repositories/0/org/apache/commons/commons-compress/1.15-SNAPSHOT/commons-compress-1.15-SNAPSHOT.pom
[INFO] Installing <https://builds.apache.org/job/Commons-Compress/ws/target/commons-compress-1.15-SNAPSHOT-javadoc.jar>
to /home/jenkins/jenkins-slave/maven-repositories/0/org/apache/commons/commons-compress/1.15-SNAPSHOT/commons-compress-1.15-SNAPSHOT-javadoc.jar
[INFO] Installing <https://builds.apache.org/job/Commons-Compress/ws/target/commons-compress-1.15-SNAPSHOT-sources.jar>
to /home/jenkins/jenkins-slave/maven-repositories/0/org/apache/commons/commons-compress/1.15-SNAPSHOT/commons-compress-1.15-SNAPSHOT-sources.jar
[INFO] Installing <https://builds.apache.org/job/Commons-Compress/ws/target/commons-compress-1.15-SNAPSHOT-test-sources.jar>
to /home/jenkins/jenkins-slave/maven-repositories/0/org/apache/commons/commons-compress/1.15-SNAPSHOT/commons-compress-1.15-SNAPSHOT-test-sources.jar
[INFO] Installing <https://builds.apache.org/job/Commons-Compress/ws/target/commons-compress-1.15-SNAPSHOT-tests.jar>
to /home/jenkins/jenkins-slave/maven-repositories/0/org/apache/commons/commons-compress/1.15-SNAPSHOT/commons-compress-1.15-SNAPSHOT-tests.jar
[INFO] Installing <https://builds.apache.org/job/Commons-Compress/ws/target/commons-compress-1.15-SNAPSHOT-bin.tar.gz>
to /home/jenkins/jenkins-slave/maven-repositories/0/org/apache/commons/commons-compress/1.15-SNAPSHOT/commons-compress-1.15-SNAPSHOT-bin.tar.gz
[INFO] Installing <https://builds.apache.org/job/Commons-Compress/ws/target/commons-compress-1.15-SNAPSHOT-bin.zip>
to /home/jenkins/jenkins-slave/maven-repositories/0/org/apache/commons/commons-compress/1.15-SNAPSHOT/commons-compress-1.15-SNAPSHOT-bin.zip
[INFO] Installing <https://builds.apache.org/job/Commons-Compress/ws/target/commons-compress-1.15-SNAPSHOT-src.tar.gz>
to /home/jenkins/jenkins-slave/maven-repositories/0/org/apache/commons/commons-compress/1.15-SNAPSHOT/commons-compress-1.15-SNAPSHOT-src.tar.gz
[INFO] Installing <https://builds.apache.org/job/Commons-Compress/ws/target/commons-compress-1.15-SNAPSHOT-src.zip>
to /home/jenkins/jenkins-slave/maven-repositories/0/org/apache/commons/commons-compress/1.15-SNAPSHOT/commons-compress-1.15-SNAPSHOT-src.zip
[INFO] 
[INFO] --- maven-deploy-plugin:2.8.2:deploy (default-deploy) @ commons-compress ---
[INFO] Downloading: https://repository.apache.org/content/repositories/snapshots/org/apache/commons/commons-compress/1.15-SNAPSHOT/maven-metadata.xml
[INFO] Downloaded: https://repository.apache.org/content/repositories/snapshots/org/apache/commons/commons-compress/1.15-SNAPSHOT/maven-metadata.xml
(3 KB at 3.4 KB/sec)
[INFO] Uploading: https://repository.apache.org/content/repositories/snapshots/org/apache/commons/commons-compress/1.15-SNAPSHOT/commons-compress-1.15-20170911.191732-88.jar
[INFO] Uploaded: https://repository.apache.org/content/repositories/snapshots/org/apache/commons/commons-compress/1.15-SNAPSHOT/commons-compress-1.15-20170911.191732-88.jar
(520 KB at 387.8 KB/sec)
[INFO] Uploading: https://repository.apache.org/content/repositories/snapshots/org/apache/commons/commons-compress/1.15-SNAPSHOT/commons-compress-1.15-20170911.191732-88.pom
[INFO] Uploaded: https://repository.apache.org/content/repositories/snapshots/org/apache/commons/commons-compress/1.15-SNAPSHOT/commons-compress-1.15-20170911.191732-88.pom
(15 KB at 15.4 KB/sec)
[INFO] Downloading: https://repository.apache.org/content/repositories/snapshots/org/apache/commons/commons-compress/maven-metadata.xml
[INFO] Downloaded: https://repository.apache.org/content/repositories/snapshots/org/apache/commons/commons-compress/maven-metadata.xml
(352 B at 0.6 KB/sec)
[INFO] Uploading: https://repository.apache.org/content/repositories/snapshots/org/apache/commons/commons-compress/1.15-SNAPSHOT/maven-metadata.xml
[INFO] Uploaded: https://repository.apache.org/content/repositories/snapshots/org/apache/commons/commons-compress/1.15-SNAPSHOT/maven-metadata.xml
(3 KB at 2.9 KB/sec)
[INFO] Uploading: https://repository.apache.org/content/repositories/snapshots/org/apache/commons/commons-compress/maven-metadata.xml
[INFO] Uploaded: https://repository.apache.org/content/repositories/snapshots/org/apache/commons/commons-compress/maven-metadata.xml
(352 B at 0.4 KB/sec)
[INFO] Uploading: https://repository.apache.org/content/repositories/snapshots/org/apache/commons/commons-compress/1.15-SNAPSHOT/commons-compress-1.15-20170911.191732-88-javadoc.jar
[INFO] Uploaded: https://repository.apache.org/content/repositories/snapshots/org/apache/commons/commons-compress/1.15-SNAPSHOT/commons-compress-1.15-20170911.191732-88-javadoc.jar
(2211 KB at 1421.7 KB/sec)
[INFO] Uploading: https://repository.apache.org/content/repositories/snapshots/org/apache/commons/commons-compress/1.15-SNAPSHOT/maven-metadata.xml
[INFO] Uploaded: https://repository.apache.org/content/repositories/snapshots/org/apache/commons/commons-compress/1.15-SNAPSHOT/maven-metadata.xml
(3 KB at 2.9 KB/sec)
[INFO] Uploading: https://repository.apache.org/content/repositories/snapshots/org/apache/commons/commons-compress/1.15-SNAPSHOT/commons-compress-1.15-20170911.191732-88-sources.jar
[INFO] Uploaded: https://repository.apache.org/content/repositories/snapshots/org/apache/commons/commons-compress/1.15-SNAPSHOT/commons-compress-1.15-20170911.191732-88-sources.jar
(501 KB at 385.6 KB/sec)
[INFO] Uploading: https://repository.apache.org/content/repositories/snapshots/org/apache/commons/commons-compress/1.15-SNAPSHOT/maven-metadata.xml
[INFO] Uploaded: https://repository.apache.org/content/repositories/snapshots/org/apache/commons/commons-compress/1.15-SNAPSHOT/maven-metadata.xml
(3 KB at 2.9 KB/sec)
[INFO] Uploading: https://repository.apache.org/content/repositories/snapshots/org/apache/commons/commons-compress/1.15-SNAPSHOT/commons-compress-1.15-20170911.191732-88-test-sources.jar
[INFO] Uploaded: https://repository.apache.org/content/repositories/snapshots/org/apache/commons/commons-compress/1.15-SNAPSHOT/commons-compress-1.15-20170911.191732-88-test-sources.jar
(9269 KB at 4273.0 KB/sec)
[INFO] Uploading: https://repository.apache.org/content/repositories/snapshots/org/apache/commons/commons-compress/1.15-SNAPSHOT/maven-metadata.xml
[INFO] Uploaded: https://repository.apache.org/content/repositories/snapshots/org/apache/commons/commons-compress/1.15-SNAPSHOT/maven-metadata.xml
(3 KB at 2.8 KB/sec)
[INFO] Uploading: https://repository.apache.org/content/repositories/snapshots/org/apache/commons/commons-compress/1.15-SNAPSHOT/commons-compress-1.15-20170911.191732-88-tests.jar
[INFO] Uploaded: https://repository.apache.org/content/repositories/snapshots/org/apache/commons/commons-compress/1.15-SNAPSHOT/commons-compress-1.15-20170911.191732-88-tests.jar
(9450 KB at 4567.2 KB/sec)
[INFO] Uploading: https://repository.apache.org/content/repositories/snapshots/org/apache/commons/commons-compress/1.15-SNAPSHOT/maven-metadata.xml
[INFO] Uploaded: https://repository.apache.org/content/repositories/snapshots/org/apache/commons/commons-compress/1.15-SNAPSHOT/maven-metadata.xml
(3 KB at 2.9 KB/sec)
[INFO] Uploading: https://repository.apache.org/content/repositories/snapshots/org/apache/commons/commons-compress/1.15-SNAPSHOT/commons-compress-1.15-20170911.191732-88-bin.tar.gz
[INFO] Uploaded: https://repository.apache.org/content/repositories/snapshots/org/apache/commons/commons-compress/1.15-SNAPSHOT/commons-compress-1.15-20170911.191732-88-bin.tar.gz
(22877 KB at 7393.7 KB/sec)
[INFO] Uploading: https://repository.apache.org/content/repositories/snapshots/org/apache/commons/commons-compress/1.15-SNAPSHOT/maven-metadata.xml
[INFO] Uploaded: https://repository.apache.org/content/repositories/snapshots/org/apache/commons/commons-compress/1.15-SNAPSHOT/maven-metadata.xml
(3 KB at 2.9 KB/sec)
[INFO] Uploading: https://repository.apache.org/content/repositories/snapshots/org/apache/commons/commons-compress/1.15-SNAPSHOT/commons-compress-1.15-20170911.191732-88-bin.zip
[INFO] Uploaded: https://repository.apache.org/content/repositories/snapshots/org/apache/commons/commons-compress/1.15-SNAPSHOT/commons-compress-1.15-20170911.191732-88-bin.zip
(23832 KB at 8056.6 KB/sec)
[INFO] Uploading: https://repository.apache.org/content/repositories/snapshots/org/apache/commons/commons-compress/1.15-SNAPSHOT/maven-metadata.xml
[INFO] Uploaded: https://repository.apache.org/content/repositories/snapshots/org/apache/commons/commons-compress/1.15-SNAPSHOT/maven-metadata.xml
(3 KB at 2.9 KB/sec)
[INFO] Uploading: https://repository.apache.org/content/repositories/snapshots/org/apache/commons/commons-compress/1.15-SNAPSHOT/commons-compress-1.15-20170911.191732-88-src.tar.gz
[INFO] Uploaded: https://repository.apache.org/content/repositories/snapshots/org/apache/commons/commons-compress/1.15-SNAPSHOT/commons-compress-1.15-20170911.191732-88-src.tar.gz
(9556 KB at 4596.1 KB/sec)
[INFO] Uploading: https://repository.apache.org/content/repositories/snapshots/org/apache/commons/commons-compress/1.15-SNAPSHOT/maven-metadata.xml
[INFO] Uploaded: https://repository.apache.org/content/repositories/snapshots/org/apache/commons/commons-compress/1.15-SNAPSHOT/maven-metadata.xml
(3 KB at 2.9 KB/sec)
[INFO] Uploading: https://repository.apache.org/content/repositories/snapshots/org/apache/commons/commons-compress/1.15-SNAPSHOT/commons-compress-1.15-20170911.191732-88-src.zip
[INFO] Uploaded: https://repository.apache.org/content/repositories/snapshots/org/apache/commons/commons-compress/1.15-SNAPSHOT/commons-compress-1.15-20170911.191732-88-src.zip
(9925 KB at 4748.7 KB/sec)
[INFO] Uploading: https://repository.apache.org/content/repositories/snapshots/org/apache/commons/commons-compress/1.15-SNAPSHOT/maven-metadata.xml
[INFO] Uploaded: https://repository.apache.org/content/repositories/snapshots/org/apache/commons/commons-compress/1.15-SNAPSHOT/maven-metadata.xml
(3 KB at 2.9 KB/sec)
[INFO] ------------------------------------------------------------------------
[INFO] BUILD SUCCESS
[INFO] ------------------------------------------------------------------------
[INFO] Total time: 03:13 min
[INFO] Finished at: 2017-09-11T19:18:11+00:00
[INFO] Final Memory: 45M/1092M
[INFO] ------------------------------------------------------------------------
[JENKINS] Archiving <https://builds.apache.org/job/Commons-Compress/ws/pom.xml> to org.apache.commons/commons-compress/1.15-SNAPSHOT/commons-compress-1.15-SNAPSHOT.pom
[JENKINS] Archiving <https://builds.apache.org/job/Commons-Compress/ws/target/commons-compress-1.15-SNAPSHOT.jar>
to org.apache.commons/commons-compress/1.15-20170911.191732-88/commons-compress-1.15-20170911.191732-88.jar
[JENKINS] Archiving <https://builds.apache.org/job/Commons-Compress/ws/target/commons-compress-1.15-SNAPSHOT-javadoc.jar>
to org.apache.commons/commons-compress/1.15-20170911.191732-88/commons-compress-1.15-20170911.191732-88-javadoc.jar
[JENKINS] Archiving <https://builds.apache.org/job/Commons-Compress/ws/target/commons-compress-1.15-SNAPSHOT-sources.jar>
to org.apache.commons/commons-compress/1.15-20170911.191732-88/commons-compress-1.15-20170911.191732-88-sources.jar
[JENKINS] Archiving <https://builds.apache.org/job/Commons-Compress/ws/target/commons-compress-1.15-SNAPSHOT-test-sources.jar>
to org.apache.commons/commons-compress/1.15-20170911.191732-88/commons-compress-1.15-20170911.191732-88-test-sources.jar
[JENKINS] Archiving <https://builds.apache.org/job/Commons-Compress/ws/target/commons-compress-1.15-SNAPSHOT-tests.jar>
to org.apache.commons/commons-compress/1.15-20170911.191732-88/commons-compress-1.15-20170911.191732-88-tests.jar
[JENKINS] Archiving <https://builds.apache.org/job/Commons-Compress/ws/target/commons-compress-1.15-SNAPSHOT-bin.tar.gz>
to org.apache.commons/commons-compress/1.15-20170911.191732-88/commons-compress-1.15-20170911.191732-88-bin.tar.gz
[JENKINS] Archiving <https://builds.apache.org/job/Commons-Compress/ws/target/commons-compress-1.15-SNAPSHOT-bin.zip>
to org.apache.commons/commons-compress/1.15-20170911.191732-88/commons-compress-1.15-20170911.191732-88-bin.zip
[JENKINS] Archiving <https://builds.apache.org/job/Commons-Compress/ws/target/commons-compress-1.15-SNAPSHOT-src.tar.gz>
to org.apache.commons/commons-compress/1.15-20170911.191732-88/commons-compress-1.15-20170911.191732-88-src.tar.gz
[JENKINS] Archiving <https://builds.apache.org/job/Commons-Compress/ws/target/commons-compress-1.15-SNAPSHOT-src.zip>
to org.apache.commons/commons-compress/1.15-20170911.191732-88/commons-compress-1.15-20170911.191732-88-src.zip
[Fast Archiver] Compressed 86.09 MB of artifacts by 28.1% relative to #326
channel stopped
Maven RedeployPublisher use remote H18 maven settings from : /home/jenkins/.m2/settings.xml
[INFO] Deployment in https://repository.apache.org/content/repositories/snapshots (id=apache.snapshots.https,uniqueVersion=true)
Deploying the main artifact commons-compress-1.15-20170911.191732-88.jar
Downloading: https://repository.apache.org/content/repositories/snapshots/org/apache/commons/commons-compress/1.15-SNAPSHOT/maven-metadata.xml
Downloaded: https://repository.apache.org/content/repositories/snapshots/org/apache/commons/commons-compress/1.15-SNAPSHOT/maven-metadata.xml
(3 KB at 3.7 KB/sec)
Uploading: https://repository.apache.org/content/repositories/snapshots/org/apache/commons/commons-compress/1.15-SNAPSHOT/commons-compress-1.15-20170911.191732-88.jar
Uploaded: https://repository.apache.org/content/repositories/snapshots/org/apache/commons/commons-compress/1.15-SNAPSHOT/commons-compress-1.15-20170911.191732-88.jar
(520 KB at 318.0 KB/sec)
Uploading: https://repository.apache.org/content/repositories/snapshots/org/apache/commons/commons-compress/1.15-SNAPSHOT/commons-compress-1.15-20170911.191732-88.pom
Uploaded: https://repository.apache.org/content/repositories/snapshots/org/apache/commons/commons-compress/1.15-SNAPSHOT/commons-compress-1.15-20170911.191732-88.pom
(15 KB at 12.1 KB/sec)
Downloading: https://repository.apache.org/content/repositories/snapshots/org/apache/commons/commons-compress/maven-metadata.xml
Downloaded: https://repository.apache.org/content/repositories/snapshots/org/apache/commons/commons-compress/maven-metadata.xml
(352 B at 0.7 KB/sec)
Uploading: https://repository.apache.org/content/repositories/snapshots/org/apache/commons/commons-compress/1.15-SNAPSHOT/maven-metadata.xml
Uploading: https://repository.apache.org/content/repositories/snapshots/org/apache/commons/commons-compress/maven-metadata.xml
Uploaded: https://repository.apache.org/content/repositories/snapshots/org/apache/commons/commons-compress/maven-metadata.xml
(352 B at 0.3 KB/sec)
ERROR: Failed to deploy metadata: Could not transfer metadata org.apache.commons:commons-compress:1.15-SNAPSHOT/maven-metadata.xml
from/to apache.snapshots.https (https://repository.apache.org/content/repositories/snapshots):
Failed to transfer file: https://repository.apache.org/content/repositories/snapshots/org/apache/commons/commons-compress/1.15-SNAPSHOT/maven-metadata.xml.
Return code is: 400, ReasonPhrase: Bad Request.
org.apache.maven.artifact.deployer.ArtifactDeploymentException: Failed to deploy metadata:
Could not transfer metadata org.apache.commons:commons-compress:1.15-SNAPSHOT/maven-metadata.xml
from/to apache.snapshots.https (https://repository.apache.org/content/repositories/snapshots):
Failed to transfer file: https://repository.apache.org/content/repositories/snapshots/org/apache/commons/commons-compress/1.15-SNAPSHOT/maven-metadata.xml.
Return code is: 400, ReasonPhrase: Bad Request.
	at org.apache.maven.artifact.deployer.DefaultArtifactDeployer.deploy(DefaultArtifactDeployer.java:143)
	at hudson.maven.reporters.MavenArtifactRecord.deploy(MavenArtifactRecord.java:193)
	at hudson.maven.RedeployPublisher.perform(RedeployPublisher.java:176)
	at hudson.tasks.BuildStepMonitor$1.perform(BuildStepMonitor.java:20)
	at hudson.model.AbstractBuild$AbstractBuildExecution.perform(AbstractBuild.java:735)
	at hudson.model.AbstractBuild$AbstractBuildExecution.performAllBuildSteps(AbstractBuild.java:676)
	at hudson.maven.MavenModuleSetBuild$MavenModuleSetBuildExecution.post2(MavenModuleSetBuild.java:1072)
	at hudson.model.AbstractBuild$AbstractBuildExecution.post(AbstractBuild.java:621)
	at hudson.model.Run.execute(Run.java:1760)
	at hudson.maven.MavenModuleSetBuild.run(MavenModuleSetBuild.java:542)
	at hudson.model.ResourceController.execute(ResourceController.java:97)
	at hudson.model.Executor.run(Executor.java:405)
Caused by: org.eclipse.aether.deployment.DeploymentException: Failed to deploy metadata: Could
not transfer metadata org.apache.commons:commons-compress:1.15-SNAPSHOT/maven-metadata.xml
from/to apache.snapshots.https (https://repository.apache.org/content/repositories/snapshots):
Failed to transfer file: https://repository.apache.org/content/repositories/snapshots/org/apache/commons/commons-compress/1.15-SNAPSHOT/maven-metadata.xml.
Return code is: 400, ReasonPhrase: Bad Request.
	at org.eclipse.aether.internal.impl.DefaultDeployer.deploy(DefaultDeployer.java:348)
	at org.eclipse.aether.internal.impl.DefaultDeployer.deploy(DefaultDeployer.java:245)
	at org.eclipse.aether.internal.impl.DefaultRepositorySystem.deploy(DefaultRepositorySystem.java:420)
	at org.apache.maven.artifact.deployer.DefaultArtifactDeployer.deploy(DefaultArtifactDeployer.java:139)
	... 11 more
Caused by: org.eclipse.aether.transfer.MetadataTransferException: Could not transfer metadata
org.apache.commons:commons-compress:1.15-SNAPSHOT/maven-metadata.xml from/to apache.snapshots.https
(https://repository.apache.org/content/repositories/snapshots): Failed to transfer file: https://repository.apache.org/content/repositories/snapshots/org/apache/commons/commons-compress/1.15-SNAPSHOT/maven-metadata.xml.
Return code is: 400, ReasonPhrase: Bad Request.
	at org.eclipse.aether.connector.basic.MetadataTransportListener.transferFailed(MetadataTransportListener.java:43)
	at org.eclipse.aether.connector.basic.BasicRepositoryConnector$TaskRunner.run(BasicRepositoryConnector.java:355)
	at org.eclipse.aether.connector.basic.BasicRepositoryConnector.put(BasicRepositoryConnector.java:288)
	at org.eclipse.aether.internal.impl.DefaultDeployer.deploy(DefaultDeployer.java:342)
	... 14 more
Caused by: org.apache.maven.wagon.TransferFailedException: Failed to transfer file: https://repository.apache.org/content/repositories/snapshots/org/apache/commons/commons-compress/1.15-SNAPSHOT/maven-metadata.xml.
Return code is: 400, ReasonPhrase: Bad Request.
	at org.apache.maven.wagon.providers.http.AbstractHttpClientWagon.put(AbstractHttpClientWagon.java:631)
	at org.apache.maven.wagon.providers.http.AbstractHttpClientWagon.put(AbstractHttpClientWagon.java:553)
	at org.apache.maven.wagon.providers.http.AbstractHttpClientWagon.put(AbstractHttpClientWagon.java:535)
	at org.apache.maven.wagon.providers.http.AbstractHttpClientWagon.put(AbstractHttpClientWagon.java:529)
	at org.apache.maven.wagon.providers.http.AbstractHttpClientWagon.put(AbstractHttpClientWagon.java:509)
	at org.eclipse.aether.transport.wagon.WagonTransporter$PutTaskRunner.run(WagonTransporter.java:644)
	at org.eclipse.aether.transport.wagon.WagonTransporter.execute(WagonTransporter.java:427)
	at org.eclipse.aether.transport.wagon.WagonTransporter.put(WagonTransporter.java:410)
	at org.eclipse.aether.connector.basic.BasicRepositoryConnector$PutTaskRunner.runTask(BasicRepositoryConnector.java:510)
	at org.eclipse.aether.connector.basic.BasicRepositoryConnector$TaskRunner.run(BasicRepositoryConnector.java:350)
	... 16 more
[INFO] Deployment failed after 16 sec
Build step 'Deploy artifacts to Maven repository' changed build result to FAILURE
Setting JDK_1_7_LATEST__HOME=/home/jenkins/tools/java/latest1.7

Mime
View raw message