commons-notifications mailing list archives

Site index · List index
Message view « Date » · « Thread »
Top « Date » · « Thread »
From Apache Jenkins Server <jenk...@builds.apache.org>
Subject Build failed in Jenkins: commons-lang #232
Date Mon, 25 Sep 2017 23:48:42 GMT
See <https://builds.apache.org/job/commons-lang/232/display/redirect>

------------------------------------------
Started by user gmcdonald
[EnvInject] - Loading node environment variables.
Building remotely on windows-2012-3 (Windows) in workspace <https://builds.apache.org/job/commons-lang/ws/>
 > git rev-parse --is-inside-work-tree # timeout=10
Fetching changes from the remote Git repository
 > git config remote.origin.url https://git-wip-us.apache.org/repos/asf/commons-lang.git
# timeout=10
Fetching upstream changes from https://git-wip-us.apache.org/repos/asf/commons-lang.git
 > git --version # timeout=10
 > git fetch --tags --progress https://git-wip-us.apache.org/repos/asf/commons-lang.git
+refs/heads/*:refs/remotes/origin/*
 > git rev-parse "refs/remotes/origin/master^{commit}" # timeout=10
 > git rev-parse "refs/remotes/origin/origin/master^{commit}" # timeout=10
Checking out Revision 1406f2a4f2cda80a05b8dc2506ec9d0a25bdf2db (refs/remotes/origin/master)
Commit message: "Correct link to JavaDoc badge image"
 > git config core.sparsecheckout # timeout=10
 > git checkout -f 1406f2a4f2cda80a05b8dc2506ec9d0a25bdf2db
 > git rev-list 1406f2a4f2cda80a05b8dc2506ec9d0a25bdf2db # timeout=10
Parsing POMs
Established TCP socket on 51145
maven35-agent.jar already up to date
maven35-interceptor.jar already up to date
maven3-interceptor-commons.jar already up to date
[commons-lang] $ f:\\jenkins\\tools\\java\\latest1.7/bin/java -Xmx2g -Xms256m -cp f:\jenkins\jenkins-slave\maven35-agent.jar;f:\jenkins\tools\maven\latest\boot\plexus-classworlds-2.5.2.jar;f:\\jenkins\\tools\\maven\\latest/conf/logging
jenkins.maven3.agent.Maven35Main f:\\jenkins\\tools\\maven\\latest F:\jenkins\jenkins-slave\slave.jar
f:\jenkins\jenkins-slave\maven35-interceptor.jar f:\jenkins\jenkins-slave\maven3-interceptor-commons.jar
51145
<===[JENKINS REMOTING CAPACITY]===>   channel started
ERROR: ================================================================================
ERROR: Invalid project setup: jenkins/security/MasterToSlaveCallable : Unsupported major.minor
version 52.0
ERROR: [JENKINS-18403][JENKINS-28294] JDK 'JDK 1.7 (latest)' not supported to run Maven projects.
ERROR: Maven projects have to be launched with a Java version greater or equal to the minimum
version required by the master.
ERROR: Use the Maven JDK Toolchains (plugin) to build your maven project with an older JDK.
ERROR: Retrying with slave Java and setting compile/test properties to point to f:\\jenkins\\tools\\java\\latest1.7.
ERROR: ================================================================================
Established TCP socket on 51244
maven35-agent.jar already up to date
maven35-interceptor.jar already up to date
maven3-interceptor-commons.jar already up to date
[commons-lang] $ "C:\Program Files\Java\jre1.8.0_121/bin/java" -Xmx2g -Xms256m -cp f:\jenkins\jenkins-slave\maven35-agent.jar;f:\jenkins\tools\maven\latest\boot\plexus-classworlds-2.5.2.jar;f:\\jenkins\\tools\\maven\\latest/conf/logging
jenkins.maven3.agent.Maven35Main f:\\jenkins\\tools\\maven\\latest F:\jenkins\jenkins-slave\slave.jar
f:\jenkins\jenkins-slave\maven35-interceptor.jar f:\jenkins\jenkins-slave\maven3-interceptor-commons.jar
51244
<===[JENKINS REMOTING CAPACITY]===>   channel started
Executing Maven:  -B -f <https://builds.apache.org/job/commons-lang/ws/pom.xml> -Dmaven.repo.local=f:\jenkins\jenkins-slave\maven-repositories\0
clean install javadoc:javadoc --batch-mode -Dgpg.skip -Prelease
[INFO] Scanning for projects...
[INFO] Downloading: https://repo.maven.apache.org/maven2/org/apache/maven/plugins/maven-release-plugin/2.5.3/maven-release-plugin-2.5.3.pom
[INFO] Downloaded: https://repo.maven.apache.org/maven2/org/apache/maven/plugins/maven-release-plugin/2.5.3/maven-release-plugin-2.5.3.pom
(11 kB at 17 kB/s)
[INFO] Downloading: https://repo.maven.apache.org/maven2/org/apache/maven/plugins/maven-release-plugin/2.5.3/maven-release-plugin-2.5.3.jar
[INFO] Downloaded: https://repo.maven.apache.org/maven2/org/apache/maven/plugins/maven-release-plugin/2.5.3/maven-release-plugin-2.5.3.jar
(53 kB at 1.1 MB/s)
[INFO] Downloading: https://repo.maven.apache.org/maven2/org/apache/maven/plugins/maven-javadoc-plugin/2.10.4/maven-javadoc-plugin-2.10.4.pom
[INFO] Downloaded: https://repo.maven.apache.org/maven2/org/apache/maven/plugins/maven-javadoc-plugin/2.10.4/maven-javadoc-plugin-2.10.4.pom
(16 kB at 912 kB/s)
[INFO] Downloading: https://repo.maven.apache.org/maven2/org/apache/maven/plugins/maven-javadoc-plugin/2.10.4/maven-javadoc-plugin-2.10.4.jar
[INFO] Downloaded: https://repo.maven.apache.org/maven2/org/apache/maven/plugins/maven-javadoc-plugin/2.10.4/maven-javadoc-plugin-2.10.4.jar
(415 kB at 6.6 MB/s)
[INFO] 
[INFO] ------------------------------------------------------------------------
[INFO] Building Apache Commons Lang 3.7-SNAPSHOT
[INFO] ------------------------------------------------------------------------
[INFO] Downloading: https://repo.maven.apache.org/maven2/org/apache/maven/plugins/maven-gpg-plugin/1.6/maven-gpg-plugin-1.6.pom
[INFO] Downloaded: https://repo.maven.apache.org/maven2/org/apache/maven/plugins/maven-gpg-plugin/1.6/maven-gpg-plugin-1.6.pom
(5.3 kB at 405 kB/s)
[INFO] Downloading: https://repo.maven.apache.org/maven2/org/apache/maven/plugins/maven-gpg-plugin/1.6/maven-gpg-plugin-1.6.jar
[INFO] Downloaded: https://repo.maven.apache.org/maven2/org/apache/maven/plugins/maven-gpg-plugin/1.6/maven-gpg-plugin-1.6.jar
(47 kB at 2.8 MB/s)
[INFO] Downloading: https://repo.maven.apache.org/maven2/org/apache/bcel/bcel/6.0/bcel-6.0.pom
[INFO] Downloaded: https://repo.maven.apache.org/maven2/org/apache/bcel/bcel/6.0/bcel-6.0.pom
(19 kB at 1.3 MB/s)
[INFO] Downloading: https://repo.maven.apache.org/maven2/org/openjdk/jmh/jmh-core/1.17.4/jmh-core-1.17.4.pom
[INFO] Downloaded: https://repo.maven.apache.org/maven2/org/openjdk/jmh/jmh-core/1.17.4/jmh-core-1.17.4.pom
(10 kB at 720 kB/s)
[INFO] Downloading: https://repo.maven.apache.org/maven2/org/openjdk/jmh/jmh-parent/1.17.4/jmh-parent-1.17.4.pom
[INFO] Downloaded: https://repo.maven.apache.org/maven2/org/openjdk/jmh/jmh-parent/1.17.4/jmh-parent-1.17.4.pom
(5.9 kB at 455 kB/s)
[INFO] Downloading: https://repo.maven.apache.org/maven2/net/sf/jopt-simple/jopt-simple/4.6/jopt-simple-4.6.pom
[INFO] Downloaded: https://repo.maven.apache.org/maven2/net/sf/jopt-simple/jopt-simple/4.6/jopt-simple-4.6.pom
(11 kB at 869 kB/s)
[INFO] Downloading: https://repo.maven.apache.org/maven2/org/apache/commons/commons-math3/3.2/commons-math3-3.2.pom
[INFO] Downloaded: https://repo.maven.apache.org/maven2/org/apache/commons/commons-math3/3.2/commons-math3-3.2.pom
(17 kB at 1.5 MB/s)
[INFO] Downloading: https://repo.maven.apache.org/maven2/org/openjdk/jmh/jmh-generator-annprocess/1.17.4/jmh-generator-annprocess-1.17.4.pom
[INFO] Downloaded: https://repo.maven.apache.org/maven2/org/openjdk/jmh/jmh-generator-annprocess/1.17.4/jmh-generator-annprocess-1.17.4.pom
(4.0 kB at 310 kB/s)
[INFO] Downloading: https://repo.maven.apache.org/maven2/org/apache/commons/commons-math3/3.2/commons-math3-3.2.jar
[INFO] Downloading: https://repo.maven.apache.org/maven2/org/apache/bcel/bcel/6.0/bcel-6.0.jar
[INFO] Downloading: https://repo.maven.apache.org/maven2/net/sf/jopt-simple/jopt-simple/4.6/jopt-simple-4.6.jar
[INFO] Downloading: https://repo.maven.apache.org/maven2/org/openjdk/jmh/jmh-core/1.17.4/jmh-core-1.17.4.jar
[INFO] Downloading: https://repo.maven.apache.org/maven2/org/openjdk/jmh/jmh-generator-annprocess/1.17.4/jmh-generator-annprocess-1.17.4.jar
[INFO] Downloaded: https://repo.maven.apache.org/maven2/org/apache/commons/commons-math3/3.2/commons-math3-3.2.jar
(1.7 MB at 10 MB/s)
[INFO] Downloaded: https://repo.maven.apache.org/maven2/net/sf/jopt-simple/jopt-simple/4.6/jopt-simple-4.6.jar
(62 kB at 246 kB/s)
[INFO] Downloaded: https://repo.maven.apache.org/maven2/org/openjdk/jmh/jmh-generator-annprocess/1.17.4/jmh-generator-annprocess-1.17.4.jar
(31 kB at 119 kB/s)
[INFO] Downloaded: https://repo.maven.apache.org/maven2/org/openjdk/jmh/jmh-core/1.17.4/jmh-core-1.17.4.jar
(495 kB at 1.8 MB/s)
[INFO] Downloaded: https://repo.maven.apache.org/maven2/org/apache/bcel/bcel/6.0/bcel-6.0.jar
(671 kB at 2.4 MB/s)
[INFO] 
[INFO] --- maven-clean-plugin:3.0.0:clean (default-clean) @ commons-lang3 ---
[INFO] 
[INFO] --- maven-enforcer-plugin:1.4.1:enforce (enforce-maven-3) @ commons-lang3 ---
[INFO] 
[INFO] --- build-helper-maven-plugin:1.10:parse-version (parse-version) @ commons-lang3 ---
[INFO] 
[INFO] --- maven-antrun-plugin:1.8:run (javadoc.resources) @ commons-lang3 ---
[INFO] Executing tasks

main:
     [copy] Copying 2 files to <https://builds.apache.org/job/commons-lang/ws/target\apidocs\META-INF>
[INFO] Executed tasks
[INFO] 
[INFO] --- maven-remote-resources-plugin:1.5:process (process-resource-bundles) @ commons-lang3
---
[INFO] 
[INFO] --- buildnumber-maven-plugin:1.4:create (default) @ commons-lang3 ---
[INFO] Executing: cmd.exe /X /C "git rev-parse --verify HEAD"
[INFO] Working directory: <https://builds.apache.org/job/commons-lang/ws/>
[INFO] Storing buildNumber: 1406f2a4f2cda80a05b8dc2506ec9d0a25bdf2db at timestamp: 1506383312206
[WARNING] Cannot get the branch information from the git repository: 
Detecting the current branch failed: fatal: ref HEAD is not a symbolic ref

[INFO] Executing: cmd.exe /X /C "git rev-parse --verify HEAD"
[INFO] Working directory: <https://builds.apache.org/job/commons-lang/ws/>
[INFO] Storing buildScmBranch: UNKNOWN
[INFO] 
[INFO] --- maven-resources-plugin:2.7:resources (default-resources) @ commons-lang3 ---
[INFO] Using 'ISO-8859-1' encoding to copy filtered resources.
[INFO] skip non existing resourceDirectory <https://builds.apache.org/job/commons-lang/ws/src\main\resources>
[INFO] Copying 2 resources to META-INF
[INFO] 
[INFO] --- maven-compiler-plugin:3.6.0:compile (default-compile) @ commons-lang3 ---
[INFO] Changes detected - recompiling the module!
[INFO] Compiling 148 source files to <https://builds.apache.org/job/commons-lang/ws/target\classes>
[INFO] -------------------------------------------------------------
[ERROR] COMPILATION ERROR : 
[INFO] -------------------------------------------------------------
[ERROR] No compiler is provided in this environment. Perhaps you are running on a JRE rather
than a JDK?
[INFO] 1 error
[INFO] -------------------------------------------------------------
[INFO] ------------------------------------------------------------------------
[INFO] BUILD FAILURE
[INFO] ------------------------------------------------------------------------
[INFO] Total time: 28.992 s
[INFO] Finished at: 2017-09-25T23:48:34Z
[INFO] Final Memory: 27M/300M
[INFO] ------------------------------------------------------------------------
Waiting for Jenkins to finish collecting data
[ERROR] Failed to execute goal org.apache.maven.plugins:maven-compiler-plugin:3.6.0:compile
(default-compile) on project commons-lang3: Compilation failure
[ERROR] No compiler is provided in this environment. Perhaps you are running on a JRE rather
than a JDK?
[ERROR] -> [Help 1]
[ERROR] 
[ERROR] To see the full stack trace of the errors, re-run Maven with the -e switch.
[ERROR] Re-run Maven using the -X switch to enable full debug logging.
[ERROR] 
[ERROR] For more information about the errors and possible solutions, please read the following
articles:
[ERROR] [Help 1] http://cwiki.apache.org/confluence/display/MAVEN/MojoFailureException
[JENKINS] Archiving <https://builds.apache.org/job/commons-lang/ws/pom.xml> to org.apache.commons/commons-lang3/3.7-SNAPSHOT/commons-lang3-3.7-SNAPSHOT.pom
Sending e-mails to: notifications@commons.apache.org
channel stopped

Mime
View raw message