commons-notifications mailing list archives

Site index · List index
Message view « Date » · « Thread »
Top « Date » · « Thread »
From Apache Jenkins Server <jenk...@builds.apache.org>
Subject Build failed in Jenkins: commons-validator #48
Date Sun, 30 Jul 2017 09:45:38 GMT
See <https://builds.apache.org/job/commons-validator/48/display/redirect?page=changes>

Changes:

[pascalschumacher] .travis.yml: remove oraclejdk7 (no longer available) and add openjdk6

------------------------------------------
Started by an SCM change
[EnvInject] - Loading node environment variables.
Building remotely on ubuntu-1 (ubuntu trusty) in workspace /home/jenkins/jenkins-slave/workspace/commons-validator
Updating https://svn.apache.org/repos/asf/commons/proper/validator/trunk at revision '2017-07-30T09:05:11.059
+0000'
U         .travis.yml
At revision 1803412

[EnvInject] - Executing scripts and injecting environment variables after the SCM step.
[EnvInject] - Injecting as environment variables the properties content 
JAVA_1_6_HOME=/home/jenkins/tools/java/latest1.6/

[EnvInject] - Variables injected successfully.
Parsing POMs
ERROR: Processing failed due to a bug in the code. Please report this to the issue tracker
(https://jenkins.io/redirect/report-an-issue).
hudson.remoting.RequestAbortedException: java.io.IOException: Unexpected termination of the
channel
	at hudson.remoting.Request.abort(Request.java:307)
	at hudson.remoting.Channel.terminate(Channel.java:896)
	at hudson.remoting.SynchronousCommandTransport$ReaderThread.run(SynchronousCommandTransport.java:92)
	at ......remote call to ubuntu-1(Native Method)
	at hudson.remoting.Channel.attachCallSiteStackTrace(Channel.java:1545)
	at hudson.remoting.Request.call(Request.java:172)
	at hudson.remoting.Channel.call(Channel.java:829)
	at hudson.FilePath.act(FilePath.java:986)
	at hudson.FilePath.act(FilePath.java:975)
	at hudson.maven.MavenModuleSetBuild$MavenModuleSetBuildExecution.parsePoms(MavenModuleSetBuild.java:985)
	at hudson.maven.MavenModuleSetBuild$MavenModuleSetBuildExecution.doRun(MavenModuleSetBuild.java:690)
	at hudson.model.AbstractBuild$AbstractBuildExecution.run(AbstractBuild.java:490)
	at hudson.model.Run.execute(Run.java:1735)
	at hudson.maven.MavenModuleSetBuild.run(MavenModuleSetBuild.java:542)
	at hudson.model.ResourceController.execute(ResourceController.java:97)
	at hudson.model.Executor.run(Executor.java:405)
Caused by: java.io.IOException: Unexpected termination of the channel
	at hudson.remoting.SynchronousCommandTransport$ReaderThread.run(SynchronousCommandTransport.java:73)
Caused by: java.io.EOFException
	at java.io.ObjectInputStream$PeekInputStream.readFully(ObjectInputStream.java:2638)
	at java.io.ObjectInputStream$BlockDataInputStream.readShort(ObjectInputStream.java:3113)
	at java.io.ObjectInputStream.readStreamHeader(ObjectInputStream.java:853)
	at java.io.ObjectInputStream.<init>(ObjectInputStream.java:349)
	at hudson.remoting.ObjectInputStreamEx.<init>(ObjectInputStreamEx.java:48)
	at hudson.remoting.AbstractSynchronousByteArrayCommandTransport.read(AbstractSynchronousByteArrayCommandTransport.java:34)
	at hudson.remoting.SynchronousCommandTransport$ReaderThread.run(SynchronousCommandTransport.java:59)
project=hudson.maven.MavenModuleSet@1b661133[commons-validator]
project.getModules()=[hudson.maven.MavenModule@26ea228b[commons-validator/commons-validator:commons-validator][commons-validator/commons-validator:commons-validator][relativePath:]]
project.getRootModule()=hudson.maven.MavenModule@26ea228b[commons-validator/commons-validator:commons-validator][commons-validator/commons-validator:commons-validator][relativePath:]
FATAL: java.io.IOException: Unexpected termination of the channel
java.io.EOFException
	at java.io.ObjectInputStream$PeekInputStream.readFully(ObjectInputStream.java:2638)
	at java.io.ObjectInputStream$BlockDataInputStream.readShort(ObjectInputStream.java:3113)
	at java.io.ObjectInputStream.readStreamHeader(ObjectInputStream.java:853)
	at java.io.ObjectInputStream.<init>(ObjectInputStream.java:349)
	at hudson.remoting.ObjectInputStreamEx.<init>(ObjectInputStreamEx.java:48)
	at hudson.remoting.AbstractSynchronousByteArrayCommandTransport.read(AbstractSynchronousByteArrayCommandTransport.java:34)
	at hudson.remoting.SynchronousCommandTransport$ReaderThread.run(SynchronousCommandTransport.java:59)
Caused: java.io.IOException: Unexpected termination of the channel
	at hudson.remoting.SynchronousCommandTransport$ReaderThread.run(SynchronousCommandTransport.java:73)
Caused: hudson.remoting.RequestAbortedException
	at hudson.remoting.Request.abort(Request.java:307)
	at hudson.remoting.Channel.terminate(Channel.java:896)
	at hudson.remoting.SynchronousCommandTransport$ReaderThread.run(SynchronousCommandTransport.java:92)
	at ......remote call to ubuntu-1(Native Method)
	at hudson.remoting.Channel.attachCallSiteStackTrace(Channel.java:1545)
	at hudson.remoting.Request.call(Request.java:172)
	at hudson.remoting.Channel.call(Channel.java:829)
	at hudson.FilePath.act(FilePath.java:986)
	at hudson.FilePath.act(FilePath.java:975)
	at hudson.maven.MavenModuleSetBuild$MavenModuleSetBuildExecution.parsePoms(MavenModuleSetBuild.java:985)
	at hudson.maven.MavenModuleSetBuild$MavenModuleSetBuildExecution.doRun(MavenModuleSetBuild.java:690)
	at hudson.model.AbstractBuild$AbstractBuildExecution.run(AbstractBuild.java:490)
	at hudson.model.Run.execute(Run.java:1735)
	at hudson.maven.MavenModuleSetBuild.run(MavenModuleSetBuild.java:542)
	at hudson.model.ResourceController.execute(ResourceController.java:97)
	at hudson.model.Executor.run(Executor.java:405)
ERROR: ubuntu-1 is offline; cannot locate JDK 1.7 (latest)
ERROR: ubuntu-1 is offline; cannot locate Maven 3.2.5


Mime
View raw message