commons-notifications mailing list archives

Site index · List index
Message view « Date » · « Thread »
Top « Date » · « Thread »
From Apache Jenkins Server <jenk...@builds.apache.org>
Subject Build failed in Jenkins: commons-io #46
Date Sun, 02 Jul 2017 15:18:52 GMT
See <https://builds.apache.org/job/commons-io/46/display/redirect?page=changes>

Changes:

[pascalschumacher] IO-542: FileUtils#readFileToByteArray: optimize reading of files with

[pascalschumacher] IO-542: FileUtils#readFileToByteArray: optimize reading of files with

------------------------------------------
[...truncated 19.68 KB...]
Tests run: 7, Failures: 0, Errors: 0, Skipped: 0, Time elapsed: 0.162 sec - in org.apache.commons.io.input.TeeInputStreamTest
Running org.apache.commons.io.input.UnixLineEndingInputStreamTest
Tests run: 8, Failures: 0, Errors: 0, Skipped: 0, Time elapsed: 0.147 sec - in org.apache.commons.io.input.UnixLineEndingInputStreamTest
Running org.apache.commons.io.input.WindowsLineEndingInputStreamTest
Tests run: 7, Failures: 0, Errors: 0, Skipped: 0, Time elapsed: 0.145 sec - in org.apache.commons.io.input.WindowsLineEndingInputStreamTest
Running org.apache.commons.io.input.XmlStreamReaderTest
Tests run: 15, Failures: 0, Errors: 0, Skipped: 0, Time elapsed: 0.768 sec - in org.apache.commons.io.input.XmlStreamReaderTest
Running org.apache.commons.io.input.XmlStreamReaderUtilitiesTest
Tests run: 11, Failures: 0, Errors: 0, Skipped: 0, Time elapsed: 0.194 sec - in org.apache.commons.io.input.XmlStreamReaderUtilitiesTest
Running org.apache.commons.io.IOCaseTestCase
Tests run: 17, Failures: 0, Errors: 0, Skipped: 0, Time elapsed: 0.162 sec - in org.apache.commons.io.IOCaseTestCase
Running org.apache.commons.io.IOExceptionWithCauseTestCase
Tests run: 2, Failures: 0, Errors: 0, Skipped: 0, Time elapsed: 0.149 sec - in org.apache.commons.io.IOExceptionWithCauseTestCase
Running org.apache.commons.io.IOUtilsCopyTestCase
Tests run: 23, Failures: 0, Errors: 0, Skipped: 0, Time elapsed: 0.289 sec - in org.apache.commons.io.IOUtilsCopyTestCase
Running org.apache.commons.io.IOUtilsTestCase
Tests run: 106, Failures: 0, Errors: 0, Skipped: 0, Time elapsed: 0.645 sec - in org.apache.commons.io.IOUtilsTestCase
Running org.apache.commons.io.IOUtilsWriteTestCase
Tests run: 53, Failures: 0, Errors: 0, Skipped: 0, Time elapsed: 0.272 sec - in org.apache.commons.io.IOUtilsWriteTestCase
Running org.apache.commons.io.LineIteratorTestCase
Tests run: 16, Failures: 0, Errors: 0, Skipped: 0, Time elapsed: 0.286 sec - in org.apache.commons.io.LineIteratorTestCase
Running org.apache.commons.io.monitor.FileAlterationMonitorTestCase
Tests run: 4, Failures: 0, Errors: 0, Skipped: 0, Time elapsed: 0.812 sec - in org.apache.commons.io.monitor.FileAlterationMonitorTestCase
Running org.apache.commons.io.monitor.FileAlterationObserverTestCase
Tests run: 7, Failures: 0, Errors: 0, Skipped: 0, Time elapsed: 5.402 sec - in org.apache.commons.io.monitor.FileAlterationObserverTestCase
Running org.apache.commons.io.output.AppendableOutputStreamTest
Tests run: 2, Failures: 0, Errors: 0, Skipped: 0, Time elapsed: 0.173 sec - in org.apache.commons.io.output.AppendableOutputStreamTest
Running org.apache.commons.io.output.BrokenOutputStreamTest
Tests run: 3, Failures: 0, Errors: 0, Skipped: 0, Time elapsed: 0.137 sec - in org.apache.commons.io.output.BrokenOutputStreamTest
Running org.apache.commons.io.output.ByteArrayOutputStreamTestCase
Tests run: 3, Failures: 0, Errors: 0, Skipped: 0, Time elapsed: 0.14 sec - in org.apache.commons.io.output.ByteArrayOutputStreamTestCase
Running org.apache.commons.io.output.ChunkedOutputStreamTest
Tests run: 3, Failures: 0, Errors: 0, Skipped: 0, Time elapsed: 0.146 sec - in org.apache.commons.io.output.ChunkedOutputStreamTest
Running org.apache.commons.io.output.ChunkedWriterTest
Tests run: 3, Failures: 0, Errors: 0, Skipped: 0, Time elapsed: 0.178 sec - in org.apache.commons.io.output.ChunkedWriterTest
Running org.apache.commons.io.output.ClosedOutputStreamTest
Tests run: 1, Failures: 0, Errors: 0, Skipped: 0, Time elapsed: 0.15 sec - in org.apache.commons.io.output.ClosedOutputStreamTest
Running org.apache.commons.io.output.CloseShieldOutputStreamTest
Tests run: 1, Failures: 0, Errors: 0, Skipped: 0, Time elapsed: 0.141 sec - in org.apache.commons.io.output.CloseShieldOutputStreamTest
Running org.apache.commons.io.output.CountingOutputStreamTest
Tests run: 2, Failures: 0, Errors: 0, Skipped: 0, Time elapsed: 0.226 sec - in org.apache.commons.io.output.CountingOutputStreamTest
Running org.apache.commons.io.output.DeferredFileOutputStreamTest
Tests run: 130, Failures: 0, Errors: 0, Skipped: 0, Time elapsed: 0.638 sec - in org.apache.commons.io.output.DeferredFileOutputStreamTest
Running org.apache.commons.io.output.FileWriterWithEncodingTest
Tests run: 12, Failures: 0, Errors: 0, Skipped: 0, Time elapsed: 0.424 sec - in org.apache.commons.io.output.FileWriterWithEncodingTest
Running org.apache.commons.io.output.LockableFileWriterTest
Tests run: 7, Failures: 0, Errors: 0, Skipped: 0, Time elapsed: 0.251 sec - in org.apache.commons.io.output.LockableFileWriterTest
Running org.apache.commons.io.output.NullOutputStreamTest
Tests run: 1, Failures: 0, Errors: 0, Skipped: 0, Time elapsed: 0.129 sec - in org.apache.commons.io.output.NullOutputStreamTest
Running org.apache.commons.io.output.NullWriterTest
Tests run: 1, Failures: 0, Errors: 0, Skipped: 0, Time elapsed: 0.133 sec - in org.apache.commons.io.output.NullWriterTest
Running org.apache.commons.io.output.ProxyOutputStreamTest
Tests run: 2, Failures: 0, Errors: 0, Skipped: 0, Time elapsed: 0.166 sec - in org.apache.commons.io.output.ProxyOutputStreamTest
Running org.apache.commons.io.output.ProxyWriterTest
Tests run: 21, Failures: 0, Errors: 0, Skipped: 0, Time elapsed: 0.173 sec - in org.apache.commons.io.output.ProxyWriterTest
Running org.apache.commons.io.output.StringBuilderWriterTest
Tests run: 12, Failures: 0, Errors: 0, Skipped: 0, Time elapsed: 0.141 sec - in org.apache.commons.io.output.StringBuilderWriterTest
Running org.apache.commons.io.output.TaggedOutputStreamTest
Tests run: 3, Failures: 0, Errors: 0, Skipped: 0, Time elapsed: 0.316 sec - in org.apache.commons.io.output.TaggedOutputStreamTest
Running org.apache.commons.io.output.TeeOutputStreamTest
Tests run: 3, Failures: 0, Errors: 0, Skipped: 0, Time elapsed: 0.17 sec - in org.apache.commons.io.output.TeeOutputStreamTest
Running org.apache.commons.io.output.ThresholdingOutputStreamTest
Tests run: 1, Failures: 0, Errors: 0, Skipped: 0, Time elapsed: 0.148 sec - in org.apache.commons.io.output.ThresholdingOutputStreamTest
Running org.apache.commons.io.output.WriterOutputStreamTest
Tests run: 12, Failures: 0, Errors: 0, Skipped: 0, Time elapsed: 0.179 sec - in org.apache.commons.io.output.WriterOutputStreamTest
Running org.apache.commons.io.output.XmlStreamWriterTest
Tests run: 12, Failures: 0, Errors: 0, Skipped: 0, Time elapsed: 0.208 sec - in org.apache.commons.io.output.XmlStreamWriterTest
Running org.apache.commons.io.serialization.FullClassNameMatcherTest
Tests run: 2, Failures: 0, Errors: 0, Skipped: 0, Time elapsed: 0.139 sec - in org.apache.commons.io.serialization.FullClassNameMatcherTest
Running org.apache.commons.io.serialization.MoreComplexObjectTest
Tests run: 3, Failures: 0, Errors: 0, Skipped: 0, Time elapsed: 0.333 sec - in org.apache.commons.io.serialization.MoreComplexObjectTest
Running org.apache.commons.io.serialization.RegexpClassNameMatcherTest
Tests run: 5, Failures: 0, Errors: 0, Skipped: 0, Time elapsed: 0.146 sec - in org.apache.commons.io.serialization.RegexpClassNameMatcherTest
Running org.apache.commons.io.serialization.ValidatingObjectInputStreamTest
Tests run: 18, Failures: 0, Errors: 0, Skipped: 0, Time elapsed: 0.367 sec - in org.apache.commons.io.serialization.ValidatingObjectInputStreamTest
Running org.apache.commons.io.serialization.WildcardClassNameMatcherTest
Tests run: 3, Failures: 0, Errors: 0, Skipped: 0, Time elapsed: 0.148 sec - in org.apache.commons.io.serialization.WildcardClassNameMatcherTest
Running org.apache.commons.io.TaggedIOExceptionTest
Tests run: 1, Failures: 0, Errors: 0, Skipped: 0, Time elapsed: 0.287 sec - in org.apache.commons.io.TaggedIOExceptionTest
Running org.apache.commons.io.ThreadMonitorTestCase
Tests run: 3, Failures: 0, Errors: 0, Skipped: 0, Time elapsed: 0.556 sec - in org.apache.commons.io.ThreadMonitorTestCase

Results :

Tests run: 1316, Failures: 0, Errors: 0, Skipped: 4

[JENKINS] Recording test results
[INFO] 
[INFO] --- maven-jar-plugin:3.0.0:jar (default-jar) @ commons-io ---
[INFO] Building jar: <https://builds.apache.org/job/commons-io/ws/target\commons-io-2.6-SNAPSHOT.jar>
[INFO] 
[INFO] --- maven-site-plugin:3.6:attach-descriptor (attach-descriptor) @ commons-io ---
[INFO] Skipping because packaging 'jar' is not pom.
[INFO] 
[INFO] >>> maven-javadoc-plugin:2.10.4:javadoc (create-javadoc-jar) > generate-sources
@ commons-io >>>
[INFO] 
[INFO] --- maven-enforcer-plugin:1.4.1:enforce (enforce-maven-3) @ commons-io ---
[INFO] 
[INFO] --- build-helper-maven-plugin:1.10:parse-version (parse-version) @ commons-io ---
[INFO] 
[INFO] --- maven-antrun-plugin:1.8:run (javadoc.resources) @ commons-io ---
[INFO] Executing tasks

main:
[INFO] Executed tasks
[WARNING] Failed to getClass for org.apache.maven.plugin.javadoc.JavadocReport
[INFO] 
[INFO] <<< maven-javadoc-plugin:2.10.4:javadoc (create-javadoc-jar) < generate-sources
@ commons-io <<<
[INFO] 
[INFO] --- maven-javadoc-plugin:2.10.4:javadoc (create-javadoc-jar) @ commons-io ---
[INFO] 
1 warning
[WARNING] Javadoc Warnings
[WARNING] <https://builds.apache.org/job/commons-io/ws/src\main\java\org\apache\commons\io\input\ObservableInputStream.java>:37:
warning - Tag @link: reference not found: MessageDigest
[JENKINS] Archiving  javadoc
[INFO] 
[INFO] --- maven-javadoc-plugin:2.10.4:jar (create-javadoc-jar) @ commons-io ---
[INFO] 
1 warning
[WARNING] Javadoc Warnings
[WARNING] <https://builds.apache.org/job/commons-io/ws/src\main\java\org\apache\commons\io\input\ObservableInputStream.java>:37:
warning - Tag @link: reference not found: MessageDigest
[INFO] Building jar: <https://builds.apache.org/job/commons-io/ws/target\commons-io-2.6-SNAPSHOT-javadoc.jar>
[INFO] 
[INFO] >>> maven-source-plugin:3.0.1:jar (create-source-jar) > generate-sources
@ commons-io >>>
[INFO] 
[INFO] --- maven-enforcer-plugin:1.4.1:enforce (enforce-maven-3) @ commons-io ---
[INFO] 
[INFO] --- build-helper-maven-plugin:1.10:parse-version (parse-version) @ commons-io ---
[INFO] 
[INFO] --- maven-antrun-plugin:1.8:run (javadoc.resources) @ commons-io ---
[INFO] Executing tasks

main:
[INFO] Executed tasks
[WARNING] Failed to getClass for org.apache.maven.plugins.source.SourceJarMojo
[INFO] 
[INFO] <<< maven-source-plugin:3.0.1:jar (create-source-jar) < generate-sources
@ commons-io <<<
[INFO] 
[INFO] --- maven-source-plugin:3.0.1:jar (create-source-jar) @ commons-io ---
[INFO] Building jar: <https://builds.apache.org/job/commons-io/ws/target\commons-io-2.6-SNAPSHOT-sources.jar>
[INFO] 
[INFO] >>> maven-source-plugin:3.0.1:test-jar (create-source-jar) > generate-sources
@ commons-io >>>
[INFO] 
[INFO] --- maven-enforcer-plugin:1.4.1:enforce (enforce-maven-3) @ commons-io ---
[INFO] 
[INFO] --- build-helper-maven-plugin:1.10:parse-version (parse-version) @ commons-io ---
[INFO] 
[INFO] --- maven-antrun-plugin:1.8:run (javadoc.resources) @ commons-io ---
[INFO] Executing tasks

main:
[INFO] Executed tasks
[WARNING] Failed to getClass for org.apache.maven.plugins.source.TestSourceJarMojo
[INFO] 
[INFO] <<< maven-source-plugin:3.0.1:test-jar (create-source-jar) < generate-sources
@ commons-io <<<
[INFO] 
[INFO] --- maven-source-plugin:3.0.1:test-jar (create-source-jar) @ commons-io ---
[INFO] Building jar: <https://builds.apache.org/job/commons-io/ws/target\commons-io-2.6-SNAPSHOT-test-sources.jar>
[INFO] 
[INFO] --- maven-jar-plugin:3.0.0:test-jar (default) @ commons-io ---
[INFO] Building jar: <https://builds.apache.org/job/commons-io/ws/target\commons-io-2.6-SNAPSHOT-tests.jar>
[INFO] 
[INFO] --- maven-assembly-plugin:2.6:single (default) @ commons-io ---
[INFO] Reading assembly descriptor: src/assembly/bin.xml
[INFO] Reading assembly descriptor: src/assembly/src.xml
[INFO] Building tar: <https://builds.apache.org/job/commons-io/ws/target\commons-io-2.6-SNAPSHOT-bin.tar.gz>
[INFO] Building zip: <https://builds.apache.org/job/commons-io/ws/target\commons-io-2.6-SNAPSHOT-bin.zip>
[INFO] Building tar: <https://builds.apache.org/job/commons-io/ws/target\commons-io-2.6-SNAPSHOT-src.tar.gz>
[INFO] Building zip: <https://builds.apache.org/job/commons-io/ws/target\commons-io-2.6-SNAPSHOT-src.zip>
[INFO] 
[INFO] --- maven-gpg-plugin:1.6:sign (sign-artifacts) @ commons-io ---
[INFO] 
[INFO] --- maven-install-plugin:2.5.2:install (default-install) @ commons-io ---
[INFO] Installing <https://builds.apache.org/job/commons-io/ws/target\commons-io-2.6-SNAPSHOT.jar>
to f:\jenkins\jenkins-slave\maven-repositories\1\commons-io\commons-io\2.6-SNAPSHOT\commons-io-2.6-SNAPSHOT.jar
[INFO] Installing <https://builds.apache.org/job/commons-io/ws/pom.xml> to f:\jenkins\jenkins-slave\maven-repositories\1\commons-io\commons-io\2.6-SNAPSHOT\commons-io-2.6-SNAPSHOT.pom
[INFO] Installing <https://builds.apache.org/job/commons-io/ws/target\commons-io-2.6-SNAPSHOT-javadoc.jar>
to f:\jenkins\jenkins-slave\maven-repositories\1\commons-io\commons-io\2.6-SNAPSHOT\commons-io-2.6-SNAPSHOT-javadoc.jar
[INFO] Installing <https://builds.apache.org/job/commons-io/ws/target\commons-io-2.6-SNAPSHOT-sources.jar>
to f:\jenkins\jenkins-slave\maven-repositories\1\commons-io\commons-io\2.6-SNAPSHOT\commons-io-2.6-SNAPSHOT-sources.jar
[INFO] Installing <https://builds.apache.org/job/commons-io/ws/target\commons-io-2.6-SNAPSHOT-test-sources.jar>
to f:\jenkins\jenkins-slave\maven-repositories\1\commons-io\commons-io\2.6-SNAPSHOT\commons-io-2.6-SNAPSHOT-test-sources.jar
[INFO] Installing <https://builds.apache.org/job/commons-io/ws/target\commons-io-2.6-SNAPSHOT-tests.jar>
to f:\jenkins\jenkins-slave\maven-repositories\1\commons-io\commons-io\2.6-SNAPSHOT\commons-io-2.6-SNAPSHOT-tests.jar
[INFO] Installing <https://builds.apache.org/job/commons-io/ws/target\commons-io-2.6-SNAPSHOT-bin.tar.gz>
to f:\jenkins\jenkins-slave\maven-repositories\1\commons-io\commons-io\2.6-SNAPSHOT\commons-io-2.6-SNAPSHOT-bin.tar.gz
[INFO] Installing <https://builds.apache.org/job/commons-io/ws/target\commons-io-2.6-SNAPSHOT-bin.zip>
to f:\jenkins\jenkins-slave\maven-repositories\1\commons-io\commons-io\2.6-SNAPSHOT\commons-io-2.6-SNAPSHOT-bin.zip
[INFO] Installing <https://builds.apache.org/job/commons-io/ws/target\commons-io-2.6-SNAPSHOT-src.tar.gz>
to f:\jenkins\jenkins-slave\maven-repositories\1\commons-io\commons-io\2.6-SNAPSHOT\commons-io-2.6-SNAPSHOT-src.tar.gz
[INFO] Installing <https://builds.apache.org/job/commons-io/ws/target\commons-io-2.6-SNAPSHOT-src.zip>
to f:\jenkins\jenkins-slave\maven-repositories\1\commons-io\commons-io\2.6-SNAPSHOT\commons-io-2.6-SNAPSHOT-src.zip
[INFO] ------------------------------------------------------------------------
[INFO] BUILD SUCCESS
[INFO] ------------------------------------------------------------------------
[INFO] Total time: 05:23 min
[INFO] Finished at: 2017-07-02T15:18:37+00:00
[INFO] Final Memory: 44M/468M
[INFO] ------------------------------------------------------------------------
Waiting for Jenkins to finish collecting data
[JENKINS] Archiving <https://builds.apache.org/job/commons-io/ws/pom.xml> to commons-io/commons-io/2.6-SNAPSHOT/commons-io-2.6-SNAPSHOT.pom
[JENKINS] Archiving <https://builds.apache.org/job/commons-io/ws/target\commons-io-2.6-SNAPSHOT.jar>
to commons-io/commons-io/2.6-SNAPSHOT/commons-io-2.6-SNAPSHOT.jar
[JENKINS] Archiving <https://builds.apache.org/job/commons-io/ws/target\commons-io-2.6-SNAPSHOT-javadoc.jar>
to commons-io/commons-io/2.6-SNAPSHOT/commons-io-2.6-SNAPSHOT-javadoc.jar
[JENKINS] Archiving <https://builds.apache.org/job/commons-io/ws/target\commons-io-2.6-SNAPSHOT-sources.jar>
to commons-io/commons-io/2.6-SNAPSHOT/commons-io-2.6-SNAPSHOT-sources.jar
[JENKINS] Archiving <https://builds.apache.org/job/commons-io/ws/target\commons-io-2.6-SNAPSHOT-test-sources.jar>
to commons-io/commons-io/2.6-SNAPSHOT/commons-io-2.6-SNAPSHOT-test-sources.jar
[JENKINS] Archiving <https://builds.apache.org/job/commons-io/ws/target\commons-io-2.6-SNAPSHOT-tests.jar>
to commons-io/commons-io/2.6-SNAPSHOT/commons-io-2.6-SNAPSHOT-tests.jar
[JENKINS] Archiving <https://builds.apache.org/job/commons-io/ws/target\commons-io-2.6-SNAPSHOT-bin.tar.gz>
to commons-io/commons-io/2.6-SNAPSHOT/commons-io-2.6-SNAPSHOT-bin.tar.gz
[JENKINS] Archiving <https://builds.apache.org/job/commons-io/ws/target\commons-io-2.6-SNAPSHOT-bin.zip>
to commons-io/commons-io/2.6-SNAPSHOT/commons-io-2.6-SNAPSHOT-bin.zip
[JENKINS] Archiving <https://builds.apache.org/job/commons-io/ws/target\commons-io-2.6-SNAPSHOT-src.tar.gz>
to commons-io/commons-io/2.6-SNAPSHOT/commons-io-2.6-SNAPSHOT-src.tar.gz
[JENKINS] Archiving <https://builds.apache.org/job/commons-io/ws/target\commons-io-2.6-SNAPSHOT-src.zip>
to commons-io/commons-io/2.6-SNAPSHOT/commons-io-2.6-SNAPSHOT-src.zip
channel stopped
Maven RedeployPublisher use remote windows-2012-1 maven settings from : F:\jenkins\tools\maven\apache-maven-3.3.3/conf/settings.xml
[INFO] Deployment in https://repository.apache.org/content/repositories/snapshots (id=apache.snapshots.https,uniqueVersion=true)
Deploying the main artifact commons-io-2.6-SNAPSHOT.jar
Downloading: https://repository.apache.org/content/repositories/snapshots/commons-io/commons-io/2.6-SNAPSHOT/maven-metadata.xml
Downloaded: https://repository.apache.org/content/repositories/snapshots/commons-io/commons-io/2.6-SNAPSHOT/maven-metadata.xml
(3 KB at 0.6 KB/sec)
Uploading: https://repository.apache.org/content/repositories/snapshots/commons-io/commons-io/2.6-SNAPSHOT/commons-io-2.6-20170702.151850-63.jar
Uploading: https://repository.apache.org/content/repositories/snapshots/commons-io/commons-io/2.6-SNAPSHOT/commons-io-2.6-20170702.151850-63.pom
ERROR: Failed to deploy artifacts: Could not transfer artifact commons-io:commons-io:jar:2.6-20170702.151850-63
from/to apache.snapshots.https (https://repository.apache.org/content/repositories/snapshots):
Failed to transfer file: https://repository.apache.org/content/repositories/snapshots/commons-io/commons-io/2.6-SNAPSHOT/commons-io-2.6-20170702.151850-63.jar.
Return code is: 401, ReasonPhrase: Unauthorized.
org.apache.maven.artifact.deployer.ArtifactDeploymentException: Failed to deploy artifacts:
Could not transfer artifact commons-io:commons-io:jar:2.6-20170702.151850-63 from/to apache.snapshots.https
(https://repository.apache.org/content/repositories/snapshots): Failed to transfer file: https://repository.apache.org/content/repositories/snapshots/commons-io/commons-io/2.6-SNAPSHOT/commons-io-2.6-20170702.151850-63.jar.
Return code is: 401, ReasonPhrase: Unauthorized.
	at org.apache.maven.artifact.deployer.DefaultArtifactDeployer.deploy(DefaultArtifactDeployer.java:143)
	at hudson.maven.reporters.MavenArtifactRecord.deploy(MavenArtifactRecord.java:193)
	at hudson.maven.RedeployPublisher.perform(RedeployPublisher.java:176)
	at hudson.tasks.BuildStepMonitor$1.perform(BuildStepMonitor.java:20)
	at hudson.model.AbstractBuild$AbstractBuildExecution.perform(AbstractBuild.java:779)
	at hudson.model.AbstractBuild$AbstractBuildExecution.performAllBuildSteps(AbstractBuild.java:720)
	at hudson.maven.MavenModuleSetBuild$MavenModuleSetBuildExecution.post2(MavenModuleSetBuild.java:1072)
	at hudson.model.AbstractBuild$AbstractBuildExecution.post(AbstractBuild.java:665)
	at hudson.model.Run.execute(Run.java:1753)
	at hudson.maven.MavenModuleSetBuild.run(MavenModuleSetBuild.java:542)
	at hudson.model.ResourceController.execute(ResourceController.java:98)
	at hudson.model.Executor.run(Executor.java:405)
Caused by: org.eclipse.aether.deployment.DeploymentException: Failed to deploy artifacts:
Could not transfer artifact commons-io:commons-io:jar:2.6-20170702.151850-63 from/to apache.snapshots.https
(https://repository.apache.org/content/repositories/snapshots): Failed to transfer file: https://repository.apache.org/content/repositories/snapshots/commons-io/commons-io/2.6-SNAPSHOT/commons-io-2.6-20170702.151850-63.jar.
Return code is: 401, ReasonPhrase: Unauthorized.
	at org.eclipse.aether.internal.impl.DefaultDeployer.deploy(DefaultDeployer.java:317)
	at org.eclipse.aether.internal.impl.DefaultDeployer.deploy(DefaultDeployer.java:245)
	at org.eclipse.aether.internal.impl.DefaultRepositorySystem.deploy(DefaultRepositorySystem.java:420)
	at org.apache.maven.artifact.deployer.DefaultArtifactDeployer.deploy(DefaultArtifactDeployer.java:139)
	... 11 more
Caused by: org.eclipse.aether.transfer.ArtifactTransferException: Could not transfer artifact
commons-io:commons-io:jar:2.6-20170702.151850-63 from/to apache.snapshots.https (https://repository.apache.org/content/repositories/snapshots):
Failed to transfer file: https://repository.apache.org/content/repositories/snapshots/commons-io/commons-io/2.6-SNAPSHOT/commons-io-2.6-20170702.151850-63.jar.
Return code is: 401, ReasonPhrase: Unauthorized.
	at org.eclipse.aether.connector.basic.ArtifactTransportListener.transferFailed(ArtifactTransportListener.java:43)
	at org.eclipse.aether.connector.basic.BasicRepositoryConnector$TaskRunner.run(BasicRepositoryConnector.java:355)
	at org.eclipse.aether.connector.basic.BasicRepositoryConnector.put(BasicRepositoryConnector.java:274)
	at org.eclipse.aether.internal.impl.DefaultDeployer.deploy(DefaultDeployer.java:311)
	... 14 more
Caused by: org.apache.maven.wagon.TransferFailedException: Failed to transfer file: https://repository.apache.org/content/repositories/snapshots/commons-io/commons-io/2.6-SNAPSHOT/commons-io-2.6-20170702.151850-63.jar.
Return code is: 401, ReasonPhrase: Unauthorized.
	at org.apache.maven.wagon.providers.http.AbstractHttpClientWagon.put(AbstractHttpClientWagon.java:631)
	at org.apache.maven.wagon.providers.http.AbstractHttpClientWagon.put(AbstractHttpClientWagon.java:553)
	at org.apache.maven.wagon.providers.http.AbstractHttpClientWagon.put(AbstractHttpClientWagon.java:535)
	at org.apache.maven.wagon.providers.http.AbstractHttpClientWagon.put(AbstractHttpClientWagon.java:529)
	at org.apache.maven.wagon.providers.http.AbstractHttpClientWagon.put(AbstractHttpClientWagon.java:509)
	at org.eclipse.aether.transport.wagon.WagonTransporter$PutTaskRunner.run(WagonTransporter.java:644)
	at org.eclipse.aether.transport.wagon.WagonTransporter.execute(WagonTransporter.java:427)
	at org.eclipse.aether.transport.wagon.WagonTransporter.put(WagonTransporter.java:410)
	at org.eclipse.aether.connector.basic.BasicRepositoryConnector$PutTaskRunner.runTask(BasicRepositoryConnector.java:510)
	at org.eclipse.aether.connector.basic.BasicRepositoryConnector$TaskRunner.run(BasicRepositoryConnector.java:350)
	... 16 more
[INFO] Deployment failed after 5.9 sec
Build step 'Deploy artifacts to Maven repository' changed build result to FAILURE

Mime
View raw message