commons-notifications mailing list archives

Site index · List index
Message view « Date » · « Thread »
Top « Date » · « Thread »
From Apache Jenkins Server <jenk...@builds.apache.org>
Subject Build failed in Jenkins: Commons-Compress-Windows #397
Date Wed, 19 Jul 2017 11:25:28 GMT
See <https://builds.apache.org/job/Commons-Compress-Windows/397/display/redirect>

------------------------------------------
Started by user bodewig
[EnvInject] - Loading node environment variables.
Building remotely on windows-2012-3 (Windows) in workspace <https://builds.apache.org/job/Commons-Compress-Windows/ws/>
 > git rev-parse --is-inside-work-tree # timeout=10
Fetching changes from the remote Git repository
 > git config remote.origin.url https://git-wip-us.apache.org/repos/asf/commons-compress.git
# timeout=10
Fetching upstream changes from https://git-wip-us.apache.org/repos/asf/commons-compress.git
 > git --version # timeout=10
 > git fetch --tags --progress https://git-wip-us.apache.org/repos/asf/commons-compress.git
+refs/heads/*:refs/remotes/origin/*
 > git rev-parse "refs/remotes/origin/master^{commit}" # timeout=10
 > git rev-parse "refs/remotes/origin/origin/master^{commit}" # timeout=10
Checking out Revision 52cb7925a00115867b6ef2d19c9dd9397d2a1e58 (refs/remotes/origin/master)
Commit message: "COMPRESS-417 record change"
 > git config core.sparsecheckout # timeout=10
 > git checkout -f 52cb7925a00115867b6ef2d19c9dd9397d2a1e58
 > git rev-list 52cb7925a00115867b6ef2d19c9dd9397d2a1e58 # timeout=10
[EnvInject] - Injecting environment variables from a build step.
Setting JDK_1_7_UNLIMITED_SECURITY_64_BIT_WINDOWS_ONLY_HOME=F:\\hudson\\tools\\java\\jdk1.7.0_79-unlimited-security
[EnvInject] - Injecting as environment variables the properties content 
JAVA_1_7_HOME=F:\\hudson\\tools\\java\\jdk1.7.0_79-unlimited-security

[EnvInject] - Variables injected successfully.
Setting JDK_1_7_UNLIMITED_SECURITY_64_BIT_WINDOWS_ONLY_HOME=F:\\hudson\\tools\\java\\jdk1.7.0_79-unlimited-security
Parsing POMs
Established TCP socket on 52713
maven33-agent.jar already up to date
maven33-interceptor.jar already up to date
maven3-interceptor-commons.jar already up to date
[Commons-Compress-Windows] $ F:\\hudson\\tools\\java\\jdk1.7.0_79-unlimited-security/bin/java
-Xmx2g -Xms256m -cp f:\jenkins\jenkins-slave\maven33-agent.jar;f:\jenkins\tools\maven\latest3\boot\plexus-classworlds-2.5.2.jar;f:\\jenkins\\tools\\maven\\latest3/conf/logging
jenkins.maven3.agent.Maven33Main f:\\jenkins\\tools\\maven\\latest3 F:\jenkins\jenkins-slave\slave.jar
f:\jenkins\jenkins-slave\maven33-interceptor.jar f:\jenkins\jenkins-slave\maven3-interceptor-commons.jar
52713
<===[JENKINS REMOTING CAPACITY]===>   channel started
ERROR: ================================================================================
ERROR: Invalid project setup: jenkins/security/MasterToSlaveCallable : Unsupported major.minor
version 52.0
ERROR: [JENKINS-18403][JENKINS-28294] JDK 'JDK 1.7 (unlimited security) 64-bit Windows only'
not supported to run Maven projects.
ERROR: Maven projects have to be launched with a Java version greater or equal to the minimum
version required by the master.
ERROR: Use the Maven JDK Toolchains (plugin) to build your maven project with an older JDK.
ERROR: Retrying with slave Java and setting compile/test properties to point to F:\\hudson\\tools\\java\\jdk1.7.0_79-unlimited-security.
ERROR: ================================================================================
Established TCP socket on 52715
maven33-agent.jar already up to date
maven33-interceptor.jar already up to date
maven3-interceptor-commons.jar already up to date
[Commons-Compress-Windows] $ "C:\Program Files\Java\jre1.8.0_121/bin/java" -Xmx2g -Xms256m
-cp f:\jenkins\jenkins-slave\maven33-agent.jar;f:\jenkins\tools\maven\latest3\boot\plexus-classworlds-2.5.2.jar;f:\\jenkins\\tools\\maven\\latest3/conf/logging
jenkins.maven3.agent.Maven33Main f:\\jenkins\\tools\\maven\\latest3 F:\jenkins\jenkins-slave\slave.jar
f:\jenkins\jenkins-slave\maven33-interceptor.jar f:\jenkins\jenkins-slave\maven3-interceptor-commons.jar
52715
<===[JENKINS REMOTING CAPACITY]===>   channel started
Executing Maven:  -B -f <https://builds.apache.org/job/Commons-Compress-Windows/ws/pom.xml>
-Dmaven.repo.local=f:\jenkins\jenkins-slave\maven-repositories\0 clean test --batch-mode
[INFO] Scanning for projects...
[INFO]                                                                         
[INFO] ------------------------------------------------------------------------
[INFO] Building Apache Commons Compress 1.15-SNAPSHOT
[INFO] ------------------------------------------------------------------------
[INFO] Downloading: https://repo.maven.apache.org/maven2/org/eluder/coveralls/coveralls-maven-plugin/maven-metadata.xml
[INFO] Downloading: http://repository.apache.org/snapshots/org/eluder/coveralls/coveralls-maven-plugin/maven-metadata.xml
[INFO] Downloaded: https://repo.maven.apache.org/maven2/org/eluder/coveralls/coveralls-maven-plugin/maven-metadata.xml
(814 B at 1.8 KB/sec)
[INFO] Downloading: https://repo.maven.apache.org/maven2/org/eluder/coveralls/coveralls-maven-plugin/4.3.0/coveralls-maven-plugin-4.3.0.pom
[INFO] Downloaded: https://repo.maven.apache.org/maven2/org/eluder/coveralls/coveralls-maven-plugin/4.3.0/coveralls-maven-plugin-4.3.0.pom
(11 KB at 441.4 KB/sec)
[INFO] Downloading: https://repo.maven.apache.org/maven2/org/eluder/eluder-parent/8/eluder-parent-8.pom
[INFO] Downloaded: https://repo.maven.apache.org/maven2/org/eluder/eluder-parent/8/eluder-parent-8.pom
(15 KB at 671.5 KB/sec)
[INFO] Downloading: https://repo.maven.apache.org/maven2/org/eluder/coveralls/coveralls-maven-plugin/4.3.0/coveralls-maven-plugin-4.3.0.jar
[INFO] Downloaded: https://repo.maven.apache.org/maven2/org/eluder/coveralls/coveralls-maven-plugin/4.3.0/coveralls-maven-plugin-4.3.0.jar
(88 KB at 2497.7 KB/sec)
[INFO] Downloading: https://repo.maven.apache.org/maven2/org/objenesis/objenesis/2.6/objenesis-2.6.pom
[INFO] Downloaded: https://repo.maven.apache.org/maven2/org/objenesis/objenesis/2.6/objenesis-2.6.pom
(3 KB at 181.2 KB/sec)
[INFO] Downloading: https://repo.maven.apache.org/maven2/org/objenesis/objenesis-parent/2.6/objenesis-parent-2.6.pom
[INFO] Downloaded: https://repo.maven.apache.org/maven2/org/objenesis/objenesis-parent/2.6/objenesis-parent-2.6.pom
(17 KB at 1008.2 KB/sec)
[INFO] Downloading: https://repo.maven.apache.org/maven2/org/powermock/powermock-module-junit4/1.7.0/powermock-module-junit4-1.7.0.pom
[INFO] Downloaded: https://repo.maven.apache.org/maven2/org/powermock/powermock-module-junit4/1.7.0/powermock-module-junit4-1.7.0.pom
(3 KB at 176.5 KB/sec)
[INFO] Downloading: https://repo.maven.apache.org/maven2/org/powermock/powermock-module-junit4-common/1.7.0/powermock-module-junit4-common-1.7.0.pom
[INFO] Downloaded: https://repo.maven.apache.org/maven2/org/powermock/powermock-module-junit4-common/1.7.0/powermock-module-junit4-common-1.7.0.pom
(3 KB at 165.4 KB/sec)
[INFO] Downloading: https://repo.maven.apache.org/maven2/org/powermock/powermock-reflect/1.7.0/powermock-reflect-1.7.0.pom
[INFO] Downloaded: https://repo.maven.apache.org/maven2/org/powermock/powermock-reflect/1.7.0/powermock-reflect-1.7.0.pom
(2 KB at 148.6 KB/sec)
[INFO] Downloading: https://repo.maven.apache.org/maven2/org/powermock/powermock-core/1.7.0/powermock-core-1.7.0.pom
[INFO] Downloaded: https://repo.maven.apache.org/maven2/org/powermock/powermock-core/1.7.0/powermock-core-1.7.0.pom
(3 KB at 133.5 KB/sec)
[INFO] Downloading: https://repo.maven.apache.org/maven2/org/mockito/mockito-core/2.8.9/mockito-core-2.8.9.pom
[INFO] Downloaded: https://repo.maven.apache.org/maven2/org/mockito/mockito-core/2.8.9/mockito-core-2.8.9.pom
(3 KB at 176.3 KB/sec)
[INFO] Downloading: https://repo.maven.apache.org/maven2/net/bytebuddy/byte-buddy/1.6.14/byte-buddy-1.6.14.pom
[INFO] Downloaded: https://repo.maven.apache.org/maven2/net/bytebuddy/byte-buddy/1.6.14/byte-buddy-1.6.14.pom
(12 KB at 822.1 KB/sec)
[INFO] Downloading: https://repo.maven.apache.org/maven2/net/bytebuddy/byte-buddy-parent/1.6.14/byte-buddy-parent-1.6.14.pom
[INFO] Downloaded: https://repo.maven.apache.org/maven2/net/bytebuddy/byte-buddy-parent/1.6.14/byte-buddy-parent-1.6.14.pom
(26 KB at 1275.3 KB/sec)
[INFO] Downloading: https://repo.maven.apache.org/maven2/net/bytebuddy/byte-buddy-agent/1.6.14/byte-buddy-agent-1.6.14.pom
[INFO] Downloaded: https://repo.maven.apache.org/maven2/net/bytebuddy/byte-buddy-agent/1.6.14/byte-buddy-agent-1.6.14.pom
(5 KB at 337.7 KB/sec)
[INFO] Downloading: https://repo.maven.apache.org/maven2/org/powermock/powermock-api-mockito/1.7.0/powermock-api-mockito-1.7.0.pom
[INFO] Downloaded: https://repo.maven.apache.org/maven2/org/powermock/powermock-api-mockito/1.7.0/powermock-api-mockito-1.7.0.pom
(2 KB at 140.0 KB/sec)
[INFO] Downloading: https://repo.maven.apache.org/maven2/org/powermock/powermock-api-mockito-common/1.7.0/powermock-api-mockito-common-1.7.0.pom
[INFO] Downloaded: https://repo.maven.apache.org/maven2/org/powermock/powermock-api-mockito-common/1.7.0/powermock-api-mockito-common-1.7.0.pom
(3 KB at 227.3 KB/sec)
[INFO] Downloading: https://repo.maven.apache.org/maven2/org/powermock/powermock-api-support/1.7.0/powermock-api-support-1.7.0.pom
[INFO] Downloaded: https://repo.maven.apache.org/maven2/org/powermock/powermock-api-support/1.7.0/powermock-api-support-1.7.0.pom
(2 KB at 121.9 KB/sec)
[INFO] Downloading: https://repo.maven.apache.org/maven2/org/objenesis/objenesis/2.6/objenesis-2.6.jar
[INFO] Downloading: https://repo.maven.apache.org/maven2/org/powermock/powermock-module-junit4/1.7.0/powermock-module-junit4-1.7.0.jar
[INFO] Downloading: https://repo.maven.apache.org/maven2/org/powermock/powermock-core/1.7.0/powermock-core-1.7.0.jar
[INFO] Downloading: https://repo.maven.apache.org/maven2/org/powermock/powermock-reflect/1.7.0/powermock-reflect-1.7.0.jar
[INFO] Downloading: https://repo.maven.apache.org/maven2/org/powermock/powermock-module-junit4-common/1.7.0/powermock-module-junit4-common-1.7.0.jar
[INFO] Downloaded: https://repo.maven.apache.org/maven2/org/objenesis/objenesis/2.6/objenesis-2.6.jar
(55 KB at 1812.6 KB/sec)
[INFO] Downloading: https://repo.maven.apache.org/maven2/org/powermock/powermock-api-mockito/1.7.0/powermock-api-mockito-1.7.0.jar
[INFO] Downloaded: https://repo.maven.apache.org/maven2/org/powermock/powermock-api-mockito/1.7.0/powermock-api-mockito-1.7.0.jar
(84 KB at 1413.2 KB/sec)
[INFO] Downloading: https://repo.maven.apache.org/maven2/org/powermock/powermock-api-mockito-common/1.7.0/powermock-api-mockito-common-1.7.0.jar
[INFO] Downloaded: https://repo.maven.apache.org/maven2/org/powermock/powermock-reflect/1.7.0/powermock-reflect-1.7.0.jar
(64 KB at 724.2 KB/sec)
[INFO] Downloading: https://repo.maven.apache.org/maven2/org/powermock/powermock-api-support/1.7.0/powermock-api-support-1.7.0.jar
[INFO] Downloaded: https://repo.maven.apache.org/maven2/org/powermock/powermock-module-junit4-common/1.7.0/powermock-module-junit4-common-1.7.0.jar
(18 KB at 193.9 KB/sec)
[INFO] Downloaded: https://repo.maven.apache.org/maven2/org/powermock/powermock-module-junit4/1.7.0/powermock-module-junit4-1.7.0.jar
(47 KB at 517.9 KB/sec)
[INFO] Downloaded: https://repo.maven.apache.org/maven2/org/powermock/powermock-core/1.7.0/powermock-core-1.7.0.jar
(143 KB at 1528.8 KB/sec)
[INFO] Downloaded: https://repo.maven.apache.org/maven2/org/powermock/powermock-api-mockito-common/1.7.0/powermock-api-mockito-common-1.7.0.jar
(35 KB at 378.5 KB/sec)
[INFO] Downloaded: https://repo.maven.apache.org/maven2/org/powermock/powermock-api-support/1.7.0/powermock-api-support-1.7.0.jar
(23 KB at 207.6 KB/sec)
[INFO] 
[INFO] --- maven-clean-plugin:3.0.0:clean (default-clean) @ commons-compress ---
[INFO] Deleting <https://builds.apache.org/job/Commons-Compress-Windows/ws/target>
[INFO] 
[INFO] --- maven-enforcer-plugin:1.4.1:enforce (enforce-maven-3) @ commons-compress ---
[INFO] 
[INFO] --- build-helper-maven-plugin:1.10:parse-version (parse-version) @ commons-compress
---
[INFO] 
[INFO] --- maven-antrun-plugin:1.8:run (javadoc.resources) @ commons-compress ---
[INFO] Executing tasks

main:
     [copy] Copying 2 files to <https://builds.apache.org/job/Commons-Compress-Windows/ws/target\apidocs\META-INF>
[INFO] Executed tasks
[INFO] 
[INFO] --- maven-remote-resources-plugin:1.5:process (process-resource-bundles) @ commons-compress
---
[INFO] 
[INFO] --- buildnumber-maven-plugin:1.4:create (default) @ commons-compress ---
[INFO] Executing: cmd.exe /X /C "git rev-parse --verify HEAD"
[INFO] Working directory: <https://builds.apache.org/job/Commons-Compress-Windows/ws/>
[INFO] Storing buildNumber: 52cb7925a00115867b6ef2d19c9dd9397d2a1e58 at timestamp: 1500463526105
[WARNING] Cannot get the branch information from the git repository: 
Detecting the current branch failed: fatal: ref HEAD is not a symbolic ref

[INFO] Executing: cmd.exe /X /C "git rev-parse --verify HEAD"
[INFO] Working directory: <https://builds.apache.org/job/Commons-Compress-Windows/ws/>
[INFO] Storing buildScmBranch: UNKNOWN
[INFO] 
[INFO] --- maven-resources-plugin:2.7:resources (default-resources) @ commons-compress ---
[INFO] Using 'iso-8859-1' encoding to copy filtered resources.
[INFO] skip non existing resourceDirectory <https://builds.apache.org/job/Commons-Compress-Windows/ws/src\main\resources>
[INFO] Copying 2 resources to META-INF
[INFO] 
[INFO] --- maven-compiler-plugin:3.6.0:compile (default-compile) @ commons-compress ---
[INFO] Changes detected - recompiling the module!
[INFO] Compiling 195 source files to <https://builds.apache.org/job/Commons-Compress-Windows/ws/target\classes>
[INFO] -------------------------------------------------------------
[ERROR] COMPILATION ERROR : 
[INFO] -------------------------------------------------------------
[ERROR] No compiler is provided in this environment. Perhaps you are running on a JRE rather
than a JDK?
[INFO] 1 error
[INFO] -------------------------------------------------------------
[INFO] ------------------------------------------------------------------------
[INFO] BUILD FAILURE
[INFO] ------------------------------------------------------------------------
[INFO] Total time: 7.779 s
[INFO] Finished at: 2017-07-19T11:25:27+00:00
[INFO] Final Memory: 25M/379M
[INFO] ------------------------------------------------------------------------
Waiting for Jenkins to finish collecting data
[ERROR] Failed to execute goal org.apache.maven.plugins:maven-compiler-plugin:3.6.0:compile
(default-compile) on project commons-compress: Compilation failure
[ERROR] No compiler is provided in this environment. Perhaps you are running on a JRE rather
than a JDK?
[ERROR] -> [Help 1]
[ERROR] 
[ERROR] To see the full stack trace of the errors, re-run Maven with the -e switch.
[ERROR] Re-run Maven using the -X switch to enable full debug logging.
[ERROR] 
[ERROR] For more information about the errors and possible solutions, please read the following
articles:
[ERROR] [Help 1] http://cwiki.apache.org/confluence/display/MAVEN/MojoFailureException
[JENKINS] Archiving <https://builds.apache.org/job/Commons-Compress-Windows/ws/pom.xml>
to org.apache.commons/commons-compress/1.15-SNAPSHOT/commons-compress-1.15-SNAPSHOT.pom
Sending e-mails to: notifications@commons.apache.org
channel stopped
Setting JDK_1_7_UNLIMITED_SECURITY_64_BIT_WINDOWS_ONLY_HOME=F:\\hudson\\tools\\java\\jdk1.7.0_79-unlimited-security

Mime
View raw message