commons-notifications mailing list archives

Site index · List index
Message view « Date » · « Thread »
Top « Date » · « Thread »
From Apache Jenkins Server <jenk...@builds.apache.org>
Subject Build failed in Jenkins: Commons-Compress JDK-Matrix Build » JDK 9 b156 (early access build) with project Jigsaw #1
Date Sat, 24 Jun 2017 15:53:17 GMT
See <https://builds.apache.org/job/Commons-Compress%20JDK-Matrix%20Build/jdk=JDK%209%20b156%20(early%20access%20build)%20with%20project%20Jigsaw/1/display/redirect>

------------------------------------------
[...truncated 180.92 KB...]
Running org.apache.commons.compress.compressors.deflate.DeflateParametersTest
Tests run: 3, Failures: 0, Errors: 0, Skipped: 0, Time elapsed: 0.001 sec - in org.apache.commons.compress.compressors.deflate.DeflateParametersTest
Running org.apache.commons.compress.compressors.XZTestCase
XZTestCase: HeapMax=25333596160 bytes 24160.0 MB
Tests run: 4, Failures: 0, Errors: 0, Skipped: 0, Time elapsed: 0.171 sec - in org.apache.commons.compress.compressors.XZTestCase
Running org.apache.commons.compress.compressors.FramedSnappyTestCase
test.txt written, uncompressed bytes: 369, compressed bytes: 53 after 2ms
bla.tar written, uncompressed bytes: 10240, compressed bytes: 971 after 2ms
COMPRESS-256.7z written, uncompressed bytes: 4069842, compressed bytes: 4068310 after 246ms
bigChunkTest written, uncompressed bytes: 131072, compressed bytes: 131126 after 12ms
Tests run: 5, Failures: 0, Errors: 0, Skipped: 0, Time elapsed: 0.474 sec - in org.apache.commons.compress.compressors.FramedSnappyTestCase
Running org.apache.commons.compress.compressors.DetectCompressorTestCase
Tests run: 8, Failures: 0, Errors: 0, Skipped: 0, Time elapsed: 0.022 sec - in org.apache.commons.compress.compressors.DetectCompressorTestCase
Running org.apache.commons.compress.compressors.brotli.BrotliCompressorInputStreamTest
Tests run: 9, Failures: 0, Errors: 0, Skipped: 0, Time elapsed: 0.075 sec - in org.apache.commons.compress.compressors.brotli.BrotliCompressorInputStreamTest
Running org.apache.commons.compress.compressors.BZip2TestCase
Tests run: 5, Failures: 0, Errors: 0, Skipped: 0, Time elapsed: 0.008 sec - in org.apache.commons.compress.compressors.BZip2TestCase
Running org.apache.commons.compress.compressors.pack200.Pack200UtilsTest
Tests run: 2, Failures: 0, Errors: 2, Skipped: 0, Time elapsed: 0.027 sec <<< FAILURE!
- in org.apache.commons.compress.compressors.pack200.Pack200UtilsTest
testNormalizeInPlace(org.apache.commons.compress.compressors.pack200.Pack200UtilsTest)  Time
elapsed: 0.02 sec  <<< ERROR!
java.util.ServiceConfigurationError: sun.util.locale.provider.LocaleDataMetaInfo: Provider
sun.util.resources.cldr.provider.CLDRLocaleDataMetaInfo could not be instantiated
	at org.apache.commons.compress.compressors.pack200.Pack200UtilsTest.testNormalizeInPlace(Pack200UtilsTest.java:93)
Caused by: java.lang.NoClassDefFoundError: Could not initialize class sun.util.resources.cldr.provider.CLDRLocaleDataMetaInfo
	at org.apache.commons.compress.compressors.pack200.Pack200UtilsTest.testNormalizeInPlace(Pack200UtilsTest.java:93)

testNormalize(org.apache.commons.compress.compressors.pack200.Pack200UtilsTest)  Time elapsed:
0.007 sec  <<< ERROR!
java.util.ServiceConfigurationError: sun.util.locale.provider.LocaleDataMetaInfo: Provider
sun.util.resources.cldr.provider.CLDRLocaleDataMetaInfo could not be instantiated
	at org.apache.commons.compress.compressors.pack200.Pack200UtilsTest.testNormalize(Pack200UtilsTest.java:47)
Caused by: java.lang.NoClassDefFoundError: Could not initialize class sun.util.resources.cldr.provider.CLDRLocaleDataMetaInfo
	at org.apache.commons.compress.compressors.pack200.Pack200UtilsTest.testNormalize(Pack200UtilsTest.java:47)

Running org.apache.commons.compress.compressors.ZTestCase
Tests run: 4, Failures: 0, Errors: 0, Skipped: 0, Time elapsed: 0.011 sec - in org.apache.commons.compress.compressors.ZTestCase
Running org.apache.commons.compress.compressors.snappy.FramedSnappyCompressorInputStreamTest
Tests run: 8, Failures: 0, Errors: 1, Skipped: 0, Time elapsed: 0.133 sec <<< FAILURE!
- in org.apache.commons.compress.compressors.snappy.FramedSnappyCompressorInputStreamTest
readIWAFile(org.apache.commons.compress.compressors.snappy.FramedSnappyCompressorInputStreamTest)
 Time elapsed: 0.003 sec  <<< ERROR!
java.util.ServiceConfigurationError: sun.util.locale.provider.LocaleDataMetaInfo: Provider
sun.util.resources.cldr.provider.CLDRLocaleDataMetaInfo could not be instantiated
	at org.apache.commons.compress.compressors.snappy.FramedSnappyCompressorInputStreamTest.readIWAFile(FramedSnappyCompressorInputStreamTest.java:154)
Caused by: java.lang.NoClassDefFoundError: Could not initialize class sun.util.resources.cldr.provider.CLDRLocaleDataMetaInfo
	at org.apache.commons.compress.compressors.snappy.FramedSnappyCompressorInputStreamTest.readIWAFile(FramedSnappyCompressorInputStreamTest.java:154)

Running org.apache.commons.compress.compressors.snappy.SnappyRoundtripTest
COMPRESS-256.7z written, uncompressed bytes: 4069842, compressed bytes: 4067498 after 303ms
COMPRESS-256.7z.raw.sz read after 11ms
Configuration: tuned for compression ratio
bla.tar written, uncompressed bytes: 10240, compressed bytes: 949 after 2ms
bla.tar.raw.sz read after 1ms
reallyBigLiteralTest written, uncompressed bytes: 524288, compressed bytes: 524309 after 37ms
reallyBigLiteralTest.raw.sz read after 3ms
reallyBigOffsetTest written, uncompressed bytes: 2097160, compressed bytes: 2097296 after
212ms
reallyBigOffsetTest.raw.sz read after 8ms
lorem-ipsum.txt.gz written, uncompressed bytes: 38080, compressed bytes: 38089 after 2ms
lorem-ipsum.txt.gz.raw.sz read after 0ms
Configuration: default
bla.tar written, uncompressed bytes: 10240, compressed bytes: 955 after 1ms
bla.tar.raw.sz read after 1ms
Configuration: tuned for speed
bla.tar written, uncompressed bytes: 10240, compressed bytes: 960 after 1ms
bla.tar.raw.sz read after 1ms
Tests run: 7, Failures: 0, Errors: 0, Skipped: 0, Time elapsed: 3.718 sec - in org.apache.commons.compress.compressors.snappy.SnappyRoundtripTest
Running org.apache.commons.compress.compressors.GZipTestCase
Tests run: 13, Failures: 0, Errors: 0, Skipped: 0, Time elapsed: 0.009 sec - in org.apache.commons.compress.compressors.GZipTestCase

Results :

Tests in error: 
  ArchiveReadTest.testArchive:112->AbstractTestCase.checkArchiveContent:290->AbstractTestCase.checkArchiveContent:303->AbstractTestCase.checkArchiveContent:322
» ServiceConfiguration
  ArchiveReadTest.testArchive:112->AbstractTestCase.checkArchiveContent:290->AbstractTestCase.checkArchiveContent:303->AbstractTestCase.checkArchiveContent:322
» ServiceConfiguration
  DetectArchiverTestCase.testEmptyJarArchive:120->checkEmptyArchive:133->AbstractTestCase.createEmptyArchive:235
» ServiceConfiguration
  DetectArchiverTestCase.testEmptyZipArchive:129->checkEmptyArchive:133->AbstractTestCase.createEmptyArchive:235
» ServiceConfiguration
  IOMethodsTest.testReadJar:98->compareReads:146->AbstractTestCase.createSingleEntryArchive:262
» ServiceConfiguration
  IOMethodsTest.testReadZip:108->compareReads:146->AbstractTestCase.createSingleEntryArchive:262
» ServiceConfiguration
  IOMethodsTest.testWriteJar:70->compareWrites:115 » ServiceConfiguration sun.ut...
  IOMethodsTest.testWriteZip:83->compareWrites:115 » ServiceConfiguration sun.ut...
  ArchiveOutputStreamTest.testCallSequenceJar:127->doCallSequence:145 » ServiceConfiguration
  ArchiveOutputStreamTest.testCallSequenceZip:137->doCallSequence:145 » ServiceConfiguration
  ArchiveOutputStreamTest.testFinish:45 » ServiceConfiguration sun.util.locale.p...
  ArchiveOutputStreamTest.testOptionalFinish:95 » ServiceConfiguration sun.util....
  ArchiveStreamFactoryTest.testEncodingOutputStream:357->getOutputStreamFor:431 » ServiceConfiguration
  JarTestCase.testJarArchiveCreation:43 » ServiceConfiguration sun.util.locale.p...
  JarTestCase.testJarUnarchive:63 » ServiceConfiguration sun.util.locale.provide...
  JarTestCase.testJarUnarchiveAll:94 » ServiceConfiguration sun.util.locale.prov...
  LongPathTest.testArchive:160->AbstractTestCase.checkArchiveContent:303->AbstractTestCase.checkArchiveContent:322
» ServiceConfiguration
  LongPathTest.testArchive:160->AbstractTestCase.checkArchiveContent:303->AbstractTestCase.checkArchiveContent:322
» ServiceConfiguration
  LongPathTest.testArchive:160->AbstractTestCase.checkArchiveContent:303->AbstractTestCase.checkArchiveContent:322
» ServiceConfiguration
  LongPathTest.testArchive:160->AbstractTestCase.checkArchiveContent:303->AbstractTestCase.checkArchiveContent:322
» ServiceConfiguration
  LongPathTest.testArchive:160->AbstractTestCase.checkArchiveContent:303->AbstractTestCase.checkArchiveContent:322
» ServiceConfiguration
  LongPathTest.testArchive:160->AbstractTestCase.checkArchiveContent:303->AbstractTestCase.checkArchiveContent:322
» ServiceConfiguration
  SevenZTestCase.testSevenZArchiveCreationUsingBZIP2:52->testSevenZArchiveCreation:70 »
ServiceConfiguration
  SevenZTestCase.testSevenZArchiveCreationUsingCopy:37->testSevenZArchiveCreation:70 »
ServiceConfiguration
  SevenZTestCase.testSevenZArchiveCreationUsingDeflate:57->testSevenZArchiveCreation:70
» ServiceConfiguration
  SevenZTestCase.testSevenZArchiveCreationUsingLZMA:42->testSevenZArchiveCreation:70 »
ServiceConfiguration
  SevenZTestCase.testSevenZArchiveCreationUsingLZMA2:47->testSevenZArchiveCreation:70 »
ServiceConfiguration
  ZipTestCase.testCopyRawEntriesFromFile:369->createReferenceFile:444 » ServiceConfiguration
  ZipTestCase.testCopyRawZip64EntryFromFile:402 » ServiceConfiguration sun.util....
  ZipTestCase.testDirectoryEntryFromFile:293 » ServiceConfiguration sun.util.loc...
  ZipTestCase.testExplicitDirectoryEntry:329 » ServiceConfiguration sun.util.loc...
  ZipTestCase.testExplicitFileEntry:565 » ServiceConfiguration sun.util.locale.p...
  ZipTestCase.testFileEntryFromFile:520 » ServiceConfiguration sun.util.locale.p...
  ZipTestCase.testListAllFilesWithNestedArchive:255 » ServiceConfiguration sun.u...
  ZipTestCase.testSkipEntryWithUnsupportedCompressionMethod:220 » ServiceConfiguration
  ZipTestCase.testSkipsPK00Prefix:184->AbstractTestCase.checkArchiveContent:303->AbstractTestCase.checkArchiveContent:322
» ServiceConfiguration
  ZipTestCase.testSupportedCompressionMethod:201 » ServiceConfiguration sun.util...
  ZipTestCase.testUnixModeInAddRaw:428 » ServiceConfiguration sun.util.locale.pr...
  ZipTestCase.testZipArchiveCreation:66 » ServiceConfiguration sun.util.locale.p...
  ZipTestCase.testZipArchiveCreationInMemory:128 » ServiceConfiguration sun.util...
  ZipTestCase.testZipUnarchive:165 » ServiceConfiguration sun.util.locale.provid...
  ArjArchiveInputStreamTest.testReadingOfAttributesDosVersion:64 » ServiceConfiguration
  ArjArchiveInputStreamTest.testReadingOfAttributesUnixVersion:78 » ServiceConfiguration
  JarArchiveOutputStreamTest.testJarMarker:44 » ServiceConfiguration sun.util.lo...
  SevenZNativeHeapTest.initializationError » Objenesis java.lang.reflect.Invocat...
  SevenZOutputFileTest.testDirectoriesAndEmptyFiles:61 » ServiceConfiguration su...
  SevenZOutputFileTest.testEightEmptyFiles:204->testCompress252:386->addDir:414 » ServiceConfiguration
  SevenZOutputFileTest.testEightFilesSomeNotEmpty:209->testCompress252:386->addDir:414
» ServiceConfiguration
  SevenZOutputFileTest.testNineEmptyFiles:214->testCompress252:386->addDir:414 » ServiceConfiguration
  SevenZOutputFileTest.testNineFilesSomeNotEmpty:219->testCompress252:386->addDir:414
» ServiceConfiguration
  SevenZOutputFileTest.testSevenEmptyFiles:194->testCompress252:386->addDir:414 » ServiceConfiguration
  SevenZOutputFileTest.testSevenFilesSomeNotEmpty:199->testCompress252:386->addDir:414
» ServiceConfiguration
  SevenZOutputFileTest.testSixEmptyFiles:184->testCompress252:386->addDir:414 » ServiceConfiguration
  SevenZOutputFileTest.testSixFilesSomeNotEmpty:189->testCompress252:386->addDir:414
» ServiceConfiguration
  SevenZOutputFileTest.testTwentyNineEmptyFiles:224->testCompress252:386->addDir:414
» ServiceConfiguration
  SevenZOutputFileTest.testTwentyNineFilesSomeNotEmpty:229->testCompress252:386->addDir:414
» ServiceConfiguration
  TarArchiveInputStreamTest.datePriorToEpochInGNUFormat:130->datePriorToEpoch:145 » ServiceConfiguration
  TarArchiveInputStreamTest.datePriorToEpochInPAXFormat:136->datePriorToEpoch:145 » ServiceConfiguration
  TarArchiveOutputStreamTest.testOldEntryPosixMode:293 » ServiceConfiguration su...
  TarArchiveOutputStreamTest.testOldEntryStarMode:260 » ServiceConfiguration sun...
  DataDescriptorTest.doesntWriteDataDescriptorForDeflatedEntryOnSeekableOutput:95 » ServiceConfiguration
  DataDescriptorTest.doesntWriteDataDescriptorWhenAddingRawEntries:137 » ServiceConfiguration
  DataDescriptorTest.writesDataDescriptorForDeflatedEntryOnUnseekableOutput:55 » ServiceConfiguration
  EncryptedArchiveTest.testReadPasswordEncryptedEntryViaStream:62 » ServiceConfiguration
  EncryptedArchiveTest.testReadPasswordEncryptedEntryViaZipFile:38 » ServiceConfiguration
  ExplodeSupportTest.testArchiveWithImplodeCompression4K2Trees:56->testArchiveWithImplodeCompression:38
» ServiceConfiguration
  ExplodeSupportTest.testArchiveWithImplodeCompression8K3Trees:61->testArchiveWithImplodeCompression:38
» ServiceConfiguration
  ExplodeSupportTest.testTikaTestArchive:66->testArchiveWithImplodeCompression:38 » ServiceConfiguration
  ExplodeSupportTest.testTikaTestStream:99->testZipStreamWithImplodeCompression:71 » ServiceConfiguration
  ExplodeSupportTest.testZipStreamWithImplodeCompression4K2Trees:89->testZipStreamWithImplodeCompression:71
» ServiceConfiguration
  ExplodeSupportTest.testZipStreamWithImplodeCompression8K3Trees:94->testZipStreamWithImplodeCompression:71
» ServiceConfiguration
  Maven221MultiVolumeTest.testRead7ZipMultiVolumeArchiveForStream:80 » ServiceConfiguration
  ParallelScatterZipCreatorTest.callableApi:76 » ServiceConfiguration sun.util.l...
  ParallelScatterZipCreatorTest.concurrent:60 » ServiceConfiguration sun.util.lo...
  ScatterSampleTest.testSample:39->createFile:55 » ServiceConfiguration sun.util...
  ScatterZipOutputStreamTest.putArchiveEntry:64 » ServiceConfiguration sun.util....
  UTF8ZipFilesTest.testASCIIFileRoundtripExplicitUnicodeExtra:64->testFileRoundtrip:249->createTestFile:265
» ServiceConfiguration
  UTF8ZipFilesTest.testASCIIFileRoundtripImplicitUnicodeExtra:88->testFileRoundtrip:249->createTestFile:265
» ServiceConfiguration
  UTF8ZipFilesTest.testCP437FileRoundtripExplicitUnicodeExtra:58->testFileRoundtrip:249->createTestFile:265
» ServiceConfiguration
  UTF8ZipFilesTest.testCP437FileRoundtripImplicitUnicodeExtra:82->testFileRoundtrip:249->createTestFile:265
» ServiceConfiguration
  UTF8ZipFilesTest.testRawNameReadFromStream:234 » ServiceConfiguration sun.util...
  UTF8ZipFilesTest.testRawNameReadFromZipFile:219 » ServiceConfiguration sun.uti...
  UTF8ZipFilesTest.testRead7ZipArchive:102 » ServiceConfiguration sun.util.local...
  UTF8ZipFilesTest.testRead7ZipArchiveForStream:118 » ServiceConfiguration sun.u...
  UTF8ZipFilesTest.testReadWinZipArchive:137 » ServiceConfiguration sun.util.loc...
  UTF8ZipFilesTest.testReadWinZipArchiveForStream:165 » ServiceConfiguration sun...
  UTF8ZipFilesTest.testUtf8FileRoundtripExplicitUnicodeExtra:46->testFileRoundtrip:249->createTestFile:265
» ServiceConfiguration
  UTF8ZipFilesTest.testUtf8FileRoundtripImplicitUnicodeExtra:70->testFileRoundtrip:249->createTestFile:265
» ServiceConfiguration
  UTF8ZipFilesTest.testUtf8FileRoundtripNoEFSExplicitUnicodeExtra:52->testFileRoundtrip:249->createTestFile:265
» ServiceConfiguration
  UTF8ZipFilesTest.testUtf8FileRoundtripNoEFSImplicitUnicodeExtra:76->testFileRoundtrip:249->createTestFile:265
» ServiceConfiguration
  UTF8ZipFilesTest.testUtf8Interoperability:392->testFile:340 » ServiceConfiguration
  UTF8ZipFilesTest.testZipArchiveInputStreamReadsUnicodeFields:202->createTestFile:265
» ServiceConfiguration
  UTF8ZipFilesTest.testZipFileReadsUnicodeFields:181->createTestFile:265 » ServiceConfiguration
  X5455_ExtendedTimestampTest.testBitsAreSetWithTime » NoClassDefFound Could not...
  X5455_ExtendedTimestampTest.testGetHeaderId » NoClassDefFound Could not initia...
  X5455_ExtendedTimestampTest.<clinit>:54 » ServiceConfiguration sun.util.locale...
  X5455_ExtendedTimestampTest.testMisc » NoClassDefFound Could not initialize cl...
  X5455_ExtendedTimestampTest.testParseReparse » NoClassDefFound Could not initi...
  X5455_ExtendedTimestampTest.testSampleFile » NoClassDefFound Could not initial...
  X5455_ExtendedTimestampTest.testWriteReadRoundtrip » NoClassDefFound Could not...
  X7875_NewUnixTest.testSampleFile:53 » ServiceConfiguration sun.util.locale.pro...
  ZipArchiveEntryTest.isUnixSymlinkIsFalseIfMoreThanOneFlagIsSet:278 » ServiceConfiguration
  ZipArchiveEntryTest.testCompressionMethod:213 » ServiceConfiguration sun.util....
  ZipArchiveInputStreamTest.properUseOfInflater:70 » ServiceConfiguration sun.ut...
  ZipArchiveInputStreamTest.shouldConsumeArchiveCompletely:94 » ServiceConfiguration
  ZipArchiveInputStreamTest.shouldReadNestedZip:114->extractZipInputStream:124 » ServiceConfiguration
  ZipArchiveInputStreamTest.testMessageWithCorruptFileName:185 » ServiceConfiguration
  ZipArchiveInputStreamTest.testOffsets:263 » ServiceConfiguration sun.util.loca...
  ZipArchiveInputStreamTest.testReadingOfFirstStoredEntry:170 » ServiceConfiguration
  ZipArchiveInputStreamTest.testUnshrinkEntry:137 » ServiceConfiguration sun.uti...
  ZipArchiveInputStreamTest.testUnzipBZip2CompressedEntry:200 » ServiceConfiguration
  ZipArchiveInputStreamTest.testWithBytesAfterData:222 » ServiceConfiguration su...
  ZipArchiveInputStreamTest.winzipBackSlashWorkaround:51 » ServiceConfiguration ...
  ZipFileTest.testCDOrder:59->readOrderTest:665 » ServiceConfiguration sun.util....
  ZipFileTest.testCDOrderInMemory:93 » ServiceConfiguration sun.util.locale.prov...
  ZipFileTest.testConcurrentReadFile:379 » ServiceConfiguration sun.util.locale....
  ZipFileTest.testConcurrentReadSeekable:349 » ServiceConfiguration sun.util.loc...
  ZipFileTest.testDelayedOffsetsAndSizes:430 » ServiceConfiguration sun.util.loc...
  ZipFileTest.testDoubleClose:151->readOrderTest:665 » ServiceConfiguration sun....
  ZipFileTest.testDuplicateEntry:268 » ServiceConfiguration sun.util.locale.prov...
  ZipFileTest.testEntryAlignment:470 » ServiceConfiguration sun.util.locale.prov...
  ZipFileTest.testEntryAlignmentExceed »  Unexpected exception, expected<java.la...
  ZipFileTest.testExcessDataInZip64ExtraField:288 » ServiceConfiguration sun.uti...
  ZipFileTest.testOffsets:412 » ServiceConfiguration sun.util.locale.provider.Lo...
  ZipFileTest.testPhysicalOrder:122->readOrderTest:665 » ServiceConfiguration su...
  ZipFileTest.testReadingOfFirstStoredEntry:324 » ServiceConfiguration sun.util....
  ZipFileTest.testReadingOfStoredEntry:168 » ServiceConfiguration sun.util.local...
  ZipFileTest.testSkipsPK00Prefix:217 » ServiceConfiguration sun.util.locale.pro...
  ZipFileTest.testUnixSymlinkSampleFile:246 » ServiceConfiguration sun.util.loca...
  ZipFileTest.testUnshrinking:297 » ServiceConfiguration sun.util.locale.provide...
  ZipFileTest.testUnzipBZip2CompressedEntry:334 » ServiceConfiguration sun.util....
  ZipFileTest.testWinzipBackSlashWorkaround:204 » ServiceConfiguration sun.util....
  ZipUtilTest.setUp:40 » ServiceConfiguration sun.util.locale.provider.LocaleDat...
  ZipUtilTest.setUp:40 » ServiceConfiguration sun.util.locale.provider.LocaleDat...
  ZipUtilTest.setUp:40 » ServiceConfiguration sun.util.locale.provider.LocaleDat...
  ZipUtilTest.setUp:40 » ServiceConfiguration sun.util.locale.provider.LocaleDat...
  ZipUtilTest.setUp:40 » ServiceConfiguration sun.util.locale.provider.LocaleDat...
  ZipUtilTest.setUp:40 » ServiceConfiguration sun.util.locale.provider.LocaleDat...
  ZipUtilTest.setUp:40 » ServiceConfiguration sun.util.locale.provider.LocaleDat...
  ZipUtilTest.setUp:40 » ServiceConfiguration sun.util.locale.provider.LocaleDat...
  ZipUtilTest.setUp:40 » ServiceConfiguration sun.util.locale.provider.LocaleDat...
  ZipUtilTest.setUp:40 » ServiceConfiguration sun.util.locale.provider.LocaleDat...
  ChangeSetTestCase.testAddAllreadyExistingWithReplaceFalse:1258->AbstractTestCase.createArchive:174
» ServiceConfiguration
  ChangeSetTestCase.testAddAllreadyExistingWithReplaceTrue:1213->AbstractTestCase.createArchive:174
» ServiceConfiguration
  ChangeSetTestCase.testAddToEmptyArchive:1068->AbstractTestCase.createEmptyArchive:235
» ServiceConfiguration
  ChangeSetTestCase.testDeleteAddToOneFileArchive:1114->AbstractTestCase.createSingleEntryArchive:262
» ServiceConfiguration
  ChangeSetTestCase.testDeleteFromAndAddToJar:929 » ServiceConfiguration sun.uti...
  ChangeSetTestCase.testDeleteFromAndAddToZip:550->AbstractTestCase.createArchive:174 »
ServiceConfiguration
  ChangeSetTestCase.testDeleteFromAndAddToZipUsingZipFilePerform:597->AbstractTestCase.createArchive:174
» ServiceConfiguration
  ChangeSetTestCase.testDeleteFromJar:835 » ServiceConfiguration sun.util.locale...
  ChangeSetTestCase.testDeleteFromZip:754 » ServiceConfiguration sun.util.locale...
  ChangeSetTestCase.testDeletePlusAddSame:367->AbstractTestCase.createArchive:174 » ServiceConfiguration
  Pack200TestCase.testJarArchiveCreationInMemory:98->jarArchiveCreation:115 » ServiceConfiguration
  Pack200TestCase.testJarArchiveCreationTempFile:103->jarArchiveCreation:115 » ServiceConfiguration
  Pack200TestCase.testJarUnarchiveAllFileArgInMemory:54->jarUnarchiveAll:77 » ServiceConfiguration
  Pack200TestCase.testJarUnarchiveAllFileTempFile:64->jarUnarchiveAll:77 » ServiceConfiguration
  Pack200TestCase.testJarUnarchiveAllInMemory:49->jarUnarchiveAll:77 » ServiceConfiguration
  Pack200TestCase.testJarUnarchiveAllTempFile:59->jarUnarchiveAll:77 » ServiceConfiguration
  Pack200UtilsTest.testNormalize:47 » ServiceConfiguration sun.util.locale.provi...
  Pack200UtilsTest.testNormalizeInPlace:93 » ServiceConfiguration sun.util.local...
  FramedSnappyCompressorInputStreamTest.readIWAFile:154 » ServiceConfiguration s...
  ZCompressorInputStreamTest.testFailsToCreateZCompressorInputStreamAndThrowsIOException »


Tests run: 838, Failures: 0, Errors: 162, Skipped: 4

[INFO] ------------------------------------------------------------------------
[INFO] BUILD FAILURE
[INFO] ------------------------------------------------------------------------
[INFO] Total time: 33.255 s
[INFO] Finished at: 2017-06-24T15:53:17Z
[INFO] Final Memory: 32M/108M
[INFO] ------------------------------------------------------------------------
[ERROR] Failed to execute goal org.apache.maven.plugins:maven-surefire-plugin:2.19.1:test
(default-test) on project commons-compress: There are test failures.
[ERROR] 
[ERROR] Please refer to <https://builds.apache.org/job/Commons-Compress%20JDK-Matrix%20Build/jdk=JDK%209%20b156%20(early%20access%20build)%20with%20project%20Jigsaw/ws/target/surefire-reports>
for the individual test results.
[ERROR] -> [Help 1]
[ERROR] 
[ERROR] To see the full stack trace of the errors, re-run Maven with the -e switch.
[ERROR] Re-run Maven using the -X switch to enable full debug logging.
[ERROR] 
[ERROR] For more information about the errors and possible solutions, please read the following
articles:
[ERROR] [Help 1] http://cwiki.apache.org/confluence/display/MAVEN/MojoFailureException
Build step 'Invoke top-level Maven targets' marked build as failure

Mime
View raw message