commons-issues mailing list archives

Site index · List index
Message view « Date » · « Thread »
Top « Date » · « Thread »
From "Pascal Schumacher (JIRA)" <j...@apache.org>
Subject [jira] [Closed] (IO-501) commons-io-2.4-src.zip and 2.5 fails test cases
Date Thu, 01 Dec 2016 20:55:58 GMT

     [ https://issues.apache.org/jira/browse/IO-501?page=com.atlassian.jira.plugin.system.issuetabpanels:all-tabpanel
]

Pascal Schumacher closed IO-501.
--------------------------------
    Resolution: Cannot Reproduce

I'm closing this as "Cannot Reproduce" after reading Joerg Schaibles comment. Please reopen
if you can supply additional information. Thanks!

> commons-io-2.4-src.zip and 2.5 fails test cases
> -----------------------------------------------
>
>                 Key: IO-501
>                 URL: https://issues.apache.org/jira/browse/IO-501
>             Project: Commons IO
>          Issue Type: Bug
>          Components: Filters
>    Affects Versions: 2.4
>            Reporter: Marc Pawlowsky
>            Priority: Minor
>
> Failed tests:   testCanRead(org.apache.commons.io.filefilter.FileFilterTestCase): Filter(File)
org.apache.commons.io.filefilter.AndFileFilter not true for /commons-io-2.4-src/test/io/read-only-file1.txt
expected:<true> but was:<false>
>   testCanWrite(org.apache.commons.io.filefilter.FileFilterTestCase): Filter(File) org.apache.commons.io.filefilter.CanWriteFileFilter
not false for /commons-io-2.4-src/test/io/read-only-file2.txt expected:<false> but was:<true>
>   testThrowsOnNullList(org.apache.commons.io.FileUtilsCleanDirectoryTestCase): expected
IOException
>   testThrowsOnCannotDeleteFile(org.apache.commons.io.FileUtilsCleanDirectoryTestCase):
expected IOException
> Tests run: 966, Failures: 4, Errors: 0, Skipped: 0
> [INFO] ------------------------------------------------------------------------
> [INFO] BUILD FAILURE
> [INFO] ------------------------------------------------------------------------
> [INFO] Total time: 01:32 min
> [INFO] Finished at: 2016-04-21T12:56:24-04:00
> [INFO] Final Memory: 17M/178M
> [INFO] ------------------------------------------------------------------------
> [ERROR] Failed to execute goal org.apache.maven.plugins:maven-surefire-plugin:2.12:test
(default-test) on project commons-io: There are test failures.
> [ERROR] 
> [ERROR] Please refer to /commons-io-2.4-src/target/surefire-reports for the individual
test results.
> [ERROR] -> [Help 1]
> [ERROR] 
> [ERROR] To see the full stack trace of the errors, re-run Maven with the -e switch.
> [ERROR] Re-run Maven using the -X switch to enable full debug logging.
> [ERROR] 
> [ERROR] For more information about the errors and possible solutions, please read the
following articles:
> [ERROR] [Help 1] http://cwiki.apache.org/confluence/display/MAVEN/MojoFailureException
> The command '/bin/sh -c cd commons-io-2.4-src && mvn install' returned a non-zero
code: 1
> Dockerfile
> FROM fedora:21
> RUN yum update -y
> RUN yum install -y java-1.8.0-openjdk unzip
> RUN yum install -y maven
> COPY commons-io-2.4-src.zip commons-io-2.4-src.zip
> RUN unzip commons-io-2.4-src.zip
> RUN cd commons-io-2.4-src && mvn initialize
> RUN cd commons-io-2.4-src && mvn test-compile
> RUN cd commons-io-2.4-src && mvn install
> RUN chmod -R 755 /root
> CMD /bin/bash
> ==
> Did a second run with commons-io.2,5
> Failed tests: 
>   FileUtilsCleanDirectoryTestCase.testThrowsOnNullList:109 expected IOException
>   FileUtilsCleanDirectoryTestCase.testThrowsOnCannotDeleteFile:129 expected IOException
>   FileFilterTestCase.testCanRead:984->assertFiltering:64 Filter(File) org.apache.commons.io.filefilter.AndFileFilter
not true for /root/commons-io-2.5-src/test/io/read-only-file1.txt expected:<true> but
was:<false>
>   FileFilterTestCase.testCanWrite:1005->assertFiltering:64 Filter(File) org.apache.commons.io.filefilter.CanWriteFileFilter
not false for /root/commons-io-2.5-src/test/io/read-only-file2.txt expected:<false>
but was:<true>
> Tests run: 1157, Failures: 4, Errors: 0, Skipped: 4
> Dockerfile contents
> FROM fedora:21
> RUN yum update -y
> RUN yum install -y java-1.8.0-openjdk unzip
> RUN yum install -y maven
> RUN yum install -y wget
> RUN cd /root && wget http://apache.parentingamerica.com//commons/io/source/commons-io-2.5-src.zip
> RUN cd /root && unzip commons-io-2.5-src.zip
> RUN cd /root && cd commons-io-2.5-src && mvn initialize
> RUN cd /root && cd commons-io-2.5-src && mvn test-compile
> RUN cd /root && cd commons-io-2.5-src && mvn install
> RUN chmod -R 755 /root
> CMD /bin/bash
> command: $docker build .
> ==
> Debian Jessie, JDK 7 also fails with code coming from trunk
> Failed tests: 
>   FileUtilsCleanDirectoryTestCase.testThrowsOnNullList:109 expected IOException
>   FileUtilsCleanDirectoryTestCase.testThrowsOnCannotDeleteFile:129 expected IOException
>   FileFilterTestCase.testCanRead:984->assertFiltering:64 Filter(File) org.apache.commons.io.filefilter.AndFileFilter
not true for /root/commons-io/test/io/read-only-file1.txt expected:<true> but was:<false>
>   FileFilterTestCase.testCanWrite:1005->assertFiltering:64 Filter(File) org.apache.commons.io.filefilter.CanWriteFileFilter
not false for /root/commons-io/test/io/read-only-file2.txt expected:<false> but was:<true>
> FROM debian:8.4
> CMD /bin/bash
> RUN apt-get update -y
> RUN apt-get install -y openjdk-7-jdk openjdk-7-jre unzip maven wget subversion
> RUN cd /root && svn checkout -r 1740549 http://svn.apache.org/repos/asf/commons/proper/io/trunk
/root/commons-io
> RUN cd /root/commons-io && mvn initialize
> RUN cd /root/commons-io && mvn test-compile
> RUN cd /root/commons-io && mvn install
> RUN chmod -R 755 /root
> ======================
> All the above are where the users home directory is NFS mounted.
> I retried 2.5-src on a machine where the home directory for the users was local and it
made no difference.
> Using Fedora23 in VirtualBox on Windows 7.



--
This message was sent by Atlassian JIRA
(v6.3.4#6332)

Mime
View raw message