commons-issues mailing list archives

Site index · List index
Message view « Date » · « Thread »
Top « Date » · « Thread »
From "Marc Pawlowsky (JIRA)" <j...@apache.org>
Subject [jira] [Updated] (BEANUTILS-487) commons-beanutils-1.9.2 fails unit tests cases when built in docker environment
Date Tue, 26 Apr 2016 14:36:12 GMT

     [ https://issues.apache.org/jira/browse/BEANUTILS-487?page=com.atlassian.jira.plugin.system.issuetabpanels:all-tabpanel ]

Marc Pawlowsky updated BEANUTILS-487:
-------------------------------------
    Affects Version/s: 1.9.2
          Environment: Docker, fedora21
             Priority: Major  (was: Minor)
          Description: 
$cat Dockerfile 
FROM fedora:21 
RUN yum update -y 
RUN yum install -y java-1.8.0-openjdk unzip maven wget
RUN wget http://apache.parentingamerica.com/commons/beanutils/source/commons-beanutils-1.9.2-src.zip
RUN unzip commons-beanutils-1.9.2-src.zip
RUN cd commons-beanutils-1.9.2-src && mvn initialize
RUN cd commons-beanutils-1.9.2-src && mvn install
RUN chmod -R 755 /root
CMD /bin/bash

$docker build .
<snip/>
-------------------------------------------------------
 T E S T S
-------------------------------------------------------
Running org.apache.commons.beanutils.bugs.Jira369TestCase
Tests run: 3, Failures: 0, Errors: 0, Skipped: 0, Time elapsed: 0.108 sec - in org.apache.commons.beanutils.bugs.Jira369TestCase
Running org.apache.commons.beanutils.bugs.Jira357TestCase
Tests run: 3, Failures: 0, Errors: 0, Skipped: 0, Time elapsed: 0.1 sec - in org.apache.commons.beanutils.bugs.Jira357TestCase
Running org.apache.commons.beanutils.bugs.Jira87TestCase
Tests run: 1, Failures: 0, Errors: 0, Skipped: 0, Time elapsed: 0.09 sec - in org.apache.commons.beanutils.bugs.Jira87TestCase
Running org.apache.commons.beanutils.bugs.Jira463TestCase
Tests run: 1, Failures: 0, Errors: 0, Skipped: 0, Time elapsed: 0.096 sec - in org.apache.commons.beanutils.bugs.Jira463TestCase
Running org.apache.commons.beanutils.bugs.Jira368TestCase
Tests run: 1, Failures: 0, Errors: 0, Skipped: 0, Time elapsed: 0.081 sec - in org.apache.commons.beanutils.bugs.Jira368TestCase
Running org.apache.commons.beanutils.bugs.Jira381TestCase
Tests run: 1, Failures: 0, Errors: 0, Skipped: 0, Time elapsed: 0.036 sec - in org.apache.commons.beanutils.bugs.Jira381TestCase
Running org.apache.commons.beanutils.bugs.Jira298TestCase
Tests run: 3, Failures: 0, Errors: 0, Skipped: 0, Time elapsed: 0.097 sec - in org.apache.commons.beanutils.bugs.Jira298TestCase
Running org.apache.commons.beanutils.bugs.Jira358TestCase
Tests run: 2, Failures: 0, Errors: 0, Skipped: 0, Time elapsed: 0.107 sec - in org.apache.commons.beanutils.bugs.Jira358TestCase
Running org.apache.commons.beanutils.bugs.Jira422TestCase
Tests run: 2, Failures: 2, Errors: 0, Skipped: 0, Time elapsed: 0.106 sec <<< FAILURE! - in org.apache.commons.beanutils.bugs.Jira422TestCase
testSecondChildBean(org.apache.commons.beanutils.bugs.Jira422TestCase)  Time elapsed: 0.091 sec  <<< FAILURE!
junit.framework.ComparisonFailure: expected:<...lang.String> but was:<...util.List>
	at junit.framework.Assert.assertEquals(Assert.java:81)
	at junit.framework.Assert.assertEquals(Assert.java:87)
	at org.apache.commons.beanutils.bugs.Jira422TestCase.testSecondChildBean(Jira422TestCase.java:42)

testRootBean(org.apache.commons.beanutils.bugs.Jira422TestCase)  Time elapsed: 0.002 sec  <<< FAILURE!
junit.framework.ComparisonFailure: expected:<...lang.String> but was:<...util.List>
	at junit.framework.Assert.assertEquals(Assert.java:81)
	at junit.framework.Assert.assertEquals(Assert.java:87)
	at org.apache.commons.beanutils.bugs.Jira422TestCase.testRootBean(Jira422TestCase.java:36)

Running org.apache.commons.beanutils.bugs.Jira411TestCase
Tests run: 1, Failures: 0, Errors: 0, Skipped: 0, Time elapsed: 0.094 sec - in org.apache.commons.beanutils.bugs.Jira411TestCase
Running org.apache.commons.beanutils.bugs.Jira157TestCase
Tests run: 3, Failures: 0, Errors: 0, Skipped: 0, Time elapsed: 0.091 sec - in org.apache.commons.beanutils.bugs.Jira157TestCase
Running org.apache.commons.beanutils.bugs.Jira61TestCase
Tests run: 16, Failures: 0, Errors: 0, Skipped: 0, Time elapsed: 0.106 sec - in org.apache.commons.beanutils.bugs.Jira61TestCase
Running org.apache.commons.beanutils.bugs.Jira345TestCase
Tests run: 2, Failures: 0, Errors: 0, Skipped: 0, Time elapsed: 0.088 sec - in org.apache.commons.beanutils.bugs.Jira345TestCase
Running org.apache.commons.beanutils.bugs.Jira339TestCase
Tests run: 2, Failures: 0, Errors: 0, Skipped: 0, Time elapsed: 0.096 sec - in org.apache.commons.beanutils.bugs.Jira339TestCase
Running org.apache.commons.beanutils.bugs.Jira92TestCase
Tests run: 1, Failures: 0, Errors: 0, Skipped: 0, Time elapsed: 0.108 sec - in org.apache.commons.beanutils.bugs.Jira92TestCase
Running org.apache.commons.beanutils.bugs.Jira454TestCase
Tests run: 1, Failures: 0, Errors: 0, Skipped: 0, Time elapsed: 0.092 sec - in org.apache.commons.beanutils.bugs.Jira454TestCase
Running org.apache.commons.beanutils.bugs.Jira359TestCase
Tests run: 4, Failures: 0, Errors: 0, Skipped: 0, Time elapsed: 0.089 sec - in org.apache.commons.beanutils.bugs.Jira359TestCase
Running org.apache.commons.beanutils.bugs.Jira456TestCase
Tests run: 2, Failures: 0, Errors: 0, Skipped: 0, Time elapsed: 0.065 sec - in org.apache.commons.beanutils.bugs.Jira456TestCase
Running org.apache.commons.beanutils.bugs.Jira18TestCase
Tests run: 12, Failures: 0, Errors: 0, Skipped: 0, Time elapsed: 0.096 sec - in org.apache.commons.beanutils.bugs.Jira18TestCase
Running org.apache.commons.beanutils.bugs.Jira458TestCase
Tests run: 2, Failures: 0, Errors: 0, Skipped: 0, Time elapsed: 0.049 sec - in org.apache.commons.beanutils.bugs.Jira458TestCase
Running org.apache.commons.beanutils.bugs.Jira347TestCase
Tests run: 1, Failures: 0, Errors: 0, Skipped: 0, Time elapsed: 2.466 sec - in org.apache.commons.beanutils.bugs.Jira347TestCase
Running org.apache.commons.beanutils.bugs.Jira273TestCase
Tests run: 6, Failures: 0, Errors: 0, Skipped: 0, Time elapsed: 0.098 sec - in org.apache.commons.beanutils.bugs.Jira273TestCase
Running org.apache.commons.beanutils.bugs.Jira349TestCase
Tests run: 1, Failures: 0, Errors: 0, Skipped: 0, Time elapsed: 0.096 sec - in org.apache.commons.beanutils.bugs.Jira349TestCase
Running org.apache.commons.beanutils.BeanificationTestCase
Tests run: 8, Failures: 0, Errors: 0, Skipped: 0, Time elapsed: 0.192 sec - in org.apache.commons.beanutils.BeanificationTestCase
Running org.apache.commons.beanutils.converters.FloatConverterTestCase
Tests run: 20, Failures: 0, Errors: 0, Skipped: 0, Time elapsed: 0.132 sec - in org.apache.commons.beanutils.converters.FloatConverterTestCase
Running org.apache.commons.beanutils.converters.FileConverterTestCase
Tests run: 2, Failures: 0, Errors: 0, Skipped: 0, Time elapsed: 0.034 sec - in org.apache.commons.beanutils.converters.FileConverterTestCase
Running org.apache.commons.beanutils.converters.StringArrayConverterTestCase
Tests run: 1, Failures: 0, Errors: 0, Skipped: 0, Time elapsed: 0.031 sec - in org.apache.commons.beanutils.converters.StringArrayConverterTestCase
Running org.apache.commons.beanutils.converters.DoubleConverterTestCase
Tests run: 19, Failures: 0, Errors: 0, Skipped: 0, Time elapsed: 0.123 sec - in org.apache.commons.beanutils.converters.DoubleConverterTestCase
Running org.apache.commons.beanutils.converters.CharacterConverterTestCase
Tests run: 6, Failures: 0, Errors: 0, Skipped: 0, Time elapsed: 0.038 sec - in org.apache.commons.beanutils.converters.CharacterConverterTestCase
Running org.apache.commons.beanutils.converters.IntegerConverterTestCase
Tests run: 21, Failures: 0, Errors: 0, Skipped: 0, Time elapsed: 0.112 sec - in org.apache.commons.beanutils.converters.IntegerConverterTestCase
Running org.apache.commons.beanutils.converters.StringConverterTestCase
Tests run: 3, Failures: 0, Errors: 0, Skipped: 0, Time elapsed: 0.034 sec - in org.apache.commons.beanutils.converters.StringConverterTestCase
Running org.apache.commons.beanutils.converters.URLConverterTestCase
Tests run: 2, Failures: 0, Errors: 0, Skipped: 0, Time elapsed: 0.082 sec - in org.apache.commons.beanutils.converters.URLConverterTestCase
Running org.apache.commons.beanutils.converters.DateConverterTestCase
Tests run: 11, Failures: 0, Errors: 0, Skipped: 0, Time elapsed: 0.099 sec - in org.apache.commons.beanutils.converters.DateConverterTestCase
Running org.apache.commons.beanutils.converters.SqlTimestampConverterTestCase
Tests run: 11, Failures: 0, Errors: 0, Skipped: 0, Time elapsed: 0.088 sec - in org.apache.commons.beanutils.converters.SqlTimestampConverterTestCase
Running org.apache.commons.beanutils.converters.ClassConverterTestCase
Tests run: 7, Failures: 0, Errors: 0, Skipped: 0, Time elapsed: 0.122 sec - in org.apache.commons.beanutils.converters.ClassConverterTestCase
Running org.apache.commons.beanutils.converters.BigIntegerConverterTestCase
Tests run: 19, Failures: 0, Errors: 0, Skipped: 0, Time elapsed: 0.121 sec - in org.apache.commons.beanutils.converters.BigIntegerConverterTestCase
Running org.apache.commons.beanutils.converters.ClassReloaderTestCase
Tests run: 1, Failures: 0, Errors: 0, Skipped: 0, Time elapsed: 0.019 sec - in org.apache.commons.beanutils.converters.ClassReloaderTestCase
Running org.apache.commons.beanutils.converters.ByteConverterTestCase
Tests run: 20, Failures: 0, Errors: 0, Skipped: 0, Time elapsed: 0.149 sec - in org.apache.commons.beanutils.converters.ByteConverterTestCase
Running org.apache.commons.beanutils.converters.BigDecimalConverterTestCase
Tests run: 19, Failures: 0, Errors: 0, Skipped: 0, Time elapsed: 0.118 sec - in org.apache.commons.beanutils.converters.BigDecimalConverterTestCase
Running org.apache.commons.beanutils.converters.CalendarConverterTestCase
Tests run: 11, Failures: 0, Errors: 0, Skipped: 0, Time elapsed: 0.098 sec - in org.apache.commons.beanutils.converters.CalendarConverterTestCase
Running org.apache.commons.beanutils.converters.BooleanConverterTestCase
Tests run: 7, Failures: 0, Errors: 0, Skipped: 0, Time elapsed: 0.038 sec - in org.apache.commons.beanutils.converters.BooleanConverterTestCase
Running org.apache.commons.beanutils.converters.ShortConverterTestCase
Tests run: 20, Failures: 0, Errors: 0, Skipped: 0, Time elapsed: 0.129 sec - in org.apache.commons.beanutils.converters.ShortConverterTestCase
Running org.apache.commons.beanutils.converters.LongConverterTestCase
Tests run: 19, Failures: 0, Errors: 0, Skipped: 0, Time elapsed: 0.113 sec - in org.apache.commons.beanutils.converters.LongConverterTestCase
Running org.apache.commons.beanutils.converters.BooleanArrayConverterTestCase
Tests run: 9, Failures: 0, Errors: 0, Skipped: 0, Time elapsed: 0.074 sec - in org.apache.commons.beanutils.converters.BooleanArrayConverterTestCase
Running org.apache.commons.beanutils.converters.ArrayConverterTestCase
Tests run: 7, Failures: 0, Errors: 0, Skipped: 0, Time elapsed: 0.071 sec - in org.apache.commons.beanutils.converters.ArrayConverterTestCase
Running org.apache.commons.beanutils.converters.SqlTimeConverterTestCase
Tests run: 11, Failures: 0, Errors: 0, Skipped: 0, Time elapsed: 0.092 sec - in org.apache.commons.beanutils.converters.SqlTimeConverterTestCase
Running org.apache.commons.beanutils.converters.SqlDateConverterTestCase
Tests run: 12, Failures: 0, Errors: 0, Skipped: 0, Time elapsed: 0.091 sec - in org.apache.commons.beanutils.converters.SqlDateConverterTestCase
Running org.apache.commons.beanutils.LazyDynaBeanTestCase
Tests run: 16, Failures: 0, Errors: 0, Skipped: 0, Time elapsed: 0.085 sec - in org.apache.commons.beanutils.LazyDynaBeanTestCase
Running org.apache.commons.beanutils.locale.converters.BaseLocaleConverterTestCase
Tests run: 1, Failures: 0, Errors: 0, Skipped: 0, Time elapsed: 0.015 sec - in org.apache.commons.beanutils.locale.converters.BaseLocaleConverterTestCase
Running org.apache.commons.beanutils.locale.converters.DoubleLocaleConverterTestCase
Tests run: 10, Failures: 0, Errors: 0, Skipped: 0, Time elapsed: 0.071 sec - in org.apache.commons.beanutils.locale.converters.DoubleLocaleConverterTestCase
Running org.apache.commons.beanutils.locale.converters.BigDecimalLocaleConverterTestCase
Tests run: 10, Failures: 0, Errors: 0, Skipped: 0, Time elapsed: 0.071 sec - in org.apache.commons.beanutils.locale.converters.BigDecimalLocaleConverterTestCase
Running org.apache.commons.beanutils.locale.converters.IntegerLocaleConverterTestCase
Tests run: 12, Failures: 0, Errors: 0, Skipped: 0, Time elapsed: 0.076 sec - in org.apache.commons.beanutils.locale.converters.IntegerLocaleConverterTestCase
Running org.apache.commons.beanutils.locale.converters.LongLocaleConverterTestCase
Tests run: 10, Failures: 0, Errors: 0, Skipped: 0, Time elapsed: 0.063 sec - in org.apache.commons.beanutils.locale.converters.LongLocaleConverterTestCase
Running org.apache.commons.beanutils.locale.converters.FloatLocaleConverterTestCase
Tests run: 12, Failures: 0, Errors: 0, Skipped: 0, Time elapsed: 0.167 sec - in org.apache.commons.beanutils.locale.converters.FloatLocaleConverterTestCase
Running org.apache.commons.beanutils.locale.converters.BigIntegerLocaleConverterTestCase
Tests run: 11, Failures: 0, Errors: 0, Skipped: 0, Time elapsed: 0.061 sec - in org.apache.commons.beanutils.locale.converters.BigIntegerLocaleConverterTestCase
Running org.apache.commons.beanutils.locale.converters.ShortLocaleConverterTestCase
Tests run: 10, Failures: 0, Errors: 0, Skipped: 0, Time elapsed: 0.061 sec - in org.apache.commons.beanutils.locale.converters.ShortLocaleConverterTestCase
Running org.apache.commons.beanutils.locale.converters.ByteLocaleConverterTestCase
Tests run: 10, Failures: 0, Errors: 0, Skipped: 0, Time elapsed: 0.064 sec - in org.apache.commons.beanutils.locale.converters.ByteLocaleConverterTestCase
Running org.apache.commons.beanutils.locale.converters.DateLocaleConverterTestCase
Tests run: 14, Failures: 0, Errors: 0, Skipped: 0, Time elapsed: 0.233 sec - in org.apache.commons.beanutils.locale.converters.DateLocaleConverterTestCase
Running org.apache.commons.beanutils.locale.LocaleBeanUtilsTestCase
Tests run: 2, Failures: 0, Errors: 0, Skipped: 0, Time elapsed: 0.13 sec - in org.apache.commons.beanutils.locale.LocaleBeanUtilsTestCase
Running org.apache.commons.beanutils.locale.LocaleBeanificationTestCase
Tests run: 9, Failures: 0, Errors: 0, Skipped: 0, Time elapsed: 0.426 sec - in org.apache.commons.beanutils.locale.LocaleBeanificationTestCase
Running org.apache.commons.beanutils.locale.LocaleConvertUtilsTestCase
Tests run: 6, Failures: 0, Errors: 0, Skipped: 0, Time elapsed: 0.129 sec - in org.apache.commons.beanutils.locale.LocaleConvertUtilsTestCase
Running org.apache.commons.beanutils.BeanMapTestCase
Tests run: 132, Failures: 0, Errors: 0, Skipped: 0, Time elapsed: 0.243 sec - in org.apache.commons.beanutils.BeanMapTestCase
Running org.apache.commons.beanutils.PropertyUtilsTestCase
Tests run: 116, Failures: 0, Errors: 0, Skipped: 0, Time elapsed: 0.632 sec - in org.apache.commons.beanutils.PropertyUtilsTestCase
Running org.apache.commons.beanutils.BeanIntrospectionDataTestCase
Tests run: 4, Failures: 0, Errors: 0, Skipped: 0, Time elapsed: 0.093 sec - in org.apache.commons.beanutils.BeanIntrospectionDataTestCase
Running org.apache.commons.beanutils.LazyDynaMapTestCase
Tests run: 17, Failures: 0, Errors: 0, Skipped: 0, Time elapsed: 0.085 sec - in org.apache.commons.beanutils.LazyDynaMapTestCase
Running org.apache.commons.beanutils.LazyDynaListTestCase
Tests run: 15, Failures: 0, Errors: 0, Skipped: 0, Time elapsed: 0.168 sec - in org.apache.commons.beanutils.LazyDynaListTestCase
Running org.apache.commons.beanutils.DynaPropertyTestCase
Tests run: 2, Failures: 0, Errors: 0, Skipped: 0, Time elapsed: 0.017 sec - in org.apache.commons.beanutils.DynaPropertyTestCase
Running org.apache.commons.beanutils.BeanUtilsTestCase
Tests run: 55, Failures: 0, Errors: 0, Skipped: 0, Time elapsed: 0.281 sec - in org.apache.commons.beanutils.BeanUtilsTestCase
Running org.apache.commons.beanutils.FluentPropertyBeanIntrospectorTestCase
Tests run: 2, Failures: 0, Errors: 0, Skipped: 0, Time elapsed: 0.072 sec - in org.apache.commons.beanutils.FluentPropertyBeanIntrospectorTestCase
Running org.apache.commons.beanutils.SuppressPropertiesBeanIntrospectorTestCase
Tests run: 4, Failures: 0, Errors: 0, Skipped: 0, Time elapsed: 0.021 sec - in org.apache.commons.beanutils.SuppressPropertiesBeanIntrospectorTestCase
Running org.apache.commons.beanutils.BeanToPropertyValueTransformerTestCase
Tests run: 17, Failures: 0, Errors: 0, Skipped: 0, Time elapsed: 0.112 sec - in org.apache.commons.beanutils.BeanToPropertyValueTransformerTestCase
Running org.apache.commons.beanutils.MethodUtilsTestCase
Tests run: 32, Failures: 0, Errors: 0, Skipped: 0, Time elapsed: 0.056 sec - in org.apache.commons.beanutils.MethodUtilsTestCase
Running org.apache.commons.beanutils.MappedPropertyTestCase
Tests run: 17, Failures: 0, Errors: 0, Skipped: 0, Time elapsed: 0.103 sec - in org.apache.commons.beanutils.MappedPropertyTestCase
Running org.apache.commons.beanutils.memoryleaktests.MemoryLeakTestCase
Tests run: 8, Failures: 0, Errors: 0, Skipped: 0, Time elapsed: 10.573 sec - in org.apache.commons.beanutils.memoryleaktests.MemoryLeakTestCase
Running org.apache.commons.beanutils.DynaResultSetTestCase
Tests run: 7, Failures: 0, Errors: 0, Skipped: 0, Time elapsed: 0.089 sec - in org.apache.commons.beanutils.DynaResultSetTestCase
Running org.apache.commons.beanutils.ConvertUtilsTestCase
Tests run: 13, Failures: 0, Errors: 0, Skipped: 0, Time elapsed: 0.141 sec - in org.apache.commons.beanutils.ConvertUtilsTestCase
Running org.apache.commons.beanutils.LazyDynaClassTestCase
Tests run: 15, Failures: 0, Errors: 0, Skipped: 0, Time elapsed: 0.023 sec - in org.apache.commons.beanutils.LazyDynaClassTestCase
Running org.apache.commons.beanutils.BeanPropertyValueEqualsPredicateTestCase
Tests run: 17, Failures: 0, Errors: 0, Skipped: 0, Time elapsed: 0.118 sec - in org.apache.commons.beanutils.BeanPropertyValueEqualsPredicateTestCase
Running org.apache.commons.beanutils.BasicDynaBeanTestCase
Tests run: 35, Failures: 0, Errors: 0, Skipped: 0, Time elapsed: 0.074 sec - in org.apache.commons.beanutils.BasicDynaBeanTestCase
Running org.apache.commons.beanutils.DynaRowSetTestCase
Tests run: 9, Failures: 0, Errors: 0, Skipped: 0, Time elapsed: 0.086 sec - in org.apache.commons.beanutils.DynaRowSetTestCase
Running org.apache.commons.beanutils.DynaBeanUtilsTestCase
Tests run: 29, Failures: 0, Errors: 0, Skipped: 0, Time elapsed: 0.167 sec - in org.apache.commons.beanutils.DynaBeanUtilsTestCase
Running org.apache.commons.beanutils.DynaBeanMapDecoratorTestCase
Tests run: 13, Failures: 0, Errors: 0, Skipped: 0, Time elapsed: 0.025 sec - in org.apache.commons.beanutils.DynaBeanMapDecoratorTestCase
Running org.apache.commons.beanutils.ConstructorUtilsTestCase
Tests run: 11, Failures: 0, Errors: 0, Skipped: 0, Time elapsed: 0.02 sec - in org.apache.commons.beanutils.ConstructorUtilsTestCase
Running org.apache.commons.beanutils.WrapDynaBeanTestCase
Tests run: 43, Failures: 0, Errors: 0, Skipped: 0, Time elapsed: 0.161 sec - in org.apache.commons.beanutils.WrapDynaBeanTestCase
Running org.apache.commons.beanutils.expression.DefaultResolverTestCase
Tests run: 7, Failures: 0, Errors: 0, Skipped: 0, Time elapsed: 0.018 sec - in org.apache.commons.beanutils.expression.DefaultResolverTestCase
Running org.apache.commons.beanutils.DynaPropertyUtilsTestCase
Tests run: 55, Failures: 0, Errors: 0, Skipped: 0, Time elapsed: 0.127 sec - in org.apache.commons.beanutils.DynaPropertyUtilsTestCase
Running org.apache.commons.beanutils.BeanPropertyValueChangeClosureTestCase
Tests run: 26, Failures: 0, Errors: 0, Skipped: 0, Time elapsed: 0.112 sec - in org.apache.commons.beanutils.BeanPropertyValueChangeClosureTestCase
Running org.apache.commons.beanutils.DefaultIntrospectionContextTestCase
Tests run: 9, Failures: 0, Errors: 0, Skipped: 0, Time elapsed: 0.026 sec - in org.apache.commons.beanutils.DefaultIntrospectionContextTestCase
Running org.apache.commons.beanutils.BeanComparatorTestCase
Tests run: 8, Failures: 0, Errors: 0, Skipped: 0, Time elapsed: 0.111 sec - in org.apache.commons.beanutils.BeanComparatorTestCase
Running org.apache.commons.beanutils.BeanUtils2TestCase
Tests run: 55, Failures: 0, Errors: 0, Skipped: 0, Time elapsed: 0.353 sec - in org.apache.commons.beanutils.BeanUtils2TestCase
Running org.apache.commons.beanutils.IndexedPropertyTestCase
Tests run: 29, Failures: 9, Errors: 0, Skipped: 0, Time elapsed: 0.159 sec <<< FAILURE! - in org.apache.commons.beanutils.IndexedPropertyTestCase
testListReadMethod(org.apache.commons.beanutils.IndexedPropertyTestCase)  Time elapsed: 0.005 sec  <<< FAILURE!
junit.framework.AssertionFailedError: Threw exception java.lang.ClassCastException: java.beans.PropertyDescriptor cannot be cast to java.beans.IndexedPropertyDescriptor
	at junit.framework.Assert.fail(Assert.java:47)
	at org.apache.commons.beanutils.IndexedPropertyTestCase.testListReadMethod(IndexedPropertyTestCase.java:256)

testListWriteMethod(org.apache.commons.beanutils.IndexedPropertyTestCase)  Time elapsed: 0.003 sec  <<< FAILURE!
junit.framework.AssertionFailedError: Threw exception java.lang.ClassCastException: java.beans.PropertyDescriptor cannot be cast to java.beans.IndexedPropertyDescriptor
	at junit.framework.Assert.fail(Assert.java:47)
	at org.apache.commons.beanutils.IndexedPropertyTestCase.testListWriteMethod(IndexedPropertyTestCase.java:274)

testListIndexedReadMethod(org.apache.commons.beanutils.IndexedPropertyTestCase)  Time elapsed: 0.002 sec  <<< FAILURE!
junit.framework.AssertionFailedError: Threw exception java.lang.ClassCastException: java.beans.PropertyDescriptor cannot be cast to java.beans.IndexedPropertyDescriptor
	at junit.framework.Assert.fail(Assert.java:47)
	at org.apache.commons.beanutils.IndexedPropertyTestCase.testListIndexedReadMethod(IndexedPropertyTestCase.java:288)

testListIndexedWriteMethod(org.apache.commons.beanutils.IndexedPropertyTestCase)  Time elapsed: 0.002 sec  <<< FAILURE!
junit.framework.AssertionFailedError: Threw exception java.lang.ClassCastException: java.beans.PropertyDescriptor cannot be cast to java.beans.IndexedPropertyDescriptor
	at junit.framework.Assert.fail(Assert.java:47)
	at org.apache.commons.beanutils.IndexedPropertyTestCase.testListIndexedWriteMethod(IndexedPropertyTestCase.java:302)

testArrayListReadMethod(org.apache.commons.beanutils.IndexedPropertyTestCase)  Time elapsed: 0.001 sec  <<< FAILURE!
junit.framework.AssertionFailedError: Threw exception java.lang.ClassCastException: java.beans.PropertyDescriptor cannot be cast to java.beans.IndexedPropertyDescriptor
	at junit.framework.Assert.fail(Assert.java:47)
	at org.apache.commons.beanutils.IndexedPropertyTestCase.testArrayListReadMethod(IndexedPropertyTestCase.java:316)

testArrayListWriteMethod(org.apache.commons.beanutils.IndexedPropertyTestCase)  Time elapsed: 0.002 sec  <<< FAILURE!
junit.framework.AssertionFailedError: Threw exception java.lang.ClassCastException: java.beans.PropertyDescriptor cannot be cast to java.beans.IndexedPropertyDescriptor
	at junit.framework.Assert.fail(Assert.java:47)
	at org.apache.commons.beanutils.IndexedPropertyTestCase.testArrayListWriteMethod(IndexedPropertyTestCase.java:330)

testSetListItemA(org.apache.commons.beanutils.IndexedPropertyTestCase)  Time elapsed: 0.002 sec  <<< FAILURE!
junit.framework.AssertionFailedError: Threw exception org.apache.commons.beanutils.ConversionException: Default conversion to List failed.
	at junit.framework.Assert.fail(Assert.java:47)
	at org.apache.commons.beanutils.IndexedPropertyTestCase.testSetListItemA(IndexedPropertyTestCase.java:535)

testListIndexedPropertyDescriptor(org.apache.commons.beanutils.IndexedPropertyTestCase)  Time elapsed: 0.002 sec  <<< FAILURE!
junit.framework.AssertionFailedError: Not IndexedPropertyDescriptor expected:<class java.beans.IndexedPropertyDescriptor> but was:<class java.beans.PropertyDescriptor>
	at junit.framework.Assert.fail(Assert.java:47)
	at junit.framework.Assert.failNotEquals(Assert.java:282)
	at junit.framework.Assert.assertEquals(Assert.java:64)
	at org.apache.commons.beanutils.IndexedPropertyTestCase.testListIndexedPropertyDescriptor(IndexedPropertyTestCase.java:156)

testArrayListIndexedPropertyDescriptor(org.apache.commons.beanutils.IndexedPropertyTestCase)  Time elapsed: 0.001 sec  <<< FAILURE!
junit.framework.AssertionFailedError: Not IndexedPropertyDescriptor expected:<class java.beans.IndexedPropertyDescriptor> but was:<class java.beans.PropertyDescriptor>
	at junit.framework.Assert.fail(Assert.java:47)
	at junit.framework.Assert.failNotEquals(Assert.java:282)
	at junit.framework.Assert.assertEquals(Assert.java:64)
	at org.apache.commons.beanutils.IndexedPropertyTestCase.testArrayListIndexedPropertyDescriptor(IndexedPropertyTestCase.java:175)

Running org.apache.commons.beanutils.BeanPredicateTestCase
Tests run: 4, Failures: 0, Errors: 0, Skipped: 0, Time elapsed: 0.099 sec - in org.apache.commons.beanutils.BeanPredicateTestCase

Results :

Failed tests: 
  org.apache.commons.beanutils.bugs.Jira422TestCase#testSecondChildBean ComparisonFailure
  org.apache.commons.beanutils.bugs.Jira422TestCase#testRootBean ComparisonFailure
  org.apache.commons.beanutils.IndexedPropertyTestCase#testListReadMethod AssertionFailedError
  org.apache.commons.beanutils.IndexedPropertyTestCase#testListWriteMethod AssertionFailedError
  org.apache.commons.beanutils.IndexedPropertyTestCase#testListIndexedReadMethod AssertionFailedError
  org.apache.commons.beanutils.IndexedPropertyTestCase#testListIndexedWriteMethod AssertionFailedError
  org.apache.commons.beanutils.IndexedPropertyTestCase#testArrayListReadMethod AssertionFailedError
  org.apache.commons.beanutils.IndexedPropertyTestCase#testArrayListWriteMethod AssertionFailedError
  org.apache.commons.beanutils.IndexedPropertyTestCase#testSetListItemA AssertionFailedError
  org.apache.commons.beanutils.IndexedPropertyTestCase#testListIndexedPropertyDescriptor AssertionFailedError
  org.apache.commons.beanutils.IndexedPropertyTestCase#testArrayListIndexedPropertyDescriptor AssertionFailedError

Tests run: 1276, Failures: 11, Errors: 0, Skipped: 0

[INFO] ------------------------------------------------------------------------
[INFO] BUILD FAILURE
[INFO] ------------------------------------------------------------------------
[INFO] Total time: 01:24 min
[INFO] Finished at: 2016-04-26T10:25:31-04:00
[INFO] Final Memory: 22M/280M
[INFO] ------------------------------------------------------------------------
[ERROR] Failed to execute goal org.apache.maven.plugins:maven-surefire-plugin:2.16:test (default-test) on project commons-beanutils: There are test failures.
[ERROR] 
[ERROR] Please refer to /commons-beanutils-1.9.2-src/target/surefire-reports for the individual test results.
[ERROR] -> [Help 1]
[ERROR] 
[ERROR] To see the full stack trace of the errors, re-run Maven with the -e switch.
[ERROR] Re-run Maven using the -X switch to enable full debug logging.
[ERROR] 
[ERROR] For more information about the errors and possible solutions, please read the following articles:
[ERROR] [Help 1] http://cwiki.apache.org/confluence/display/MAVEN/MojoFailureException
The command '/bin/sh -c cd commons-beanutils-1.9.2-src && mvn install' returned a non-zero code: 1

              Summary: commons-beanutils-1.9.2 fails unit tests cases when built in docker environment  (was: pwd)

Please try to reproduce using Dockerfile provided

> commons-beanutils-1.9.2 fails unit tests cases when built in docker environment
> -------------------------------------------------------------------------------
>
>                 Key: BEANUTILS-487
>                 URL: https://issues.apache.org/jira/browse/BEANUTILS-487
>             Project: Commons BeanUtils
>          Issue Type: Bug
>    Affects Versions: 1.9.2
>         Environment: Docker, fedora21
>            Reporter: Marc Pawlowsky
>
> $cat Dockerfile 
> FROM fedora:21 
> RUN yum update -y 
> RUN yum install -y java-1.8.0-openjdk unzip maven wget
> RUN wget http://apache.parentingamerica.com/commons/beanutils/source/commons-beanutils-1.9.2-src.zip
> RUN unzip commons-beanutils-1.9.2-src.zip
> RUN cd commons-beanutils-1.9.2-src && mvn initialize
> RUN cd commons-beanutils-1.9.2-src && mvn install
> RUN chmod -R 755 /root
> CMD /bin/bash
> $docker build .
> <snip/>
> -------------------------------------------------------
>  T E S T S
> -------------------------------------------------------
> Running org.apache.commons.beanutils.bugs.Jira369TestCase
> Tests run: 3, Failures: 0, Errors: 0, Skipped: 0, Time elapsed: 0.108 sec - in org.apache.commons.beanutils.bugs.Jira369TestCase
> Running org.apache.commons.beanutils.bugs.Jira357TestCase
> Tests run: 3, Failures: 0, Errors: 0, Skipped: 0, Time elapsed: 0.1 sec - in org.apache.commons.beanutils.bugs.Jira357TestCase
> Running org.apache.commons.beanutils.bugs.Jira87TestCase
> Tests run: 1, Failures: 0, Errors: 0, Skipped: 0, Time elapsed: 0.09 sec - in org.apache.commons.beanutils.bugs.Jira87TestCase
> Running org.apache.commons.beanutils.bugs.Jira463TestCase
> Tests run: 1, Failures: 0, Errors: 0, Skipped: 0, Time elapsed: 0.096 sec - in org.apache.commons.beanutils.bugs.Jira463TestCase
> Running org.apache.commons.beanutils.bugs.Jira368TestCase
> Tests run: 1, Failures: 0, Errors: 0, Skipped: 0, Time elapsed: 0.081 sec - in org.apache.commons.beanutils.bugs.Jira368TestCase
> Running org.apache.commons.beanutils.bugs.Jira381TestCase
> Tests run: 1, Failures: 0, Errors: 0, Skipped: 0, Time elapsed: 0.036 sec - in org.apache.commons.beanutils.bugs.Jira381TestCase
> Running org.apache.commons.beanutils.bugs.Jira298TestCase
> Tests run: 3, Failures: 0, Errors: 0, Skipped: 0, Time elapsed: 0.097 sec - in org.apache.commons.beanutils.bugs.Jira298TestCase
> Running org.apache.commons.beanutils.bugs.Jira358TestCase
> Tests run: 2, Failures: 0, Errors: 0, Skipped: 0, Time elapsed: 0.107 sec - in org.apache.commons.beanutils.bugs.Jira358TestCase
> Running org.apache.commons.beanutils.bugs.Jira422TestCase
> Tests run: 2, Failures: 2, Errors: 0, Skipped: 0, Time elapsed: 0.106 sec <<< FAILURE! - in org.apache.commons.beanutils.bugs.Jira422TestCase
> testSecondChildBean(org.apache.commons.beanutils.bugs.Jira422TestCase)  Time elapsed: 0.091 sec  <<< FAILURE!
> junit.framework.ComparisonFailure: expected:<...lang.String> but was:<...util.List>
> 	at junit.framework.Assert.assertEquals(Assert.java:81)
> 	at junit.framework.Assert.assertEquals(Assert.java:87)
> 	at org.apache.commons.beanutils.bugs.Jira422TestCase.testSecondChildBean(Jira422TestCase.java:42)
> testRootBean(org.apache.commons.beanutils.bugs.Jira422TestCase)  Time elapsed: 0.002 sec  <<< FAILURE!
> junit.framework.ComparisonFailure: expected:<...lang.String> but was:<...util.List>
> 	at junit.framework.Assert.assertEquals(Assert.java:81)
> 	at junit.framework.Assert.assertEquals(Assert.java:87)
> 	at org.apache.commons.beanutils.bugs.Jira422TestCase.testRootBean(Jira422TestCase.java:36)
> Running org.apache.commons.beanutils.bugs.Jira411TestCase
> Tests run: 1, Failures: 0, Errors: 0, Skipped: 0, Time elapsed: 0.094 sec - in org.apache.commons.beanutils.bugs.Jira411TestCase
> Running org.apache.commons.beanutils.bugs.Jira157TestCase
> Tests run: 3, Failures: 0, Errors: 0, Skipped: 0, Time elapsed: 0.091 sec - in org.apache.commons.beanutils.bugs.Jira157TestCase
> Running org.apache.commons.beanutils.bugs.Jira61TestCase
> Tests run: 16, Failures: 0, Errors: 0, Skipped: 0, Time elapsed: 0.106 sec - in org.apache.commons.beanutils.bugs.Jira61TestCase
> Running org.apache.commons.beanutils.bugs.Jira345TestCase
> Tests run: 2, Failures: 0, Errors: 0, Skipped: 0, Time elapsed: 0.088 sec - in org.apache.commons.beanutils.bugs.Jira345TestCase
> Running org.apache.commons.beanutils.bugs.Jira339TestCase
> Tests run: 2, Failures: 0, Errors: 0, Skipped: 0, Time elapsed: 0.096 sec - in org.apache.commons.beanutils.bugs.Jira339TestCase
> Running org.apache.commons.beanutils.bugs.Jira92TestCase
> Tests run: 1, Failures: 0, Errors: 0, Skipped: 0, Time elapsed: 0.108 sec - in org.apache.commons.beanutils.bugs.Jira92TestCase
> Running org.apache.commons.beanutils.bugs.Jira454TestCase
> Tests run: 1, Failures: 0, Errors: 0, Skipped: 0, Time elapsed: 0.092 sec - in org.apache.commons.beanutils.bugs.Jira454TestCase
> Running org.apache.commons.beanutils.bugs.Jira359TestCase
> Tests run: 4, Failures: 0, Errors: 0, Skipped: 0, Time elapsed: 0.089 sec - in org.apache.commons.beanutils.bugs.Jira359TestCase
> Running org.apache.commons.beanutils.bugs.Jira456TestCase
> Tests run: 2, Failures: 0, Errors: 0, Skipped: 0, Time elapsed: 0.065 sec - in org.apache.commons.beanutils.bugs.Jira456TestCase
> Running org.apache.commons.beanutils.bugs.Jira18TestCase
> Tests run: 12, Failures: 0, Errors: 0, Skipped: 0, Time elapsed: 0.096 sec - in org.apache.commons.beanutils.bugs.Jira18TestCase
> Running org.apache.commons.beanutils.bugs.Jira458TestCase
> Tests run: 2, Failures: 0, Errors: 0, Skipped: 0, Time elapsed: 0.049 sec - in org.apache.commons.beanutils.bugs.Jira458TestCase
> Running org.apache.commons.beanutils.bugs.Jira347TestCase
> Tests run: 1, Failures: 0, Errors: 0, Skipped: 0, Time elapsed: 2.466 sec - in org.apache.commons.beanutils.bugs.Jira347TestCase
> Running org.apache.commons.beanutils.bugs.Jira273TestCase
> Tests run: 6, Failures: 0, Errors: 0, Skipped: 0, Time elapsed: 0.098 sec - in org.apache.commons.beanutils.bugs.Jira273TestCase
> Running org.apache.commons.beanutils.bugs.Jira349TestCase
> Tests run: 1, Failures: 0, Errors: 0, Skipped: 0, Time elapsed: 0.096 sec - in org.apache.commons.beanutils.bugs.Jira349TestCase
> Running org.apache.commons.beanutils.BeanificationTestCase
> Tests run: 8, Failures: 0, Errors: 0, Skipped: 0, Time elapsed: 0.192 sec - in org.apache.commons.beanutils.BeanificationTestCase
> Running org.apache.commons.beanutils.converters.FloatConverterTestCase
> Tests run: 20, Failures: 0, Errors: 0, Skipped: 0, Time elapsed: 0.132 sec - in org.apache.commons.beanutils.converters.FloatConverterTestCase
> Running org.apache.commons.beanutils.converters.FileConverterTestCase
> Tests run: 2, Failures: 0, Errors: 0, Skipped: 0, Time elapsed: 0.034 sec - in org.apache.commons.beanutils.converters.FileConverterTestCase
> Running org.apache.commons.beanutils.converters.StringArrayConverterTestCase
> Tests run: 1, Failures: 0, Errors: 0, Skipped: 0, Time elapsed: 0.031 sec - in org.apache.commons.beanutils.converters.StringArrayConverterTestCase
> Running org.apache.commons.beanutils.converters.DoubleConverterTestCase
> Tests run: 19, Failures: 0, Errors: 0, Skipped: 0, Time elapsed: 0.123 sec - in org.apache.commons.beanutils.converters.DoubleConverterTestCase
> Running org.apache.commons.beanutils.converters.CharacterConverterTestCase
> Tests run: 6, Failures: 0, Errors: 0, Skipped: 0, Time elapsed: 0.038 sec - in org.apache.commons.beanutils.converters.CharacterConverterTestCase
> Running org.apache.commons.beanutils.converters.IntegerConverterTestCase
> Tests run: 21, Failures: 0, Errors: 0, Skipped: 0, Time elapsed: 0.112 sec - in org.apache.commons.beanutils.converters.IntegerConverterTestCase
> Running org.apache.commons.beanutils.converters.StringConverterTestCase
> Tests run: 3, Failures: 0, Errors: 0, Skipped: 0, Time elapsed: 0.034 sec - in org.apache.commons.beanutils.converters.StringConverterTestCase
> Running org.apache.commons.beanutils.converters.URLConverterTestCase
> Tests run: 2, Failures: 0, Errors: 0, Skipped: 0, Time elapsed: 0.082 sec - in org.apache.commons.beanutils.converters.URLConverterTestCase
> Running org.apache.commons.beanutils.converters.DateConverterTestCase
> Tests run: 11, Failures: 0, Errors: 0, Skipped: 0, Time elapsed: 0.099 sec - in org.apache.commons.beanutils.converters.DateConverterTestCase
> Running org.apache.commons.beanutils.converters.SqlTimestampConverterTestCase
> Tests run: 11, Failures: 0, Errors: 0, Skipped: 0, Time elapsed: 0.088 sec - in org.apache.commons.beanutils.converters.SqlTimestampConverterTestCase
> Running org.apache.commons.beanutils.converters.ClassConverterTestCase
> Tests run: 7, Failures: 0, Errors: 0, Skipped: 0, Time elapsed: 0.122 sec - in org.apache.commons.beanutils.converters.ClassConverterTestCase
> Running org.apache.commons.beanutils.converters.BigIntegerConverterTestCase
> Tests run: 19, Failures: 0, Errors: 0, Skipped: 0, Time elapsed: 0.121 sec - in org.apache.commons.beanutils.converters.BigIntegerConverterTestCase
> Running org.apache.commons.beanutils.converters.ClassReloaderTestCase
> Tests run: 1, Failures: 0, Errors: 0, Skipped: 0, Time elapsed: 0.019 sec - in org.apache.commons.beanutils.converters.ClassReloaderTestCase
> Running org.apache.commons.beanutils.converters.ByteConverterTestCase
> Tests run: 20, Failures: 0, Errors: 0, Skipped: 0, Time elapsed: 0.149 sec - in org.apache.commons.beanutils.converters.ByteConverterTestCase
> Running org.apache.commons.beanutils.converters.BigDecimalConverterTestCase
> Tests run: 19, Failures: 0, Errors: 0, Skipped: 0, Time elapsed: 0.118 sec - in org.apache.commons.beanutils.converters.BigDecimalConverterTestCase
> Running org.apache.commons.beanutils.converters.CalendarConverterTestCase
> Tests run: 11, Failures: 0, Errors: 0, Skipped: 0, Time elapsed: 0.098 sec - in org.apache.commons.beanutils.converters.CalendarConverterTestCase
> Running org.apache.commons.beanutils.converters.BooleanConverterTestCase
> Tests run: 7, Failures: 0, Errors: 0, Skipped: 0, Time elapsed: 0.038 sec - in org.apache.commons.beanutils.converters.BooleanConverterTestCase
> Running org.apache.commons.beanutils.converters.ShortConverterTestCase
> Tests run: 20, Failures: 0, Errors: 0, Skipped: 0, Time elapsed: 0.129 sec - in org.apache.commons.beanutils.converters.ShortConverterTestCase
> Running org.apache.commons.beanutils.converters.LongConverterTestCase
> Tests run: 19, Failures: 0, Errors: 0, Skipped: 0, Time elapsed: 0.113 sec - in org.apache.commons.beanutils.converters.LongConverterTestCase
> Running org.apache.commons.beanutils.converters.BooleanArrayConverterTestCase
> Tests run: 9, Failures: 0, Errors: 0, Skipped: 0, Time elapsed: 0.074 sec - in org.apache.commons.beanutils.converters.BooleanArrayConverterTestCase
> Running org.apache.commons.beanutils.converters.ArrayConverterTestCase
> Tests run: 7, Failures: 0, Errors: 0, Skipped: 0, Time elapsed: 0.071 sec - in org.apache.commons.beanutils.converters.ArrayConverterTestCase
> Running org.apache.commons.beanutils.converters.SqlTimeConverterTestCase
> Tests run: 11, Failures: 0, Errors: 0, Skipped: 0, Time elapsed: 0.092 sec - in org.apache.commons.beanutils.converters.SqlTimeConverterTestCase
> Running org.apache.commons.beanutils.converters.SqlDateConverterTestCase
> Tests run: 12, Failures: 0, Errors: 0, Skipped: 0, Time elapsed: 0.091 sec - in org.apache.commons.beanutils.converters.SqlDateConverterTestCase
> Running org.apache.commons.beanutils.LazyDynaBeanTestCase
> Tests run: 16, Failures: 0, Errors: 0, Skipped: 0, Time elapsed: 0.085 sec - in org.apache.commons.beanutils.LazyDynaBeanTestCase
> Running org.apache.commons.beanutils.locale.converters.BaseLocaleConverterTestCase
> Tests run: 1, Failures: 0, Errors: 0, Skipped: 0, Time elapsed: 0.015 sec - in org.apache.commons.beanutils.locale.converters.BaseLocaleConverterTestCase
> Running org.apache.commons.beanutils.locale.converters.DoubleLocaleConverterTestCase
> Tests run: 10, Failures: 0, Errors: 0, Skipped: 0, Time elapsed: 0.071 sec - in org.apache.commons.beanutils.locale.converters.DoubleLocaleConverterTestCase
> Running org.apache.commons.beanutils.locale.converters.BigDecimalLocaleConverterTestCase
> Tests run: 10, Failures: 0, Errors: 0, Skipped: 0, Time elapsed: 0.071 sec - in org.apache.commons.beanutils.locale.converters.BigDecimalLocaleConverterTestCase
> Running org.apache.commons.beanutils.locale.converters.IntegerLocaleConverterTestCase
> Tests run: 12, Failures: 0, Errors: 0, Skipped: 0, Time elapsed: 0.076 sec - in org.apache.commons.beanutils.locale.converters.IntegerLocaleConverterTestCase
> Running org.apache.commons.beanutils.locale.converters.LongLocaleConverterTestCase
> Tests run: 10, Failures: 0, Errors: 0, Skipped: 0, Time elapsed: 0.063 sec - in org.apache.commons.beanutils.locale.converters.LongLocaleConverterTestCase
> Running org.apache.commons.beanutils.locale.converters.FloatLocaleConverterTestCase
> Tests run: 12, Failures: 0, Errors: 0, Skipped: 0, Time elapsed: 0.167 sec - in org.apache.commons.beanutils.locale.converters.FloatLocaleConverterTestCase
> Running org.apache.commons.beanutils.locale.converters.BigIntegerLocaleConverterTestCase
> Tests run: 11, Failures: 0, Errors: 0, Skipped: 0, Time elapsed: 0.061 sec - in org.apache.commons.beanutils.locale.converters.BigIntegerLocaleConverterTestCase
> Running org.apache.commons.beanutils.locale.converters.ShortLocaleConverterTestCase
> Tests run: 10, Failures: 0, Errors: 0, Skipped: 0, Time elapsed: 0.061 sec - in org.apache.commons.beanutils.locale.converters.ShortLocaleConverterTestCase
> Running org.apache.commons.beanutils.locale.converters.ByteLocaleConverterTestCase
> Tests run: 10, Failures: 0, Errors: 0, Skipped: 0, Time elapsed: 0.064 sec - in org.apache.commons.beanutils.locale.converters.ByteLocaleConverterTestCase
> Running org.apache.commons.beanutils.locale.converters.DateLocaleConverterTestCase
> Tests run: 14, Failures: 0, Errors: 0, Skipped: 0, Time elapsed: 0.233 sec - in org.apache.commons.beanutils.locale.converters.DateLocaleConverterTestCase
> Running org.apache.commons.beanutils.locale.LocaleBeanUtilsTestCase
> Tests run: 2, Failures: 0, Errors: 0, Skipped: 0, Time elapsed: 0.13 sec - in org.apache.commons.beanutils.locale.LocaleBeanUtilsTestCase
> Running org.apache.commons.beanutils.locale.LocaleBeanificationTestCase
> Tests run: 9, Failures: 0, Errors: 0, Skipped: 0, Time elapsed: 0.426 sec - in org.apache.commons.beanutils.locale.LocaleBeanificationTestCase
> Running org.apache.commons.beanutils.locale.LocaleConvertUtilsTestCase
> Tests run: 6, Failures: 0, Errors: 0, Skipped: 0, Time elapsed: 0.129 sec - in org.apache.commons.beanutils.locale.LocaleConvertUtilsTestCase
> Running org.apache.commons.beanutils.BeanMapTestCase
> Tests run: 132, Failures: 0, Errors: 0, Skipped: 0, Time elapsed: 0.243 sec - in org.apache.commons.beanutils.BeanMapTestCase
> Running org.apache.commons.beanutils.PropertyUtilsTestCase
> Tests run: 116, Failures: 0, Errors: 0, Skipped: 0, Time elapsed: 0.632 sec - in org.apache.commons.beanutils.PropertyUtilsTestCase
> Running org.apache.commons.beanutils.BeanIntrospectionDataTestCase
> Tests run: 4, Failures: 0, Errors: 0, Skipped: 0, Time elapsed: 0.093 sec - in org.apache.commons.beanutils.BeanIntrospectionDataTestCase
> Running org.apache.commons.beanutils.LazyDynaMapTestCase
> Tests run: 17, Failures: 0, Errors: 0, Skipped: 0, Time elapsed: 0.085 sec - in org.apache.commons.beanutils.LazyDynaMapTestCase
> Running org.apache.commons.beanutils.LazyDynaListTestCase
> Tests run: 15, Failures: 0, Errors: 0, Skipped: 0, Time elapsed: 0.168 sec - in org.apache.commons.beanutils.LazyDynaListTestCase
> Running org.apache.commons.beanutils.DynaPropertyTestCase
> Tests run: 2, Failures: 0, Errors: 0, Skipped: 0, Time elapsed: 0.017 sec - in org.apache.commons.beanutils.DynaPropertyTestCase
> Running org.apache.commons.beanutils.BeanUtilsTestCase
> Tests run: 55, Failures: 0, Errors: 0, Skipped: 0, Time elapsed: 0.281 sec - in org.apache.commons.beanutils.BeanUtilsTestCase
> Running org.apache.commons.beanutils.FluentPropertyBeanIntrospectorTestCase
> Tests run: 2, Failures: 0, Errors: 0, Skipped: 0, Time elapsed: 0.072 sec - in org.apache.commons.beanutils.FluentPropertyBeanIntrospectorTestCase
> Running org.apache.commons.beanutils.SuppressPropertiesBeanIntrospectorTestCase
> Tests run: 4, Failures: 0, Errors: 0, Skipped: 0, Time elapsed: 0.021 sec - in org.apache.commons.beanutils.SuppressPropertiesBeanIntrospectorTestCase
> Running org.apache.commons.beanutils.BeanToPropertyValueTransformerTestCase
> Tests run: 17, Failures: 0, Errors: 0, Skipped: 0, Time elapsed: 0.112 sec - in org.apache.commons.beanutils.BeanToPropertyValueTransformerTestCase
> Running org.apache.commons.beanutils.MethodUtilsTestCase
> Tests run: 32, Failures: 0, Errors: 0, Skipped: 0, Time elapsed: 0.056 sec - in org.apache.commons.beanutils.MethodUtilsTestCase
> Running org.apache.commons.beanutils.MappedPropertyTestCase
> Tests run: 17, Failures: 0, Errors: 0, Skipped: 0, Time elapsed: 0.103 sec - in org.apache.commons.beanutils.MappedPropertyTestCase
> Running org.apache.commons.beanutils.memoryleaktests.MemoryLeakTestCase
> Tests run: 8, Failures: 0, Errors: 0, Skipped: 0, Time elapsed: 10.573 sec - in org.apache.commons.beanutils.memoryleaktests.MemoryLeakTestCase
> Running org.apache.commons.beanutils.DynaResultSetTestCase
> Tests run: 7, Failures: 0, Errors: 0, Skipped: 0, Time elapsed: 0.089 sec - in org.apache.commons.beanutils.DynaResultSetTestCase
> Running org.apache.commons.beanutils.ConvertUtilsTestCase
> Tests run: 13, Failures: 0, Errors: 0, Skipped: 0, Time elapsed: 0.141 sec - in org.apache.commons.beanutils.ConvertUtilsTestCase
> Running org.apache.commons.beanutils.LazyDynaClassTestCase
> Tests run: 15, Failures: 0, Errors: 0, Skipped: 0, Time elapsed: 0.023 sec - in org.apache.commons.beanutils.LazyDynaClassTestCase
> Running org.apache.commons.beanutils.BeanPropertyValueEqualsPredicateTestCase
> Tests run: 17, Failures: 0, Errors: 0, Skipped: 0, Time elapsed: 0.118 sec - in org.apache.commons.beanutils.BeanPropertyValueEqualsPredicateTestCase
> Running org.apache.commons.beanutils.BasicDynaBeanTestCase
> Tests run: 35, Failures: 0, Errors: 0, Skipped: 0, Time elapsed: 0.074 sec - in org.apache.commons.beanutils.BasicDynaBeanTestCase
> Running org.apache.commons.beanutils.DynaRowSetTestCase
> Tests run: 9, Failures: 0, Errors: 0, Skipped: 0, Time elapsed: 0.086 sec - in org.apache.commons.beanutils.DynaRowSetTestCase
> Running org.apache.commons.beanutils.DynaBeanUtilsTestCase
> Tests run: 29, Failures: 0, Errors: 0, Skipped: 0, Time elapsed: 0.167 sec - in org.apache.commons.beanutils.DynaBeanUtilsTestCase
> Running org.apache.commons.beanutils.DynaBeanMapDecoratorTestCase
> Tests run: 13, Failures: 0, Errors: 0, Skipped: 0, Time elapsed: 0.025 sec - in org.apache.commons.beanutils.DynaBeanMapDecoratorTestCase
> Running org.apache.commons.beanutils.ConstructorUtilsTestCase
> Tests run: 11, Failures: 0, Errors: 0, Skipped: 0, Time elapsed: 0.02 sec - in org.apache.commons.beanutils.ConstructorUtilsTestCase
> Running org.apache.commons.beanutils.WrapDynaBeanTestCase
> Tests run: 43, Failures: 0, Errors: 0, Skipped: 0, Time elapsed: 0.161 sec - in org.apache.commons.beanutils.WrapDynaBeanTestCase
> Running org.apache.commons.beanutils.expression.DefaultResolverTestCase
> Tests run: 7, Failures: 0, Errors: 0, Skipped: 0, Time elapsed: 0.018 sec - in org.apache.commons.beanutils.expression.DefaultResolverTestCase
> Running org.apache.commons.beanutils.DynaPropertyUtilsTestCase
> Tests run: 55, Failures: 0, Errors: 0, Skipped: 0, Time elapsed: 0.127 sec - in org.apache.commons.beanutils.DynaPropertyUtilsTestCase
> Running org.apache.commons.beanutils.BeanPropertyValueChangeClosureTestCase
> Tests run: 26, Failures: 0, Errors: 0, Skipped: 0, Time elapsed: 0.112 sec - in org.apache.commons.beanutils.BeanPropertyValueChangeClosureTestCase
> Running org.apache.commons.beanutils.DefaultIntrospectionContextTestCase
> Tests run: 9, Failures: 0, Errors: 0, Skipped: 0, Time elapsed: 0.026 sec - in org.apache.commons.beanutils.DefaultIntrospectionContextTestCase
> Running org.apache.commons.beanutils.BeanComparatorTestCase
> Tests run: 8, Failures: 0, Errors: 0, Skipped: 0, Time elapsed: 0.111 sec - in org.apache.commons.beanutils.BeanComparatorTestCase
> Running org.apache.commons.beanutils.BeanUtils2TestCase
> Tests run: 55, Failures: 0, Errors: 0, Skipped: 0, Time elapsed: 0.353 sec - in org.apache.commons.beanutils.BeanUtils2TestCase
> Running org.apache.commons.beanutils.IndexedPropertyTestCase
> Tests run: 29, Failures: 9, Errors: 0, Skipped: 0, Time elapsed: 0.159 sec <<< FAILURE! - in org.apache.commons.beanutils.IndexedPropertyTestCase
> testListReadMethod(org.apache.commons.beanutils.IndexedPropertyTestCase)  Time elapsed: 0.005 sec  <<< FAILURE!
> junit.framework.AssertionFailedError: Threw exception java.lang.ClassCastException: java.beans.PropertyDescriptor cannot be cast to java.beans.IndexedPropertyDescriptor
> 	at junit.framework.Assert.fail(Assert.java:47)
> 	at org.apache.commons.beanutils.IndexedPropertyTestCase.testListReadMethod(IndexedPropertyTestCase.java:256)
> testListWriteMethod(org.apache.commons.beanutils.IndexedPropertyTestCase)  Time elapsed: 0.003 sec  <<< FAILURE!
> junit.framework.AssertionFailedError: Threw exception java.lang.ClassCastException: java.beans.PropertyDescriptor cannot be cast to java.beans.IndexedPropertyDescriptor
> 	at junit.framework.Assert.fail(Assert.java:47)
> 	at org.apache.commons.beanutils.IndexedPropertyTestCase.testListWriteMethod(IndexedPropertyTestCase.java:274)
> testListIndexedReadMethod(org.apache.commons.beanutils.IndexedPropertyTestCase)  Time elapsed: 0.002 sec  <<< FAILURE!
> junit.framework.AssertionFailedError: Threw exception java.lang.ClassCastException: java.beans.PropertyDescriptor cannot be cast to java.beans.IndexedPropertyDescriptor
> 	at junit.framework.Assert.fail(Assert.java:47)
> 	at org.apache.commons.beanutils.IndexedPropertyTestCase.testListIndexedReadMethod(IndexedPropertyTestCase.java:288)
> testListIndexedWriteMethod(org.apache.commons.beanutils.IndexedPropertyTestCase)  Time elapsed: 0.002 sec  <<< FAILURE!
> junit.framework.AssertionFailedError: Threw exception java.lang.ClassCastException: java.beans.PropertyDescriptor cannot be cast to java.beans.IndexedPropertyDescriptor
> 	at junit.framework.Assert.fail(Assert.java:47)
> 	at org.apache.commons.beanutils.IndexedPropertyTestCase.testListIndexedWriteMethod(IndexedPropertyTestCase.java:302)
> testArrayListReadMethod(org.apache.commons.beanutils.IndexedPropertyTestCase)  Time elapsed: 0.001 sec  <<< FAILURE!
> junit.framework.AssertionFailedError: Threw exception java.lang.ClassCastException: java.beans.PropertyDescriptor cannot be cast to java.beans.IndexedPropertyDescriptor
> 	at junit.framework.Assert.fail(Assert.java:47)
> 	at org.apache.commons.beanutils.IndexedPropertyTestCase.testArrayListReadMethod(IndexedPropertyTestCase.java:316)
> testArrayListWriteMethod(org.apache.commons.beanutils.IndexedPropertyTestCase)  Time elapsed: 0.002 sec  <<< FAILURE!
> junit.framework.AssertionFailedError: Threw exception java.lang.ClassCastException: java.beans.PropertyDescriptor cannot be cast to java.beans.IndexedPropertyDescriptor
> 	at junit.framework.Assert.fail(Assert.java:47)
> 	at org.apache.commons.beanutils.IndexedPropertyTestCase.testArrayListWriteMethod(IndexedPropertyTestCase.java:330)
> testSetListItemA(org.apache.commons.beanutils.IndexedPropertyTestCase)  Time elapsed: 0.002 sec  <<< FAILURE!
> junit.framework.AssertionFailedError: Threw exception org.apache.commons.beanutils.ConversionException: Default conversion to List failed.
> 	at junit.framework.Assert.fail(Assert.java:47)
> 	at org.apache.commons.beanutils.IndexedPropertyTestCase.testSetListItemA(IndexedPropertyTestCase.java:535)
> testListIndexedPropertyDescriptor(org.apache.commons.beanutils.IndexedPropertyTestCase)  Time elapsed: 0.002 sec  <<< FAILURE!
> junit.framework.AssertionFailedError: Not IndexedPropertyDescriptor expected:<class java.beans.IndexedPropertyDescriptor> but was:<class java.beans.PropertyDescriptor>
> 	at junit.framework.Assert.fail(Assert.java:47)
> 	at junit.framework.Assert.failNotEquals(Assert.java:282)
> 	at junit.framework.Assert.assertEquals(Assert.java:64)
> 	at org.apache.commons.beanutils.IndexedPropertyTestCase.testListIndexedPropertyDescriptor(IndexedPropertyTestCase.java:156)
> testArrayListIndexedPropertyDescriptor(org.apache.commons.beanutils.IndexedPropertyTestCase)  Time elapsed: 0.001 sec  <<< FAILURE!
> junit.framework.AssertionFailedError: Not IndexedPropertyDescriptor expected:<class java.beans.IndexedPropertyDescriptor> but was:<class java.beans.PropertyDescriptor>
> 	at junit.framework.Assert.fail(Assert.java:47)
> 	at junit.framework.Assert.failNotEquals(Assert.java:282)
> 	at junit.framework.Assert.assertEquals(Assert.java:64)
> 	at org.apache.commons.beanutils.IndexedPropertyTestCase.testArrayListIndexedPropertyDescriptor(IndexedPropertyTestCase.java:175)
> Running org.apache.commons.beanutils.BeanPredicateTestCase
> Tests run: 4, Failures: 0, Errors: 0, Skipped: 0, Time elapsed: 0.099 sec - in org.apache.commons.beanutils.BeanPredicateTestCase
> Results :
> Failed tests: 
>   org.apache.commons.beanutils.bugs.Jira422TestCase#testSecondChildBean ComparisonFailure
>   org.apache.commons.beanutils.bugs.Jira422TestCase#testRootBean ComparisonFailure
>   org.apache.commons.beanutils.IndexedPropertyTestCase#testListReadMethod AssertionFailedError
>   org.apache.commons.beanutils.IndexedPropertyTestCase#testListWriteMethod AssertionFailedError
>   org.apache.commons.beanutils.IndexedPropertyTestCase#testListIndexedReadMethod AssertionFailedError
>   org.apache.commons.beanutils.IndexedPropertyTestCase#testListIndexedWriteMethod AssertionFailedError
>   org.apache.commons.beanutils.IndexedPropertyTestCase#testArrayListReadMethod AssertionFailedError
>   org.apache.commons.beanutils.IndexedPropertyTestCase#testArrayListWriteMethod AssertionFailedError
>   org.apache.commons.beanutils.IndexedPropertyTestCase#testSetListItemA AssertionFailedError
>   org.apache.commons.beanutils.IndexedPropertyTestCase#testListIndexedPropertyDescriptor AssertionFailedError
>   org.apache.commons.beanutils.IndexedPropertyTestCase#testArrayListIndexedPropertyDescriptor AssertionFailedError
> Tests run: 1276, Failures: 11, Errors: 0, Skipped: 0
> [INFO] ------------------------------------------------------------------------
> [INFO] BUILD FAILURE
> [INFO] ------------------------------------------------------------------------
> [INFO] Total time: 01:24 min
> [INFO] Finished at: 2016-04-26T10:25:31-04:00
> [INFO] Final Memory: 22M/280M
> [INFO] ------------------------------------------------------------------------
> [ERROR] Failed to execute goal org.apache.maven.plugins:maven-surefire-plugin:2.16:test (default-test) on project commons-beanutils: There are test failures.
> [ERROR] 
> [ERROR] Please refer to /commons-beanutils-1.9.2-src/target/surefire-reports for the individual test results.
> [ERROR] -> [Help 1]
> [ERROR] 
> [ERROR] To see the full stack trace of the errors, re-run Maven with the -e switch.
> [ERROR] Re-run Maven using the -X switch to enable full debug logging.
> [ERROR] 
> [ERROR] For more information about the errors and possible solutions, please read the following articles:
> [ERROR] [Help 1] http://cwiki.apache.org/confluence/display/MAVEN/MojoFailureException
> The command '/bin/sh -c cd commons-beanutils-1.9.2-src && mvn install' returned a non-zero code: 1



--
This message was sent by Atlassian JIRA
(v6.3.4#6332)

Mime
View raw message