commons-issues mailing list archives

Site index · List index
Message view « Date » · « Thread »
Top « Date » · « Thread »
From "Gary Gregory (JIRA)" <j...@apache.org>
Subject [jira] [Commented] (IO-501) commons-io-2.4-src.zip fails test cases
Date Thu, 21 Apr 2016 17:30:25 GMT

    [ https://issues.apache.org/jira/browse/IO-501?page=com.atlassian.jira.plugin.system.issuetabpanels:comment-tabpanel&focusedCommentId=15252281#comment-15252281
] 

Gary Gregory commented on IO-501:
---------------------------------

[~marcpawl@gmail.com]

Are these failures consistent from one run to the next?

Can you reproduce this with the latest from trunk?

Thank you,
Gary

> commons-io-2.4-src.zip fails test cases
> ---------------------------------------
>
>                 Key: IO-501
>                 URL: https://issues.apache.org/jira/browse/IO-501
>             Project: Commons IO
>          Issue Type: Bug
>          Components: Filters
>    Affects Versions: 2.4
>            Reporter: Marc Pawlowsky
>            Priority: Minor
>
> Failed tests:   testCanRead(org.apache.commons.io.filefilter.FileFilterTestCase): Filter(File)
org.apache.commons.io.filefilter.AndFileFilter not true for /commons-io-2.4-src/test/io/read-only-file1.txt
expected:<true> but was:<false>
>   testCanWrite(org.apache.commons.io.filefilter.FileFilterTestCase): Filter(File) org.apache.commons.io.filefilter.CanWriteFileFilter
not false for /commons-io-2.4-src/test/io/read-only-file2.txt expected:<false> but was:<true>
>   testThrowsOnNullList(org.apache.commons.io.FileUtilsCleanDirectoryTestCase): expected
IOException
>   testThrowsOnCannotDeleteFile(org.apache.commons.io.FileUtilsCleanDirectoryTestCase):
expected IOException
> Tests run: 966, Failures: 4, Errors: 0, Skipped: 0
> [INFO] ------------------------------------------------------------------------
> [INFO] BUILD FAILURE
> [INFO] ------------------------------------------------------------------------
> [INFO] Total time: 01:32 min
> [INFO] Finished at: 2016-04-21T12:56:24-04:00
> [INFO] Final Memory: 17M/178M
> [INFO] ------------------------------------------------------------------------
> [ERROR] Failed to execute goal org.apache.maven.plugins:maven-surefire-plugin:2.12:test
(default-test) on project commons-io: There are test failures.
> [ERROR] 
> [ERROR] Please refer to /commons-io-2.4-src/target/surefire-reports for the individual
test results.
> [ERROR] -> [Help 1]
> [ERROR] 
> [ERROR] To see the full stack trace of the errors, re-run Maven with the -e switch.
> [ERROR] Re-run Maven using the -X switch to enable full debug logging.
> [ERROR] 
> [ERROR] For more information about the errors and possible solutions, please read the
following articles:
> [ERROR] [Help 1] http://cwiki.apache.org/confluence/display/MAVEN/MojoFailureException
> The command '/bin/sh -c cd commons-io-2.4-src && mvn install' returned a non-zero
code: 1
> Dockerfile
> FROM fedora:21
> RUN yum update -y
> RUN yum install -y java-1.8.0-openjdk unzip
> RUN yum install -y maven
> COPY commons-io-2.4-src.zip commons-io-2.4-src.zip
> RUN unzip commons-io-2.4-src.zip
> RUN cd commons-io-2.4-src && mvn initialize
> RUN cd commons-io-2.4-src && mvn test-compile
> RUN cd commons-io-2.4-src && mvn install
> RUN chmod -R 755 /root
> CMD /bin/bash



--
This message was sent by Atlassian JIRA
(v6.3.4#6332)

Mime
View raw message