commons-issues mailing list archives

Site index · List index
Message view « Date » · « Thread »
Top « Date » · « Thread »
From "Joerg Schaible (JIRA)" <j...@apache.org>
Subject [jira] [Comment Edited] (IO-501) commons-io-2.4-src.zip and 2.5 fails test cases
Date Fri, 22 Apr 2016 19:13:13 GMT

    [ https://issues.apache.org/jira/browse/IO-501?page=com.atlassian.jira.plugin.system.issuetabpanels:comment-tabpanel&focusedCommentId=15252652#comment-15252652
] 

Joerg Schaible edited comment on IO-501 at 4/22/16 7:12 PM:
------------------------------------------------------------

Works for me. Downloaded commons-io-2.4-src.zip from Apache. Unzipped archive and started
Maven from archive root with

{noformat}
$ unzip commons-io-2.4-src.zip
$ cd commons-io-2.4-src
$ mvn -version
Apache Maven 3.3.9 (bb52d8502b132ec0a5a3f4c09453c07478323dc5; 2015-11-10T17:41:47+01:00)
Maven home: /usr/share/maven-bin-3.3
Java version: 1.8.0_77, vendor: Oracle Corporation
Java home: /opt/icedtea-bin-3.0.0/jre
Default locale: en_US, platform encoding: UTF-8
OS name: "linux", version: "4.1.15-gentoo-r1", arch: "amd64", family: "unix"
$ mvn package
[...]
Results :

Tests run: 966, Failures: 0, Errors: 0, Skipped: 0

[INFO] 
[INFO] --- maven-jar-plugin:2.4:jar (default-jar) @ commons-io ---
[INFO] Building jar: /home/joehni/tmp/download/commons-io-2.4-src/target/commons-io-2.4.jar
[INFO] 
[INFO] --- maven-site-plugin:3.0:attach-descriptor (attach-descriptor) @ commons-io ---
[INFO] ------------------------------------------------------------------------
[INFO] BUILD SUCCESS
[INFO] ------------------------------------------------------------------------
[INFO] Total time: 01:50 min
[INFO] Finished at: 2016-04-21T22:28:35+02:00
[INFO] Final Memory: 31M/234M
[INFO] ------------------------------------------------------------------------
{noformat}

So, it is not OpenJDK 8, it's not Linux in general nor is it the original zipped archive.

Actually I tested commons-io 2.4 befor voting for the release. I used the tarball of the sources
and built it with each JDK of my zoo. This includes the Oracle versions 6-9, IBM 6+7, and
OpenJDK 6+7 (8 is new). All tests passed for every JDK (except IBM 6 with known UTF-16 problems):
http://article.gmane.org/gmane.comp.jakarta.commons.devel/130600



was (Author: joehni):
Works for me. Downloaded commons-io-2.4-src.zip from Apache. Unzipped archive and started
Maven from archive root with

{noformat}
$ unzip commons-io-2.4-src.zip
$ cd commons-io-2.4-src
$ mvn -version
Apache Maven 3.3.9 (bb52d8502b132ec0a5a3f4c09453c07478323dc5; 2015-11-10T17:41:47+01:00)
Maven home: /usr/share/maven-bin-3.3
Java version: 1.8.0_77, vendor: Oracle Corporation
Java home: /opt/icedtea-bin-3.0.0/jre
Default locale: en_US, platform encoding: UTF-8
OS name: "linux", version: "4.1.15-gentoo-r1", arch: "amd64", family: "unix"
$ mvn package
[...]
Results :

Tests run: 966, Failures: 0, Errors: 0, Skipped: 0

[INFO] 
[INFO] --- maven-jar-plugin:2.4:jar (default-jar) @ commons-io ---
[INFO] Building jar: /home/joehni/tmp/download/commons-io-2.4-src/target/commons-io-2.4.jar
[INFO] 
[INFO] --- maven-site-plugin:3.0:attach-descriptor (attach-descriptor) @ commons-io ---
[INFO] ------------------------------------------------------------------------
[INFO] BUILD SUCCESS
[INFO] ------------------------------------------------------------------------
[INFO] Total time: 01:50 min
[INFO] Finished at: 2016-04-21T22:28:35+02:00
[INFO] Final Memory: 31M/234M
[INFO] ------------------------------------------------------------------------
{noformat}

So, it is not OpenJDK 8, it's not Linux in general nor is it the original zipped archive.

Actually I tested commons-io 2.4 befor voting fot the release. I used the tarball of the sources
and built it with each JDK of my zoo. This includes the Oracle versions 6-9, IBM 6+7, and
OpenJDK 6+7 (8 is new). All tests passed for every JDK (except IBM 6 with known UTF-16 problems):
http://article.gmane.org/gmane.comp.jakarta.commons.devel/130600

> commons-io-2.4-src.zip and 2.5 fails test cases
> -----------------------------------------------
>
>                 Key: IO-501
>                 URL: https://issues.apache.org/jira/browse/IO-501
>             Project: Commons IO
>          Issue Type: Bug
>          Components: Filters
>    Affects Versions: 2.4
>            Reporter: Marc Pawlowsky
>            Priority: Minor
>
> Failed tests:   testCanRead(org.apache.commons.io.filefilter.FileFilterTestCase): Filter(File)
org.apache.commons.io.filefilter.AndFileFilter not true for /commons-io-2.4-src/test/io/read-only-file1.txt
expected:<true> but was:<false>
>   testCanWrite(org.apache.commons.io.filefilter.FileFilterTestCase): Filter(File) org.apache.commons.io.filefilter.CanWriteFileFilter
not false for /commons-io-2.4-src/test/io/read-only-file2.txt expected:<false> but was:<true>
>   testThrowsOnNullList(org.apache.commons.io.FileUtilsCleanDirectoryTestCase): expected
IOException
>   testThrowsOnCannotDeleteFile(org.apache.commons.io.FileUtilsCleanDirectoryTestCase):
expected IOException
> Tests run: 966, Failures: 4, Errors: 0, Skipped: 0
> [INFO] ------------------------------------------------------------------------
> [INFO] BUILD FAILURE
> [INFO] ------------------------------------------------------------------------
> [INFO] Total time: 01:32 min
> [INFO] Finished at: 2016-04-21T12:56:24-04:00
> [INFO] Final Memory: 17M/178M
> [INFO] ------------------------------------------------------------------------
> [ERROR] Failed to execute goal org.apache.maven.plugins:maven-surefire-plugin:2.12:test
(default-test) on project commons-io: There are test failures.
> [ERROR] 
> [ERROR] Please refer to /commons-io-2.4-src/target/surefire-reports for the individual
test results.
> [ERROR] -> [Help 1]
> [ERROR] 
> [ERROR] To see the full stack trace of the errors, re-run Maven with the -e switch.
> [ERROR] Re-run Maven using the -X switch to enable full debug logging.
> [ERROR] 
> [ERROR] For more information about the errors and possible solutions, please read the
following articles:
> [ERROR] [Help 1] http://cwiki.apache.org/confluence/display/MAVEN/MojoFailureException
> The command '/bin/sh -c cd commons-io-2.4-src && mvn install' returned a non-zero
code: 1
> Dockerfile
> FROM fedora:21
> RUN yum update -y
> RUN yum install -y java-1.8.0-openjdk unzip
> RUN yum install -y maven
> COPY commons-io-2.4-src.zip commons-io-2.4-src.zip
> RUN unzip commons-io-2.4-src.zip
> RUN cd commons-io-2.4-src && mvn initialize
> RUN cd commons-io-2.4-src && mvn test-compile
> RUN cd commons-io-2.4-src && mvn install
> RUN chmod -R 755 /root
> CMD /bin/bash
> ==
> Did a second run with commons-io.2,5
> Failed tests: 
>   FileUtilsCleanDirectoryTestCase.testThrowsOnNullList:109 expected IOException
>   FileUtilsCleanDirectoryTestCase.testThrowsOnCannotDeleteFile:129 expected IOException
>   FileFilterTestCase.testCanRead:984->assertFiltering:64 Filter(File) org.apache.commons.io.filefilter.AndFileFilter
not true for /root/commons-io-2.5-src/test/io/read-only-file1.txt expected:<true> but
was:<false>
>   FileFilterTestCase.testCanWrite:1005->assertFiltering:64 Filter(File) org.apache.commons.io.filefilter.CanWriteFileFilter
not false for /root/commons-io-2.5-src/test/io/read-only-file2.txt expected:<false>
but was:<true>
> Tests run: 1157, Failures: 4, Errors: 0, Skipped: 4
> Dockerfile contents
> FROM fedora:21
> RUN yum update -y
> RUN yum install -y java-1.8.0-openjdk unzip
> RUN yum install -y maven
> RUN yum install -y wget
> RUN cd /root && wget http://apache.parentingamerica.com//commons/io/source/commons-io-2.5-src.zip
> RUN cd /root && unzip commons-io-2.5-src.zip
> RUN cd /root && cd commons-io-2.5-src && mvn initialize
> RUN cd /root && cd commons-io-2.5-src && mvn test-compile
> RUN cd /root && cd commons-io-2.5-src && mvn install
> RUN chmod -R 755 /root
> CMD /bin/bash
> command: $docker build .
> ==
> Debian Jessie, JDK 7 also fails with code coming from trunk
> Failed tests: 
>   FileUtilsCleanDirectoryTestCase.testThrowsOnNullList:109 expected IOException
>   FileUtilsCleanDirectoryTestCase.testThrowsOnCannotDeleteFile:129 expected IOException
>   FileFilterTestCase.testCanRead:984->assertFiltering:64 Filter(File) org.apache.commons.io.filefilter.AndFileFilter
not true for /root/commons-io/test/io/read-only-file1.txt expected:<true> but was:<false>
>   FileFilterTestCase.testCanWrite:1005->assertFiltering:64 Filter(File) org.apache.commons.io.filefilter.CanWriteFileFilter
not false for /root/commons-io/test/io/read-only-file2.txt expected:<false> but was:<true>
> FROM debian:8.4
> CMD /bin/bash
> RUN apt-get update -y
> RUN apt-get install -y openjdk-7-jdk openjdk-7-jre unzip maven wget subversion
> RUN cd /root && svn checkout -r 1740549 http://svn.apache.org/repos/asf/commons/proper/io/trunk
/root/commons-io
> RUN cd /root/commons-io && mvn initialize
> RUN cd /root/commons-io && mvn test-compile
> RUN cd /root/commons-io && mvn install
> RUN chmod -R 755 /root
> ======================
> All the above are where the users home directory is NFS mounted.
> I retried 2.5-src on a machine where the home directory for the users was local and it
made no difference.
> Using Fedora23 in VirtualBox on Windows 7.



--
This message was sent by Atlassian JIRA
(v6.3.4#6332)

Mime
View raw message