commons-issues mailing list archives

Site index · List index
Message view « Date » · « Thread »
Top « Date » · « Thread »
From "Siegfried Goeschl (JIRA)" <j...@apache.org>
Subject [jira] [Updated] (EXEC-86) Test failure with Java 8 and EXEC-57 unit test
Date Fri, 08 Jan 2016 23:28:40 GMT

     [ https://issues.apache.org/jira/browse/EXEC-86?page=com.atlassian.jira.plugin.system.issuetabpanels:all-tabpanel
]

Siegfried Goeschl updated EXEC-86:
----------------------------------
    Summary: Test failure with Java 8 and EXEC-57 unit test  (was: Test failure with Java
8)

> Test failure with Java 8 and EXEC-57 unit test
> ----------------------------------------------
>
>                 Key: EXEC-86
>                 URL: https://issues.apache.org/jira/browse/EXEC-86
>             Project: Commons Exec
>          Issue Type: Bug
>    Affects Versions: 1.2
>            Reporter: Emmanuel Bourg
>            Assignee: Siegfried Goeschl
>             Fix For: 1.4
>
>
> Exec57Test.testExec_57 fails on Linux with OpenJDK 8u5:
> {code}
> -------------------------------------------------------------------------------
> Test set: org.apache.commons.exec.issues.Exec57Test
> -------------------------------------------------------------------------------
> Tests run: 1, Failures: 1, Errors: 0, Skipped: 0, Time elapsed: 0.002 sec <<<
FAILURE! - in org.apache.commons.exec.issues.Exec57Test
> testExec_57(org.apache.commons.exec.issues.Exec57Test)  Time elapsed: 0.001 sec  <<<
FAILURE!
> java.lang.AssertionError: Expecting an ExecuteException
>         at org.junit.Assert.fail(Assert.java:88)
>         at org.apache.commons.exec.issues.Exec57Test.testExec_57(Exec57Test.java:82)
> {code}



--
This message was sent by Atlassian JIRA
(v6.3.4#6332)

Mime
View raw message