commons-issues mailing list archives

Site index · List index
Message view « Date » · « Thread »
Top « Date » · « Thread »
From "Benedikt Ritter (JIRA)" <j...@apache.org>
Subject [jira] [Updated] (LANG-942) Test failure in FastDateParserTest and FastDateFormat_ParserTest when building with JDK8
Date Fri, 03 Jan 2014 13:28:50 GMT

     [ https://issues.apache.org/jira/browse/LANG-942?page=com.atlassian.jira.plugin.system.issuetabpanels:all-tabpanel
]

Benedikt Ritter updated LANG-942:
---------------------------------

    Description: 
The following failure is thrown when using JDK 8:

{code}
-------------------------------------------------------------------------------
Test set: org.apache.commons.lang3.time.FastDateFormat_ParserTest
-------------------------------------------------------------------------------
Tests run: 29, Failures: 1, Errors: 0, Skipped: 0, Time elapsed: 1.315 sec <<< FAILURE!
- in org.apache.commons.lang3.time.FastDateFormat_ParserTest
testParseZone(org.apache.commons.lang3.time.FastDateFormat_ParserTest)  Time elapsed: 0.005
sec  <<< FAILURE!
java.lang.AssertionError: expected:<Thu Jul 10 22:33:20 CEST 2003> but was:<Thu Jul
10 23:33:20 CEST 2003>
	at org.junit.Assert.fail(Assert.java:88)
	at org.junit.Assert.failNotEquals(Assert.java:743)
	at org.junit.Assert.assertEquals(Assert.java:118)
	at org.junit.Assert.assertEquals(Assert.java:144)
	at org.apache.commons.lang3.time.FastDateParserTest.testParseZone(FastDateParserTest.java:119)
	[...]
{code}

It is caused by the following assertion in FastDateParserTest (from which FastDateFormat_ParserTest
inherits):

{code:java}
assertEquals(cal.getTime(), fdf.parse("2003-07-10T16:33:20.000 Eastern Daylight Time"));
{code}

{{FastDateParserTest}} fails with the same error.

  was:
The following failure is thrown when using JDK 8:

{code}
-------------------------------------------------------------------------------
Test set: org.apache.commons.lang3.time.FastDateFormat_ParserTest
-------------------------------------------------------------------------------
Tests run: 29, Failures: 1, Errors: 0, Skipped: 0, Time elapsed: 1.315 sec <<< FAILURE!
- in org.apache.commons.lang3.time.FastDateFormat_ParserTest
testParseZone(org.apache.commons.lang3.time.FastDateFormat_ParserTest)  Time elapsed: 0.005
sec  <<< FAILURE!
java.lang.AssertionError: expected:<Thu Jul 10 22:33:20 CEST 2003> but was:<Thu Jul
10 23:33:20 CEST 2003>
	at org.junit.Assert.fail(Assert.java:88)
	at org.junit.Assert.failNotEquals(Assert.java:743)
	at org.junit.Assert.assertEquals(Assert.java:118)
	at org.junit.Assert.assertEquals(Assert.java:144)
	at org.apache.commons.lang3.time.FastDateParserTest.testParseZone(FastDateParserTest.java:119)
	[...]
{code}

It is caused by the following assertion in FastDateParserTest (from which FastDateFormat_ParserTest
inherits):

{code:java}
assertEquals(cal.getTime(), fdf.parse("2003-07-10T16:33:20.000 Eastern Daylight Time"));
{code}


> Test failure in FastDateParserTest and FastDateFormat_ParserTest when building with JDK8
> ----------------------------------------------------------------------------------------
>
>                 Key: LANG-942
>                 URL: https://issues.apache.org/jira/browse/LANG-942
>             Project: Commons Lang
>          Issue Type: Sub-task
>          Components: lang.time.*
>    Affects Versions: 3.2
>         Environment: JDK8
>            Reporter: Benedikt Ritter
>             Fix For: 3.2.1
>
>
> The following failure is thrown when using JDK 8:
> {code}
> -------------------------------------------------------------------------------
> Test set: org.apache.commons.lang3.time.FastDateFormat_ParserTest
> -------------------------------------------------------------------------------
> Tests run: 29, Failures: 1, Errors: 0, Skipped: 0, Time elapsed: 1.315 sec <<<
FAILURE! - in org.apache.commons.lang3.time.FastDateFormat_ParserTest
> testParseZone(org.apache.commons.lang3.time.FastDateFormat_ParserTest)  Time elapsed:
0.005 sec  <<< FAILURE!
> java.lang.AssertionError: expected:<Thu Jul 10 22:33:20 CEST 2003> but was:<Thu
Jul 10 23:33:20 CEST 2003>
> 	at org.junit.Assert.fail(Assert.java:88)
> 	at org.junit.Assert.failNotEquals(Assert.java:743)
> 	at org.junit.Assert.assertEquals(Assert.java:118)
> 	at org.junit.Assert.assertEquals(Assert.java:144)
> 	at org.apache.commons.lang3.time.FastDateParserTest.testParseZone(FastDateParserTest.java:119)
> 	[...]
> {code}
> It is caused by the following assertion in FastDateParserTest (from which FastDateFormat_ParserTest
inherits):
> {code:java}
> assertEquals(cal.getTime(), fdf.parse("2003-07-10T16:33:20.000 Eastern Daylight Time"));
> {code}
> {{FastDateParserTest}} fails with the same error.



--
This message was sent by Atlassian JIRA
(v6.1.5#6160)

Mime
View raw message