commons-dev mailing list archives

Site index · List index
Message view « Date » · « Thread »
Top « Date » · « Thread »
From Apache Jenkins Server <jenk...@builds.apache.org>
Subject Build failed in Jenkins: Commons-Compress PullRequest Builder #2
Date Fri, 02 Jun 2017 17:33:34 GMT
See <https://builds.apache.org/job/Commons-Compress%20PullRequest%20Builder/2/display/redirect?page=changes>

Changes:

[sesuncedu] COMPRESS-399 OSGI package versions are overly pessimistic, except when

------------------------------------------
GitHub pull request #26 to apache/commons-compress
[EnvInject] - Loading node environment variables.
Building remotely on beam5 (beam) in workspace <https://builds.apache.org/job/Commons-Compress%20PullRequest%20Builder/ws/>
Cloning the remote Git repository
Cloning repository git://github.com/apache/commons-compress.git
 > git init <https://builds.apache.org/job/Commons-Compress%20PullRequest%20Builder/ws/>
# timeout=10
Fetching upstream changes from git://github.com/apache/commons-compress.git
 > git --version # timeout=10
 > git fetch --tags --progress git://github.com/apache/commons-compress.git +refs/heads/*:refs/remotes/origin/*
 > git config remote.origin.url git://github.com/apache/commons-compress.git # timeout=10
 > git config --add remote.origin.fetch +refs/heads/*:refs/remotes/origin/* # timeout=10
 > git config remote.origin.url git://github.com/apache/commons-compress.git # timeout=10
Fetching upstream changes from git://github.com/apache/commons-compress.git
 > git fetch --tags --progress git://github.com/apache/commons-compress.git +refs/heads/*:refs/remotes/origin/*
 > git config core.sparsecheckout # timeout=10
 > git checkout -f origin/master
 > git branch -a -v --no-abbrev # timeout=10
 > git checkout -b master origin/master
  Opening connection
    Done: 0
  Counting objects
    Done: 154
  Finding sources
    Done: 154
  Getting sizes
    Done: 97
  Compressing objects
    Done: 286572
  Writing objects
    Done: 154
  remote: Resolving deltas
  remote: Updating references
Merging refs/tags/changes/2
 > git rev-parse refs/tags/changes/2^{commit} # timeout=10
 > git merge 109b14915cf594e5c2031e58d6f2fd0595fc184f # timeout=10
 > git rev-parse master^{commit} # timeout=10
Checking out Revision a8ab0ec803b40c83a5f9a1c032cd2c4309695e00 (master)
 > git config core.sparsecheckout # timeout=10
 > git checkout -f a8ab0ec803b40c83a5f9a1c032cd2c4309695e00
 > git rev-parse origin/master^{commit} # timeout=10
 > git rev-list 223b5d9f7533d769d228ee3417d5f44f411c8b6f # timeout=10
[EnvInject] - Injecting environment variables from a build step.
Setting JDK_1_7_LATEST__HOME=/home/jenkins/tools/java/latest1.7
[EnvInject] - Injecting as environment variables the properties content 
JAVA_1_7_HOME=/home/jenkins/tools/java/latest1.7

[EnvInject] - Variables injected successfully.
Setting JDK_1_7_LATEST__HOME=/home/jenkins/tools/java/latest1.7
Parsing POMs
Downloaded artifact http://repo.maven.apache.org/maven2/org/apache/commons/commons-parent/42/commons-parent-42.pom
Modules changed, recalculating dependency graph
Established TCP socket on 34709
maven33-agent.jar already up to date
maven33-interceptor.jar already up to date
maven3-interceptor-commons.jar already up to date
[Commons-Compress PullRequest Builder] $ /home/jenkins/tools/java/latest1.7/bin/java -Xmx2g
-Xms256m -cp /home/jenkins/jenkins-slave/maven33-agent.jar:/home/jenkins/tools/maven/apache-maven-3.3.3/boot/plexus-classworlds-2.5.2.jar:/home/jenkins/tools/maven/apache-maven-3.3.3/conf/logging
jenkins.maven3.agent.Maven33Main /home/jenkins/tools/maven/apache-maven-3.3.3 /home/jenkins/jenkins-slave/slave.jar
/home/jenkins/jenkins-slave/maven33-interceptor.jar /home/jenkins/jenkins-slave/maven3-interceptor-commons.jar
34709
<===[JENKINS REMOTING CAPACITY]===>   channel started
Executing Maven:  -B -f <https://builds.apache.org/job/Commons-Compress%20PullRequest%20Builder/ws/pom.xml>
-Dmaven.repo.local=/home/jenkins/jenkins-slave/maven-repositories/0 clean package --batch-mode
-Prelease -Pjava-1.7
[INFO] Scanning for projects...
[INFO]                                                                         
[INFO] ------------------------------------------------------------------------
[INFO] Building Apache Commons Compress 1.15-SNAPSHOT
[INFO] ------------------------------------------------------------------------
[INFO] Downloading: https://repo.maven.apache.org/maven2/org/jacoco/jacoco-maven-plugin/0.7.7.201606060606/jacoco-maven-plugin-0.7.7.201606060606.pom
[INFO] Downloaded: https://repo.maven.apache.org/maven2/org/jacoco/jacoco-maven-plugin/0.7.7.201606060606/jacoco-maven-plugin-0.7.7.201606060606.pom
(5 KB at 5.5 KB/sec)
[INFO] Downloading: https://repo.maven.apache.org/maven2/org/jacoco/org.jacoco.build/0.7.7.201606060606/org.jacoco.build-0.7.7.201606060606.pom
[INFO] Downloaded: https://repo.maven.apache.org/maven2/org/jacoco/org.jacoco.build/0.7.7.201606060606/org.jacoco.build-0.7.7.201606060606.pom
(35 KB at 253.2 KB/sec)
[INFO] Downloading: https://repo.maven.apache.org/maven2/org/jacoco/jacoco-maven-plugin/0.7.7.201606060606/jacoco-maven-plugin-0.7.7.201606060606.jar
[INFO] Downloaded: https://repo.maven.apache.org/maven2/org/jacoco/jacoco-maven-plugin/0.7.7.201606060606/jacoco-maven-plugin-0.7.7.201606060606.jar
(60 KB at 865.5 KB/sec)
[INFO] Downloading: https://repo.maven.apache.org/maven2/org/apache/maven/plugins/maven-compiler-plugin/3.6.0/maven-compiler-plugin-3.6.0.pom
[INFO] Downloaded: https://repo.maven.apache.org/maven2/org/apache/maven/plugins/maven-compiler-plugin/3.6.0/maven-compiler-plugin-3.6.0.pom
(11 KB at 266.1 KB/sec)
[INFO] Downloading: https://repo.maven.apache.org/maven2/org/apache/maven/plugins/maven-compiler-plugin/3.6.0/maven-compiler-plugin-3.6.0.jar
[INFO] Downloaded: https://repo.maven.apache.org/maven2/org/apache/maven/plugins/maven-compiler-plugin/3.6.0/maven-compiler-plugin-3.6.0.jar
(54 KB at 1172.1 KB/sec)
[INFO] ------------------------------------------------------------------------
[INFO] BUILD FAILURE
[INFO] ------------------------------------------------------------------------
[INFO] Total time: 14.003 s
[INFO] Finished at: 2017-06-02T17:32:59+00:00
[INFO] Final Memory: 15M/246M
[INFO] ------------------------------------------------------------------------
Waiting for Jenkins to finish collecting data
[ERROR] Plugin org.apache.felix:maven-bundle-plugin:3.3.0 or one of its dependencies could
not be resolved: Failure to find org.apache.felix:maven-bundle-plugin:jar:3.3.0 in https://repo.maven.apache.org/maven2
was cached in the local repository, resolution will not be reattempted until the update interval
of central has elapsed or updates are forced -> [Help 1]
[ERROR] 
[ERROR] To see the full stack trace of the errors, re-run Maven with the -e switch.
[ERROR] Re-run Maven using the -X switch to enable full debug logging.
[ERROR] 
[ERROR] For more information about the errors and possible solutions, please read the following
articles:
[ERROR] [Help 1] http://cwiki.apache.org/confluence/display/MAVEN/PluginResolutionException
[JENKINS] Archiving <https://builds.apache.org/job/Commons-Compress%20PullRequest%20Builder/ws/pom.xml>
to org.apache.commons/commons-compress/1.15-SNAPSHOT/commons-compress-1.15-SNAPSHOT.pom
Sending e-mails to: dev@commons.apache.org
channel stopped
Putting comment on the pull request
Setting JDK_1_7_LATEST__HOME=/home/jenkins/tools/java/latest1.7

---------------------------------------------------------------------
To unsubscribe, e-mail: dev-unsubscribe@commons.apache.org
For additional commands, e-mail: dev-help@commons.apache.org


Mime
View raw message