commons-dev mailing list archives

Site index · List index
Message view « Date » · « Thread »
Top « Date » · « Thread »
From Apache Jenkins Server <jenk...@builds.apache.org>
Subject Build failed in Jenkins: Commons-configuration #58
Date Mon, 10 Apr 2017 22:05:44 GMT
See <https://builds.apache.org/job/Commons-configuration/58/display/redirect?page=changes>

Changes:

[ggregory] Remove redundant type arguments.

[ggregory] [CONFIGURATION-661] Update platform requirement from Java 6 to 7.

------------------------------------------
[...truncated 36.00 KB...]
Tests run: 7, Failures: 0, Errors: 0, Skipped: 0, Time elapsed: 0.072 sec - in org.apache.commons.configuration2.tree.xpath.TestConfigurationNodePointer
Running org.apache.commons.configuration2.tree.xpath.TestConfigurationNodePointerFactory
Tests run: 8, Failures: 0, Errors: 0, Skipped: 0, Time elapsed: 0.123 sec - in org.apache.commons.configuration2.tree.xpath.TestConfigurationNodePointerFactory
Running org.apache.commons.configuration2.tree.xpath.TestConfigurationIteratorAttributes
Tests run: 6, Failures: 0, Errors: 0, Skipped: 0, Time elapsed: 0.04 sec - in org.apache.commons.configuration2.tree.xpath.TestConfigurationIteratorAttributes
Running org.apache.commons.configuration2.tree.xpath.TestConfigurationNodeIteratorChildren
Tests run: 13, Failures: 0, Errors: 0, Skipped: 0, Time elapsed: 0.014 sec - in org.apache.commons.configuration2.tree.xpath.TestConfigurationNodeIteratorChildren
Running org.apache.commons.configuration2.tree.xpath.TestXPathContextFactory
Tests run: 1, Failures: 0, Errors: 0, Skipped: 0, Time elapsed: 0 sec - in org.apache.commons.configuration2.tree.xpath.TestXPathContextFactory
Running org.apache.commons.configuration2.tree.xpath.TestXPathExpressionEngine
Tests run: 34, Failures: 0, Errors: 0, Skipped: 0, Time elapsed: 0.065 sec - in org.apache.commons.configuration2.tree.xpath.TestXPathExpressionEngine
Running org.apache.commons.configuration2.tree.xpath.TestConfigurationAttributePointer
Tests run: 13, Failures: 0, Errors: 0, Skipped: 0, Time elapsed: 0.001 sec - in org.apache.commons.configuration2.tree.xpath.TestConfigurationAttributePointer
Running org.apache.commons.configuration2.tree.TestQueryResult
Tests run: 9, Failures: 0, Errors: 0, Skipped: 0, Time elapsed: 0.001 sec - in org.apache.commons.configuration2.tree.TestQueryResult
Running org.apache.commons.configuration2.tree.TestNodeAddData
Tests run: 4, Failures: 0, Errors: 0, Skipped: 0, Time elapsed: 0 sec - in org.apache.commons.configuration2.tree.TestNodeAddData
Running org.apache.commons.configuration2.tree.TestNodeSelector
Tests run: 12, Failures: 0, Errors: 0, Skipped: 0, Time elapsed: 0.004 sec - in org.apache.commons.configuration2.tree.TestNodeSelector
Running org.apache.commons.configuration2.tree.TestNodeUpdateData
Tests run: 7, Failures: 0, Errors: 0, Skipped: 0, Time elapsed: 0.001 sec - in org.apache.commons.configuration2.tree.TestNodeUpdateData
Running org.apache.commons.configuration2.tree.TestUnionCombiner
Tests run: 6, Failures: 0, Errors: 0, Skipped: 0, Time elapsed: 0.081 sec - in org.apache.commons.configuration2.tree.TestUnionCombiner
Running org.apache.commons.configuration2.tree.TestInMemoryNodeModelTrackedNodes
Tests run: 43, Failures: 0, Errors: 0, Skipped: 0, Time elapsed: 0.02 sec - in org.apache.commons.configuration2.tree.TestInMemoryNodeModelTrackedNodes
Running org.apache.commons.configuration2.tree.TestInMemoryNodeModel
Tests run: 39, Failures: 0, Errors: 0, Skipped: 0, Time elapsed: 0.082 sec - in org.apache.commons.configuration2.tree.TestInMemoryNodeModel
Running org.apache.commons.configuration2.tree.TestDefaultConfigurationKey
Tests run: 33, Failures: 0, Errors: 0, Skipped: 0, Time elapsed: 0.006 sec - in org.apache.commons.configuration2.tree.TestDefaultConfigurationKey
Running org.apache.commons.configuration2.TestINIConfiguration
Tests run: 64, Failures: 0, Errors: 0, Skipped: 0, Time elapsed: 0.245 sec - in org.apache.commons.configuration2.TestINIConfiguration
Running org.apache.commons.configuration2.TestBaseHierarchicalConfigurationSynchronization
Tests run: 14, Failures: 0, Errors: 0, Skipped: 0, Time elapsed: 0.147 sec - in org.apache.commons.configuration2.TestBaseHierarchicalConfigurationSynchronization
Running org.apache.commons.configuration2.TestDynamicCombinedConfiguration
Tests run: 12, Failures: 0, Errors: 0, Skipped: 0, Time elapsed: 16.228 sec - in org.apache.commons.configuration2.TestDynamicCombinedConfiguration
Running org.apache.commons.configuration2.TestXMLListHandling
Tests run: 5, Failures: 0, Errors: 0, Skipped: 0, Time elapsed: 0.188 sec - in org.apache.commons.configuration2.TestXMLListHandling
Running org.apache.commons.configuration2.TestCompositeConfigurationNonStringProperties
Tests run: 23, Failures: 0, Errors: 0, Skipped: 0, Time elapsed: 0.135 sec - in org.apache.commons.configuration2.TestCompositeConfigurationNonStringProperties
Running org.apache.commons.configuration2.TestPropertiesConfigurationLayout
Tests run: 38, Failures: 0, Errors: 0, Skipped: 0, Time elapsed: 0.01 sec - in org.apache.commons.configuration2.TestPropertiesConfigurationLayout
Running org.apache.commons.configuration2.TestConfigurationSet
Tests run: 2, Failures: 0, Errors: 0, Skipped: 0, Time elapsed: 0.002 sec - in org.apache.commons.configuration2.TestConfigurationSet
Running org.apache.commons.configuration2.reloading.TestReloadingController
Tests run: 8, Failures: 0, Errors: 0, Skipped: 0, Time elapsed: 0.001 sec - in org.apache.commons.configuration2.reloading.TestReloadingController
Running org.apache.commons.configuration2.reloading.TestPeriodicReloadingTrigger
Tests run: 9, Failures: 0, Errors: 0, Skipped: 0, Time elapsed: 0.005 sec - in org.apache.commons.configuration2.reloading.TestPeriodicReloadingTrigger
Running org.apache.commons.configuration2.reloading.TestCombinedReloadingController
Tests run: 8, Failures: 0, Errors: 0, Skipped: 0, Time elapsed: 0.001 sec - in org.apache.commons.configuration2.reloading.TestCombinedReloadingController
Running org.apache.commons.configuration2.reloading.TestVFSFileHandlerReloadingDetector
Tests run: 6, Failures: 0, Errors: 0, Skipped: 0, Time elapsed: 0.047 sec - in org.apache.commons.configuration2.reloading.TestVFSFileHandlerReloadingDetector
Running org.apache.commons.configuration2.reloading.TestFileHandlerReloadingDetector
Tests run: 9, Failures: 0, Errors: 0, Skipped: 0, Time elapsed: 0.017 sec - in org.apache.commons.configuration2.reloading.TestFileHandlerReloadingDetector
Running org.apache.commons.configuration2.reloading.TestManagedReloadingDetector
Tests run: 3, Failures: 0, Errors: 0, Skipped: 0, Time elapsed: 0.001 sec - in org.apache.commons.configuration2.reloading.TestManagedReloadingDetector
Running org.apache.commons.configuration2.TestDataConfiguration
Tests run: 58, Failures: 0, Errors: 0, Skipped: 0, Time elapsed: 0.338 sec - in org.apache.commons.configuration2.TestDataConfiguration
Running org.apache.commons.configuration2.TestXMLDocumentHelper
Tests run: 11, Failures: 0, Errors: 0, Skipped: 0, Time elapsed: 0.113 sec - in org.apache.commons.configuration2.TestXMLDocumentHelper
Running org.apache.commons.configuration2.TestCatalogResolver
Tests run: 5, Failures: 0, Errors: 0, Skipped: 0, Time elapsed: 0.055 sec - in org.apache.commons.configuration2.TestCatalogResolver
Running org.apache.commons.configuration2.event.TestConfigurationEventTypes
Tests run: 19, Failures: 0, Errors: 0, Skipped: 0, Time elapsed: 0.005 sec - in org.apache.commons.configuration2.event.TestConfigurationEventTypes
Running org.apache.commons.configuration2.event.TestPropertiesConfigurationEvents
Tests run: 8, Failures: 0, Errors: 0, Skipped: 0, Time elapsed: 0.003 sec - in org.apache.commons.configuration2.event.TestPropertiesConfigurationEvents
Running org.apache.commons.configuration2.event.TestXMLConfigurationEvents
Tests run: 13, Failures: 0, Errors: 0, Skipped: 0, Time elapsed: 0.003 sec - in org.apache.commons.configuration2.event.TestXMLConfigurationEvents
Running org.apache.commons.configuration2.event.TestSubsetConfigurationEvents
Tests run: 8, Failures: 0, Errors: 0, Skipped: 0, Time elapsed: 0.001 sec - in org.apache.commons.configuration2.event.TestSubsetConfigurationEvents
Running org.apache.commons.configuration2.event.TestEventSource
Tests run: 19, Failures: 0, Errors: 0, Skipped: 0, Time elapsed: 0.002 sec - in org.apache.commons.configuration2.event.TestEventSource
Running org.apache.commons.configuration2.event.TestHierarchicalConfigurationEvents
Tests run: 13, Failures: 0, Errors: 0, Skipped: 0, Time elapsed: 0.002 sec - in org.apache.commons.configuration2.event.TestHierarchicalConfigurationEvents
Running org.apache.commons.configuration2.event.TestDatabaseConfigurationEvents
Tests run: 8, Failures: 0, Errors: 0, Skipped: 0, Time elapsed: 0.927 sec - in org.apache.commons.configuration2.event.TestDatabaseConfigurationEvents
Running org.apache.commons.configuration2.event.TestEvent
Tests run: 3, Failures: 0, Errors: 0, Skipped: 0, Time elapsed: 0.001 sec - in org.apache.commons.configuration2.event.TestEvent
Running org.apache.commons.configuration2.event.TestEventListenerList
Tests run: 31, Failures: 0, Errors: 0, Skipped: 0, Time elapsed: 0.014 sec - in org.apache.commons.configuration2.event.TestEventListenerList
Running org.apache.commons.configuration2.event.TestMapConfigurationEvents
Tests run: 8, Failures: 0, Errors: 0, Skipped: 0, Time elapsed: 0 sec - in org.apache.commons.configuration2.event.TestMapConfigurationEvents
Running org.apache.commons.configuration2.event.TestEventType
Tests run: 1, Failures: 0, Errors: 0, Skipped: 0, Time elapsed: 0 sec - in org.apache.commons.configuration2.event.TestEventType
Running org.apache.commons.configuration2.TestBaseNullConfiguration
Tests run: 37, Failures: 0, Errors: 0, Skipped: 0, Time elapsed: 0.029 sec - in org.apache.commons.configuration2.TestBaseNullConfiguration
Running org.apache.commons.configuration2.sync.TestReadWriteSynchronizer
Tests run: 3, Failures: 0, Errors: 0, Skipped: 0, Time elapsed: 0.156 sec - in org.apache.commons.configuration2.sync.TestReadWriteSynchronizer
Running org.apache.commons.configuration2.TestXMLPropertiesConfiguration
Warning: validation was turned on but an org.xml.sax.ErrorHandler was not
set, which is probably not what is desired.  Parser will use a default
ErrorHandler to print the first 10 errors.  Please call
the 'setErrorHandler' method to fix this.
Error: URI=null Line=1: Document root element "properties", must match DOCTYPE root "null".
Error: URI=null Line=1: Document is invalid: no grammar found.
Tests run: 4, Failures: 0, Errors: 0, Skipped: 0, Time elapsed: 0.037 sec - in org.apache.commons.configuration2.TestXMLPropertiesConfiguration
Running org.apache.commons.configuration2.TestMapConfiguration
Tests run: 20, Failures: 0, Errors: 0, Skipped: 0, Time elapsed: 0.014 sec - in org.apache.commons.configuration2.TestMapConfiguration
Running org.apache.commons.configuration2.TestNullJNDIEnvironmentValues
Tests run: 12, Failures: 0, Errors: 0, Skipped: 0, Time elapsed: 0.08 sec - in org.apache.commons.configuration2.TestNullJNDIEnvironmentValues
Running org.apache.commons.configuration2.TestPropertiesConfiguration
Tests run: 71, Failures: 0, Errors: 0, Skipped: 0, Time elapsed: 0.533 sec - in org.apache.commons.configuration2.TestPropertiesConfiguration
Running org.apache.commons.configuration2.TestXMLConfiguration_605
Tests run: 8, Failures: 0, Errors: 0, Skipped: 0, Time elapsed: 0.061 sec - in org.apache.commons.configuration2.TestXMLConfiguration_605
Running org.apache.commons.configuration2.TestDatabaseConfiguration
Tests run: 36, Failures: 0, Errors: 0, Skipped: 0, Time elapsed: 0.885 sec - in org.apache.commons.configuration2.TestDatabaseConfiguration
Running org.apache.commons.configuration2.TestAbstractConfigurationSynchronization
Tests run: 19, Failures: 0, Errors: 0, Skipped: 0, Time elapsed: 0.05 sec - in org.apache.commons.configuration2.TestAbstractConfigurationSynchronization
Running org.apache.commons.configuration2.TestHierarchicalXMLConfiguration
Tests run: 10, Failures: 0, Errors: 0, Skipped: 0, Time elapsed: 0.191 sec - in org.apache.commons.configuration2.TestHierarchicalXMLConfiguration
Running org.apache.commons.configuration2.TestBaseConfiguration
Tests run: 59, Failures: 0, Errors: 0, Skipped: 0, Time elapsed: 0.045 sec - in org.apache.commons.configuration2.TestBaseConfiguration
Running org.apache.commons.configuration2.builder.TestBasicConfigurationBuilderEvents
Tests run: 11, Failures: 0, Errors: 0, Skipped: 0, Time elapsed: 0.001 sec - in org.apache.commons.configuration2.builder.TestBasicConfigurationBuilderEvents
Running org.apache.commons.configuration2.builder.TestDefaultReloadingDetectorFactory
Tests run: 2, Failures: 0, Errors: 0, Skipped: 0, Time elapsed: 0.001 sec - in org.apache.commons.configuration2.builder.TestDefaultReloadingDetectorFactory
Running org.apache.commons.configuration2.builder.TestJndiBuilderParametersImpl
Tests run: 4, Failures: 0, Errors: 0, Skipped: 0, Time elapsed: 0.011 sec - in org.apache.commons.configuration2.builder.TestJndiBuilderParametersImpl
Running org.apache.commons.configuration2.builder.TestReloadingBuilderSupportListener
Tests run: 2, Failures: 0, Errors: 0, Skipped: 0, Time elapsed: 0.001 sec - in org.apache.commons.configuration2.builder.TestReloadingBuilderSupportListener
Running org.apache.commons.configuration2.builder.TestEventListenerParameters
Tests run: 4, Failures: 0, Errors: 0, Skipped: 0, Time elapsed: 0.004 sec - in org.apache.commons.configuration2.builder.TestEventListenerParameters
Running org.apache.commons.configuration2.builder.TestBasicBuilderParameters
Tests run: 34, Failures: 0, Errors: 0, Skipped: 0, Time elapsed: 0.041 sec - in org.apache.commons.configuration2.builder.TestBasicBuilderParameters
Running org.apache.commons.configuration2.builder.TestFileBasedConfigurationBuilder
Tests run: 24, Failures: 0, Errors: 0, Skipped: 0, Time elapsed: 0.097 sec - in org.apache.commons.configuration2.builder.TestFileBasedConfigurationBuilder
Running org.apache.commons.configuration2.builder.TestDatabaseBuilderParametersImpl
Tests run: 8, Failures: 0, Errors: 0, Skipped: 0, Time elapsed: 0.01 sec - in org.apache.commons.configuration2.builder.TestDatabaseBuilderParametersImpl
Running org.apache.commons.configuration2.builder.TestCopyObjectDefaultHandler
Tests run: 4, Failures: 0, Errors: 0, Skipped: 0, Time elapsed: 0.018 sec - in org.apache.commons.configuration2.builder.TestCopyObjectDefaultHandler
Running org.apache.commons.configuration2.builder.TestReloadingFileBasedConfigurationBuilder
Tests run: 9, Failures: 0, Errors: 0, Skipped: 0, Time elapsed: 0.014 sec - in org.apache.commons.configuration2.builder.TestReloadingFileBasedConfigurationBuilder
Running org.apache.commons.configuration2.builder.fluent.TestConfigurations
Tests run: 32, Failures: 0, Errors: 0, Skipped: 0, Time elapsed: 0.3 sec - in org.apache.commons.configuration2.builder.fluent.TestConfigurations
Running org.apache.commons.configuration2.builder.fluent.TestParameters
Tests run: 19, Failures: 0, Errors: 0, Skipped: 0, Time elapsed: 0.015 sec - in org.apache.commons.configuration2.builder.fluent.TestParameters
Running org.apache.commons.configuration2.builder.TestBasicConfigurationBuilder
Tests run: 27, Failures: 0, Errors: 0, Skipped: 0, Time elapsed: 0.051 sec - in org.apache.commons.configuration2.builder.TestBasicConfigurationBuilder
Running org.apache.commons.configuration2.builder.combined.TestBaseConfigurationBuilderProvider
Tests run: 9, Failures: 0, Errors: 0, Skipped: 0, Time elapsed: 0.013 sec - in org.apache.commons.configuration2.builder.combined.TestBaseConfigurationBuilderProvider
Running org.apache.commons.configuration2.builder.combined.TestReloadingMultiFileConfigurationBuilder
Tests run: 6, Failures: 0, Errors: 0, Skipped: 0, Time elapsed: 0.058 sec - in org.apache.commons.configuration2.builder.combined.TestReloadingMultiFileConfigurationBuilder
Running org.apache.commons.configuration2.builder.combined.TestReloadingCombinedConfigurationBuilderFileBased
Tests run: 4, Failures: 0, Errors: 0, Skipped: 0, Time elapsed: 3.579 sec - in org.apache.commons.configuration2.builder.combined.TestReloadingCombinedConfigurationBuilderFileBased
Running org.apache.commons.configuration2.builder.combined.TestReloadingCombinedConfigurationBuilder
Tests run: 5, Failures: 0, Errors: 0, Skipped: 0, Time elapsed: 0.044 sec - in org.apache.commons.configuration2.builder.combined.TestReloadingCombinedConfigurationBuilder
Running org.apache.commons.configuration2.builder.combined.TestCombinedBuilderParametersImpl
Tests run: 27, Failures: 0, Errors: 0, Skipped: 0, Time elapsed: 0.006 sec - in org.apache.commons.configuration2.builder.combined.TestCombinedBuilderParametersImpl
Running org.apache.commons.configuration2.builder.combined.TestCombinedConfigurationBuilder
Tests run: 50, Failures: 0, Errors: 0, Skipped: 0, Time elapsed: 5.917 sec - in org.apache.commons.configuration2.builder.combined.TestCombinedConfigurationBuilder
Running org.apache.commons.configuration2.builder.combined.TestCombinedConfigurationBuilderVFS
Tests run: 51, Failures: 0, Errors: 0, Skipped: 0, Time elapsed: 5.484 sec - in org.apache.commons.configuration2.builder.combined.TestCombinedConfigurationBuilderVFS
Running org.apache.commons.configuration2.builder.combined.TestMultiWrapDynaBean
Tests run: 13, Failures: 0, Errors: 0, Skipped: 0, Time elapsed: 0.006 sec - in org.apache.commons.configuration2.builder.combined.TestMultiWrapDynaBean
Running org.apache.commons.configuration2.builder.combined.TestConfigurationDeclaration
Tests run: 5, Failures: 0, Errors: 0, Skipped: 0, Time elapsed: 0.001 sec - in org.apache.commons.configuration2.builder.combined.TestConfigurationDeclaration
Running org.apache.commons.configuration2.builder.combined.TestFileExtensionConfigurationBuilderProvider
Tests run: 10, Failures: 0, Errors: 0, Skipped: 0, Time elapsed: 0.012 sec - in org.apache.commons.configuration2.builder.combined.TestFileExtensionConfigurationBuilderProvider
Running org.apache.commons.configuration2.builder.combined.TestMultiFileBuilderParametersImpl
Tests run: 7, Failures: 0, Errors: 0, Skipped: 0, Time elapsed: 0.003 sec - in org.apache.commons.configuration2.builder.combined.TestMultiFileBuilderParametersImpl
Running org.apache.commons.configuration2.builder.combined.TestMultiFileConfigurationBuilder
Tests run: 16, Failures: 0, Errors: 0, Skipped: 0, Time elapsed: 0.348 sec - in org.apache.commons.configuration2.builder.combined.TestMultiFileConfigurationBuilder
Running org.apache.commons.configuration2.builder.TestBuilderConfigurationWrapperFactory
Tests run: 8, Failures: 0, Errors: 0, Skipped: 0, Time elapsed: 0.019 sec - in org.apache.commons.configuration2.builder.TestBuilderConfigurationWrapperFactory
Running org.apache.commons.configuration2.builder.TestDefaultParametersManager
Tests run: 9, Failures: 0, Errors: 0, Skipped: 0, Time elapsed: 0.009 sec - in org.apache.commons.configuration2.builder.TestDefaultParametersManager
Running org.apache.commons.configuration2.builder.TestHierarchicalBuilderParametersImpl
Tests run: 3, Failures: 0, Errors: 0, Skipped: 0, Time elapsed: 0.001 sec - in org.apache.commons.configuration2.builder.TestHierarchicalBuilderParametersImpl
Running org.apache.commons.configuration2.builder.TestPropertiesBuilderParametersImpl
Tests run: 6, Failures: 0, Errors: 0, Skipped: 0, Time elapsed: 0.004 sec - in org.apache.commons.configuration2.builder.TestPropertiesBuilderParametersImpl
Running org.apache.commons.configuration2.builder.TestFileBasedBuilderParameters
Tests run: 24, Failures: 0, Errors: 0, Skipped: 0, Time elapsed: 0.012 sec - in org.apache.commons.configuration2.builder.TestFileBasedBuilderParameters
Running org.apache.commons.configuration2.builder.TestAutoSaveListener
Tests run: 7, Failures: 0, Errors: 0, Skipped: 0, Time elapsed: 0.039 sec - in org.apache.commons.configuration2.builder.TestAutoSaveListener
Running org.apache.commons.configuration2.builder.TestXMLBuilderParametersImpl
Tests run: 8, Failures: 0, Errors: 0, Skipped: 0, Time elapsed: 0.02 sec - in org.apache.commons.configuration2.builder.TestXMLBuilderParametersImpl
Running org.apache.commons.configuration2.TestJNDIConfiguration
Tests run: 27, Failures: 0, Errors: 0, Skipped: 0, Time elapsed: 0.038 sec - in org.apache.commons.configuration2.TestJNDIConfiguration
Running org.apache.commons.configuration2.TestEqualsProperty
Tests run: 1, Failures: 0, Errors: 0, Skipped: 0, Time elapsed: 0.001 sec - in org.apache.commons.configuration2.TestEqualsProperty
Running org.apache.commons.configuration2.TestHierarchicalConfigurationXMLReader
Tests run: 1, Failures: 0, Errors: 0, Skipped: 0, Time elapsed: 0.019 sec - in org.apache.commons.configuration2.TestHierarchicalConfigurationXMLReader
Running org.apache.commons.configuration2.TestJNDIEnvironmentValues
Tests run: 12, Failures: 0, Errors: 0, Skipped: 0, Time elapsed: 0.02 sec - in org.apache.commons.configuration2.TestJNDIEnvironmentValues
Running org.apache.commons.configuration2.TestStrictConfigurationComparator
Tests run: 2, Failures: 0, Errors: 0, Skipped: 0, Time elapsed: 0 sec - in org.apache.commons.configuration2.TestStrictConfigurationComparator
Running org.apache.commons.configuration2.TestNullCompositeConfiguration
Tests run: 23, Failures: 0, Errors: 0, Skipped: 0, Time elapsed: 0.279 sec - in org.apache.commons.configuration2.TestNullCompositeConfiguration
Running org.apache.commons.configuration2.TestHierarchicalConfiguration
Tests run: 37, Failures: 0, Errors: 0, Skipped: 0, Time elapsed: 0.043 sec - in org.apache.commons.configuration2.TestHierarchicalConfiguration
Running org.apache.commons.configuration2.TestThreesomeConfiguration
Tests run: 3, Failures: 0, Errors: 0, Skipped: 0, Time elapsed: 0.002 sec - in org.apache.commons.configuration2.TestThreesomeConfiguration
Running org.apache.commons.configuration2.TestCombinedConfiguration
Tests run: 58, Failures: 0, Errors: 0, Skipped: 0, Time elapsed: 0.841 sec - in org.apache.commons.configuration2.TestCombinedConfiguration
Running org.apache.commons.configuration2.TestPropertiesSequence
Tests run: 3, Failures: 0, Errors: 0, Skipped: 0, Time elapsed: 0.023 sec - in org.apache.commons.configuration2.TestPropertiesSequence
Running org.apache.commons.configuration2.TestXMLConfiguration
[Fatal Error] :1:39: The element type "test" must be terminated by the matching end-tag "</test>".
Tests run: 89, Failures: 0, Errors: 0, Skipped: 0, Time elapsed: 1.323 sec - in org.apache.commons.configuration2.TestXMLConfiguration
Running org.apache.commons.configuration2.io.TestAbsoluteNameLocationStrategy
Tests run: 4, Failures: 0, Errors: 0, Skipped: 0, Time elapsed: 0.003 sec - in org.apache.commons.configuration2.io.TestAbsoluteNameLocationStrategy
Running org.apache.commons.configuration2.io.TestClasspathLocationStrategy
Tests run: 3, Failures: 0, Errors: 0, Skipped: 0, Time elapsed: 0.026 sec - in org.apache.commons.configuration2.io.TestClasspathLocationStrategy
Running org.apache.commons.configuration2.io.TestFileLocatorUtils
Tests run: 36, Failures: 0, Errors: 0, Skipped: 0, Time elapsed: 0.083 sec - in org.apache.commons.configuration2.io.TestFileLocatorUtils
Running org.apache.commons.configuration2.io.TestDefaultFileSystem
Tests run: 3, Failures: 0, Errors: 0, Skipped: 0, Time elapsed: 0.001 sec - in org.apache.commons.configuration2.io.TestDefaultFileSystem
Running org.apache.commons.configuration2.io.TestFileSystemLocationStrategy
Tests run: 1, Failures: 0, Errors: 0, Skipped: 0, Time elapsed: 0.006 sec - in org.apache.commons.configuration2.io.TestFileSystemLocationStrategy
Running org.apache.commons.configuration2.io.TestBasePathLocationStrategy
Tests run: 4, Failures: 0, Errors: 0, Skipped: 0, Time elapsed: 0.006 sec - in org.apache.commons.configuration2.io.TestBasePathLocationStrategy
Running org.apache.commons.configuration2.io.TestFileLocator
Tests run: 8, Failures: 0, Errors: 0, Skipped: 0, Time elapsed: 0.008 sec - in org.apache.commons.configuration2.io.TestFileLocator
Running org.apache.commons.configuration2.io.TestHomeDirectoryLocationStrategy
Tests run: 6, Failures: 0, Errors: 0, Skipped: 0, Time elapsed: 0.018 sec - in org.apache.commons.configuration2.io.TestHomeDirectoryLocationStrategy
Running org.apache.commons.configuration2.io.TestProvidedURLLocationStrategy
Tests run: 2, Failures: 0, Errors: 0, Skipped: 0, Time elapsed: 0.001 sec - in org.apache.commons.configuration2.io.TestProvidedURLLocationStrategy
Running org.apache.commons.configuration2.io.TestFileHandler
Java HotSpot(TM) 64-Bit Server VM warning: INFO: os::commit_memory(0x00000007ee500000, 296747008,
0) failed; error='Cannot allocate memory' (errno=12)
#
# There is insufficient memory for the Java Runtime Environment to continue.
# Native memory allocation (malloc) failed to allocate 296747008 bytes for committing reserved
memory.
# An error report file with more information is saved as:
# <https://builds.apache.org/job/Commons-configuration/ws/hs_err_pid6403.log>

Results :

Tests run: 2560, Failures: 0, Errors: 0, Skipped: 0

[JENKINS] Recording test results
[INFO] ------------------------------------------------------------------------
[INFO] BUILD FAILURE
[INFO] ------------------------------------------------------------------------
[INFO] Total time: 02:19 min
[INFO] Finished at: 2017-04-10T22:05:40+00:00
[INFO] Final Memory: 46M/711M
[INFO] ------------------------------------------------------------------------
Waiting for Jenkins to finish collecting data
[ERROR] Failed to execute goal org.apache.maven.plugins:maven-surefire-plugin:2.19.1:test
(default-test) on project commons-configuration2: Execution default-test of goal org.apache.maven.plugins:maven-surefire-plugin:2.19.1:test
failed: The forked VM terminated without properly saying goodbye. VM crash or System.exit
called?
[ERROR] Command was /bin/sh -c cd <https://builds.apache.org/job/Commons-configuration/ws/>
&& /usr/local/asfpackages/java/jdk1.7.0_80/jre/bin/java -jar <https://builds.apache.org/job/Commons-configuration/ws/target/surefire/surefirebooter8878958259039767961.jar>
<https://builds.apache.org/job/Commons-configuration/ws/target/surefire/surefire3722643874762973885tmp>
<https://builds.apache.org/job/Commons-configuration/ws/target/surefire/surefire_02488123831361602657tmp>
[ERROR] -> [Help 1]
[ERROR] 
[ERROR] To see the full stack trace of the errors, re-run Maven with the -e switch.
[ERROR] Re-run Maven using the -X switch to enable full debug logging.
[ERROR] 
[ERROR] For more information about the errors and possible solutions, please read the following
articles:
[ERROR] [Help 1] http://cwiki.apache.org/confluence/display/MAVEN/PluginExecutionException
[JENKINS] Archiving <https://builds.apache.org/job/Commons-configuration/ws/pom.xml>
to org.apache.commons/commons-configuration2/2.2-SNAPSHOT/commons-configuration2-2.2-SNAPSHOT.pom
Sending e-mails to: dev@commons.apache.org ggregory@apache.org
channel stopped

---------------------------------------------------------------------
To unsubscribe, e-mail: dev-unsubscribe@commons.apache.org
For additional commands, e-mail: dev-help@commons.apache.org


Mime
View raw message