commons-dev mailing list archives

Site index · List index
Message view « Date » · « Thread »
Top « Date » · « Thread »
From Apache Jenkins Server <jenk...@builds.apache.org>
Subject Build failed in Jenkins: commons-jcs #186
Date Wed, 16 Nov 2016 10:55:46 GMT
See <https://builds.apache.org/job/commons-jcs/186/changes>

Changes:

[rmannibucau] JCS-168 ensure to keep CDI SPI file in default and cdi jar but not the nocdi
one

------------------------------------------
[...truncated 1527 lines...]
[INFO] Executing: /bin/sh -c cd '<https://builds.apache.org/job/commons-jcs/ws/commons-jcs-jcache-extras'>
&& 'svn' '--non-interactive' 'info'
[INFO] Working directory: <https://builds.apache.org/job/commons-jcs/ws/commons-jcs-jcache-extras>
[INFO] Storing buildNumber: 1769954 at timestamp: 1479293241794
[INFO] Executing: /bin/sh -c cd '<https://builds.apache.org/job/commons-jcs/ws/commons-jcs-jcache-extras'>
&& 'svn' '--non-interactive' 'info'
[INFO] Working directory: <https://builds.apache.org/job/commons-jcs/ws/commons-jcs-jcache-extras>
[INFO] Storing buildScmBranch: trunk
[INFO] 
[INFO] --- maven-resources-plugin:2.7:resources (default-resources) @ commons-jcs-jcache-extras
---
[INFO] Using 'UTF-8' encoding to copy filtered resources.
[INFO] Copying 1 resource to <https://builds.apache.org/job/commons-jcs/ws/commons-jcs-jcache-extras/target/classes>
[INFO] Copying 3 resources
[INFO] 
[INFO] --- maven-compiler-plugin:3.5.1:compile (default-compile) @ commons-jcs-jcache-extras
---
[INFO] Changes detected - recompiling the module!
[INFO] Compiling 13 source files to <https://builds.apache.org/job/commons-jcs/ws/commons-jcs-jcache-extras/target/classes>
[INFO] <https://builds.apache.org/job/commons-jcs/ws/commons-jcs-jcache-extras/src/main/java/org/apache/commons/jcs/jcache/extras/cdi/CacheProviderBean.java>:
Some input files use or override a deprecated API.
[INFO] <https://builds.apache.org/job/commons-jcs/ws/commons-jcs-jcache-extras/src/main/java/org/apache/commons/jcs/jcache/extras/cdi/CacheProviderBean.java>:
Recompile with -Xlint:deprecation for details.
[INFO] 
[INFO] --- maven-bundle-plugin:3.0.1:manifest (bundle-manifest) @ commons-jcs-jcache-extras
---
[INFO] 
[INFO] --- animal-sniffer-maven-plugin:1.15:check (checkAPIcompatibility) @ commons-jcs-jcache-extras
---
[INFO] Checking unresolved references to org.codehaus.mojo.signature:java16:1.0
[INFO] 
[INFO] --- maven-resources-plugin:2.7:testResources (default-testResources) @ commons-jcs-jcache-extras
---
[INFO] Using 'UTF-8' encoding to copy filtered resources.
[INFO] Copying 1 resource
[INFO] Copying 0 resource to META-INF
[INFO] Copying 3 resources
[INFO] 
[INFO] --- maven-compiler-plugin:3.5.1:testCompile (default-testCompile) @ commons-jcs-jcache-extras
---
[INFO] Changes detected - recompiling the module!
[INFO] Compiling 7 source files to <https://builds.apache.org/job/commons-jcs/ws/commons-jcs-jcache-extras/target/test-classes>
[INFO] <https://builds.apache.org/job/commons-jcs/ws/commons-jcs-jcache-extras/src/test/java/org/apache/commons/jcs/jcache/extras/writer/CompositeCacheWriterTest.java>:
Some input files use unchecked or unsafe operations.
[INFO] <https://builds.apache.org/job/commons-jcs/ws/commons-jcs-jcache-extras/src/test/java/org/apache/commons/jcs/jcache/extras/writer/CompositeCacheWriterTest.java>:
Recompile with -Xlint:unchecked for details.
[INFO] 
[INFO] --- maven-surefire-plugin:2.19.1:test (default-test) @ commons-jcs-jcache-extras ---
[JENKINS] Recording test results
[INFO] 
[INFO] --- maven-jar-plugin:2.6:jar (default-jar) @ commons-jcs-jcache-extras ---
[INFO] Building jar: <https://builds.apache.org/job/commons-jcs/ws/commons-jcs-jcache-extras/target/commons-jcs-jcache-extras-2.0-SNAPSHOT.jar>
[INFO] 
[INFO] --- maven-site-plugin:3.4:attach-descriptor (attach-descriptor) @ commons-jcs-jcache-extras
---
[INFO] 
[INFO] --- maven-install-plugin:2.5.2:install (default-install) @ commons-jcs-jcache-extras
---
[INFO] Installing <https://builds.apache.org/job/commons-jcs/ws/commons-jcs-jcache-extras/target/commons-jcs-jcache-extras-2.0-SNAPSHOT.jar>
to /home/jenkins/jenkins-slave/maven-repositories/1/org/apache/commons/commons-jcs-jcache-extras/2.0-SNAPSHOT/commons-jcs-jcache-extras-2.0-SNAPSHOT.jar
[INFO] Installing <https://builds.apache.org/job/commons-jcs/ws/commons-jcs-jcache-extras/pom.xml>
to /home/jenkins/jenkins-slave/maven-repositories/1/org/apache/commons/commons-jcs-jcache-extras/2.0-SNAPSHOT/commons-jcs-jcache-extras-2.0-SNAPSHOT.pom
[INFO]                                                                         
[INFO] ------------------------------------------------------------------------
[INFO] Building Apache Commons JCS :: JCache OpenJPA 2.0-SNAPSHOT
[INFO] ------------------------------------------------------------------------
Downloading: http://repo.maven.apache.org/maven2/org/apache/openjpa/openjpa/2.3.0/openjpa-2.3.0.pom
Downloaded: http://repo.maven.apache.org/maven2/org/apache/openjpa/openjpa/2.3.0/openjpa-2.3.0.pom
(8 KB at 51.5 KB/sec)
Downloading: http://repo.maven.apache.org/maven2/org/apache/openjpa/openjpa-parent/2.3.0/openjpa-parent-2.3.0.pom
Downloaded: http://repo.maven.apache.org/maven2/org/apache/openjpa/openjpa-parent/2.3.0/openjpa-parent-2.3.0.pom
(52 KB at 530.3 KB/sec)
Downloading: http://repo.maven.apache.org/maven2/org/apache/xbean/xbean-asm4-shaded/3.14/xbean-asm4-shaded-3.14.pom
Downloaded: http://repo.maven.apache.org/maven2/org/apache/xbean/xbean-asm4-shaded/3.14/xbean-asm4-shaded-3.14.pom
(3 KB at 27.2 KB/sec)
Downloading: http://repo.maven.apache.org/maven2/org/apache/xbean/xbean/3.14/xbean-3.14.pom
Downloaded: http://repo.maven.apache.org/maven2/org/apache/xbean/xbean/3.14/xbean-3.14.pom
(18 KB at 953.1 KB/sec)
Downloading: http://repo.maven.apache.org/maven2/org/apache/openjpa/openjpa/2.3.0/openjpa-2.3.0.jar
Downloading: http://repo.maven.apache.org/maven2/org/apache/xbean/xbean-asm4-shaded/3.14/xbean-asm4-shaded-3.14.jar
Downloaded: http://repo.maven.apache.org/maven2/org/apache/xbean/xbean-asm4-shaded/3.14/xbean-asm4-shaded-3.14.jar
(126 KB at 688.8 KB/sec)
Downloaded: http://repo.maven.apache.org/maven2/org/apache/openjpa/openjpa/2.3.0/openjpa-2.3.0.jar
(4587 KB at 9555.6 KB/sec)
[INFO] 
[INFO] --- maven-clean-plugin:3.0.0:clean (default-clean) @ commons-jcs-jcache-openjpa ---
[INFO] 
[INFO] --- maven-enforcer-plugin:1.4.1:enforce (enforce-maven-3) @ commons-jcs-jcache-openjpa
---
[INFO] 
[INFO] --- build-helper-maven-plugin:1.10:parse-version (parse-version) @ commons-jcs-jcache-openjpa
---
[INFO] 
[INFO] --- maven-antrun-plugin:1.8:run (javadoc.resources) @ commons-jcs-jcache-openjpa ---
[INFO] Skipping Antrun execution
[INFO] 
[INFO] --- maven-remote-resources-plugin:1.5:process (default) @ commons-jcs-jcache-openjpa
---
[INFO] 
[INFO] --- buildnumber-maven-plugin:1.4:create (default) @ commons-jcs-jcache-openjpa ---
[INFO] Executing: /bin/sh -c cd '<https://builds.apache.org/job/commons-jcs/ws/commons-jcs-jcache-openjpa'>
&& 'svn' '--non-interactive' 'info'
[INFO] Working directory: <https://builds.apache.org/job/commons-jcs/ws/commons-jcs-jcache-openjpa>
[INFO] Storing buildNumber: 1769954 at timestamp: 1479293250685
[INFO] Executing: /bin/sh -c cd '<https://builds.apache.org/job/commons-jcs/ws/commons-jcs-jcache-openjpa'>
&& 'svn' '--non-interactive' 'info'
[INFO] Working directory: <https://builds.apache.org/job/commons-jcs/ws/commons-jcs-jcache-openjpa>
[INFO] Storing buildScmBranch: trunk
[INFO] 
[INFO] --- maven-resources-plugin:2.7:resources (default-resources) @ commons-jcs-jcache-openjpa
---
[INFO] Using 'UTF-8' encoding to copy filtered resources.
[INFO] Copying 1 resource to <https://builds.apache.org/job/commons-jcs/ws/commons-jcs-jcache-openjpa/target/classes>
[INFO] Copying 3 resources
[INFO] 
[INFO] --- maven-compiler-plugin:3.5.1:compile (default-compile) @ commons-jcs-jcache-openjpa
---
[INFO] Changes detected - recompiling the module!
[INFO] Compiling 4 source files to <https://builds.apache.org/job/commons-jcs/ws/commons-jcs-jcache-openjpa/target/classes>
[INFO] 
[INFO] --- maven-bundle-plugin:3.0.1:manifest (bundle-manifest) @ commons-jcs-jcache-openjpa
---
[INFO] 
[INFO] --- animal-sniffer-maven-plugin:1.15:check (checkAPIcompatibility) @ commons-jcs-jcache-openjpa
---
[INFO] Checking unresolved references to org.codehaus.mojo.signature:java16:1.0
[INFO] 
[INFO] --- maven-resources-plugin:2.7:testResources (default-testResources) @ commons-jcs-jcache-openjpa
---
[INFO] Using 'UTF-8' encoding to copy filtered resources.
[INFO] skip non existing resourceDirectory <https://builds.apache.org/job/commons-jcs/ws/commons-jcs-jcache-openjpa/src/test/resources>
[INFO] Copying 0 resource to META-INF
[INFO] Copying 3 resources
[INFO] 
[INFO] --- maven-compiler-plugin:3.5.1:testCompile (default-testCompile) @ commons-jcs-jcache-openjpa
---
[INFO] Changes detected - recompiling the module!
[INFO] Compiling 1 source file to <https://builds.apache.org/job/commons-jcs/ws/commons-jcs-jcache-openjpa/target/test-classes>
[INFO] 
[INFO] --- maven-surefire-plugin:2.19.1:test (default-test) @ commons-jcs-jcache-openjpa ---
[JENKINS] Recording test results
[INFO] 
[INFO] --- maven-jar-plugin:2.6:jar (default-jar) @ commons-jcs-jcache-openjpa ---
[INFO] Building jar: <https://builds.apache.org/job/commons-jcs/ws/commons-jcs-jcache-openjpa/target/commons-jcs-jcache-openjpa-2.0-SNAPSHOT.jar>
[INFO] 
[INFO] --- maven-site-plugin:3.4:attach-descriptor (attach-descriptor) @ commons-jcs-jcache-openjpa
---
[INFO] 
[INFO] --- maven-install-plugin:2.5.2:install (default-install) @ commons-jcs-jcache-openjpa
---
[INFO] Installing <https://builds.apache.org/job/commons-jcs/ws/commons-jcs-jcache-openjpa/target/commons-jcs-jcache-openjpa-2.0-SNAPSHOT.jar>
to /home/jenkins/jenkins-slave/maven-repositories/1/org/apache/commons/commons-jcs-jcache-openjpa/2.0-SNAPSHOT/commons-jcs-jcache-openjpa-2.0-SNAPSHOT.jar
[INFO] Installing <https://builds.apache.org/job/commons-jcs/ws/commons-jcs-jcache-openjpa/pom.xml>
to /home/jenkins/jenkins-slave/maven-repositories/1/org/apache/commons/commons-jcs-jcache-openjpa/2.0-SNAPSHOT/commons-jcs-jcache-openjpa-2.0-SNAPSHOT.pom
[INFO]                                                                         
[INFO] ------------------------------------------------------------------------
[INFO] Building Apache Commons JCS :: Distribution 2.0-SNAPSHOT
[INFO] ------------------------------------------------------------------------
[INFO] 
[INFO] --- maven-clean-plugin:3.0.0:clean (default-clean) @ commons-jcs-dist ---
[INFO] 
[INFO] --- maven-enforcer-plugin:1.4.1:enforce (enforce-maven-3) @ commons-jcs-dist ---
[INFO] 
[INFO] --- build-helper-maven-plugin:1.10:parse-version (parse-version) @ commons-jcs-dist
---
[INFO] 
[INFO] --- maven-antrun-plugin:1.8:run (javadoc.resources) @ commons-jcs-dist ---
[INFO] Skipping Antrun execution
[INFO] 
[INFO] --- maven-remote-resources-plugin:1.5:process (default) @ commons-jcs-dist ---
[INFO] 
[INFO] --- buildnumber-maven-plugin:1.4:create (default) @ commons-jcs-dist ---
[INFO] Executing: /bin/sh -c cd '<https://builds.apache.org/job/commons-jcs/ws/commons-jcs-dist'>
&& 'svn' '--non-interactive' 'info'
[INFO] Working directory: <https://builds.apache.org/job/commons-jcs/ws/commons-jcs-dist>
[INFO] Storing buildNumber: 1769954 at timestamp: 1479293261917
[INFO] Executing: /bin/sh -c cd '<https://builds.apache.org/job/commons-jcs/ws/commons-jcs-dist'>
&& 'svn' '--non-interactive' 'info'
[INFO] Working directory: <https://builds.apache.org/job/commons-jcs/ws/commons-jcs-dist>
[INFO] Storing buildScmBranch: trunk
[INFO] 
[INFO] --- maven-bundle-plugin:3.0.1:manifest (bundle-manifest) @ commons-jcs-dist ---
[WARNING] Ignoring project type pom - supportedProjectTypes = [jar, bundle]
[INFO] 
[INFO] --- animal-sniffer-maven-plugin:1.15:check (checkAPIcompatibility) @ commons-jcs-dist
---
[INFO] Checking unresolved references to org.codehaus.mojo.signature:java16:1.0
[INFO] 
[INFO] --- maven-site-plugin:3.4:attach-descriptor (attach-descriptor) @ commons-jcs-dist
---
[INFO] 
[INFO] --- maven-install-plugin:2.5.2:install (default-install) @ commons-jcs-dist ---
[INFO] Installing <https://builds.apache.org/job/commons-jcs/ws/commons-jcs-dist/pom.xml>
to /home/jenkins/jenkins-slave/maven-repositories/1/org/apache/commons/commons-jcs-dist/2.0-SNAPSHOT/commons-jcs-dist-2.0-SNAPSHOT.pom
[INFO] ------------------------------------------------------------------------
[INFO] Reactor Summary:
[INFO] 
[INFO] Apache Commons JCS ................................ SUCCESS [13.150s]
[INFO] Apache Commons JCS :: Core ........................ SUCCESS [1:03.547s]
[INFO] Apache Commons JCS :: JCache ...................... SUCCESS [9.052s]
[INFO] Apache Commons JCS :: JCache TCK .................. SUCCESS [6.328s]
[INFO] Apache Commons JCS :: JCache Extras ............... SUCCESS [8.651s]
[INFO] Apache Commons JCS :: JCache OpenJPA .............. SUCCESS [7.232s]
[INFO] Apache Commons JCS :: Distribution ................ SUCCESS [4.268s]
[INFO] ------------------------------------------------------------------------
[INFO] BUILD SUCCESS
[INFO] ------------------------------------------------------------------------
[INFO] Total time: 2:33.370s
[INFO] Finished at: Wed Nov 16 10:47:47 UTC 2016
[INFO] Final Memory: 36M/288M
[INFO] ------------------------------------------------------------------------
Waiting for Jenkins to finish collecting data
[JENKINS] Archiving <https://builds.apache.org/job/commons-jcs/ws/pom.xml> to org.apache.commons/commons-jcs/2.0-SNAPSHOT/commons-jcs-2.0-SNAPSHOT.pom
[JENKINS] Archiving <https://builds.apache.org/job/commons-jcs/ws/target/commons-jcs-2.0-SNAPSHOT-site.xml>
to org.apache.commons/commons-jcs/2.0-SNAPSHOT/commons-jcs-2.0-SNAPSHOT-site.xml
[JENKINS] Archiving <https://builds.apache.org/job/commons-jcs/ws/commons-jcs-core/pom.xml>
to org.apache.commons/commons-jcs-core/2.0-SNAPSHOT/commons-jcs-core-2.0-SNAPSHOT.pom
[JENKINS] Archiving <https://builds.apache.org/job/commons-jcs/ws/commons-jcs-core/target/commons-jcs-core-2.0-SNAPSHOT.jar>
to org.apache.commons/commons-jcs-core/2.0-SNAPSHOT/commons-jcs-core-2.0-SNAPSHOT.jar
[JENKINS] Archiving <https://builds.apache.org/job/commons-jcs/ws/commons-jcs-core/target/commons-jcs-core-2.0-SNAPSHOT-tests.jar>
to org.apache.commons/commons-jcs-core/2.0-SNAPSHOT/commons-jcs-core-2.0-SNAPSHOT-tests.jar
[JENKINS] Archiving <https://builds.apache.org/job/commons-jcs/ws/commons-jcs-jcache-extras/pom.xml>
to org.apache.commons/commons-jcs-jcache-extras/2.0-SNAPSHOT/commons-jcs-jcache-extras-2.0-SNAPSHOT.pom
[JENKINS] Archiving <https://builds.apache.org/job/commons-jcs/ws/commons-jcs-jcache-extras/target/commons-jcs-jcache-extras-2.0-SNAPSHOT.jar>
to org.apache.commons/commons-jcs-jcache-extras/2.0-SNAPSHOT/commons-jcs-jcache-extras-2.0-SNAPSHOT.jar
[JENKINS] Archiving <https://builds.apache.org/job/commons-jcs/ws/commons-jcs-jcache-openjpa/pom.xml>
to org.apache.commons/commons-jcs-jcache-openjpa/2.0-SNAPSHOT/commons-jcs-jcache-openjpa-2.0-SNAPSHOT.pom
[JENKINS] Archiving <https://builds.apache.org/job/commons-jcs/ws/commons-jcs-jcache-openjpa/target/commons-jcs-jcache-openjpa-2.0-SNAPSHOT.jar>
to org.apache.commons/commons-jcs-jcache-openjpa/2.0-SNAPSHOT/commons-jcs-jcache-openjpa-2.0-SNAPSHOT.jar
[JENKINS] Archiving <https://builds.apache.org/job/commons-jcs/ws/commons-jcs-jcache/pom.xml>
to org.apache.commons/commons-jcs-jcache/2.0-SNAPSHOT/commons-jcs-jcache-2.0-SNAPSHOT.pom
[JENKINS] Archiving <https://builds.apache.org/job/commons-jcs/ws/commons-jcs-jcache/target/commons-jcs-jcache-2.0-SNAPSHOT.jar>
to org.apache.commons/commons-jcs-jcache/2.0-SNAPSHOT/commons-jcs-jcache-2.0-SNAPSHOT.jar
[JENKINS] Archiving <https://builds.apache.org/job/commons-jcs/ws/commons-jcs-jcache/target/commons-jcs-jcache-2.0-SNAPSHOT-cdi.jar>
to org.apache.commons/commons-jcs-jcache/2.0-SNAPSHOT/commons-jcs-jcache-2.0-SNAPSHOT-cdi.jar
[JENKINS] Archiving <https://builds.apache.org/job/commons-jcs/ws/commons-jcs-jcache/target/commons-jcs-jcache-2.0-SNAPSHOT-nocdi.jar>
to org.apache.commons/commons-jcs-jcache/2.0-SNAPSHOT/commons-jcs-jcache-2.0-SNAPSHOT-nocdi.jar
[JENKINS] Archiving <https://builds.apache.org/job/commons-jcs/ws/commons-jcs-dist/pom.xml>
to org.apache.commons/commons-jcs-dist/2.0-SNAPSHOT/commons-jcs-dist-2.0-SNAPSHOT.pom
[JENKINS] Archiving <https://builds.apache.org/job/commons-jcs/ws/commons-jcs-tck-tests/pom.xml>
to org.apache.commons/commons-jcs-jcache-tck/2.0-SNAPSHOT/commons-jcs-jcache-tck-2.0-SNAPSHOT.pom
[JENKINS] Archiving <https://builds.apache.org/job/commons-jcs/ws/commons-jcs-tck-tests/target/commons-jcs-jcache-tck-2.0-SNAPSHOT.jar>
to org.apache.commons/commons-jcs-jcache-tck/2.0-SNAPSHOT/commons-jcs-jcache-tck-2.0-SNAPSHOT.jar
channel stopped
Maven RedeployPublisher use remote H16 maven settings from : /home/jenkins/.m2/settings.xml
[INFO] Deployment in https://repository.apache.org/content/repositories/snapshots (id=apache.snapshots.https,uniqueVersion=true)
Deploying the main artifact commons-jcs-2.0-SNAPSHOT.pom
Downloading: https://repository.apache.org/content/repositories/snapshots/org/apache/commons/commons-jcs/2.0-SNAPSHOT/maven-metadata.xml
ERROR: Failed to retrieve remote metadata org.apache.commons:commons-jcs:2.0-SNAPSHOT/maven-metadata.xml:
Could not transfer metadata org.apache.commons:commons-jcs:2.0-SNAPSHOT/maven-metadata.xml
from/to apache.snapshots.https (https://repository.apache.org/content/repositories/snapshots):
Connection refused
org.apache.maven.artifact.deployer.ArtifactDeploymentException: Failed to retrieve remote
metadata org.apache.commons:commons-jcs:2.0-SNAPSHOT/maven-metadata.xml: Could not transfer
metadata org.apache.commons:commons-jcs:2.0-SNAPSHOT/maven-metadata.xml from/to apache.snapshots.https
(https://repository.apache.org/content/repositories/snapshots): Connection refused
	at org.apache.maven.artifact.deployer.DefaultArtifactDeployer.deploy(DefaultArtifactDeployer.java:143)
	at hudson.maven.reporters.MavenArtifactRecord.deploy(MavenArtifactRecord.java:193)
	at hudson.maven.RedeployPublisher.perform(RedeployPublisher.java:176)
	at hudson.tasks.BuildStepMonitor$1.perform(BuildStepMonitor.java:20)
	at hudson.model.AbstractBuild$AbstractBuildExecution.perform(AbstractBuild.java:779)
	at hudson.model.AbstractBuild$AbstractBuildExecution.performAllBuildSteps(AbstractBuild.java:720)
	at hudson.maven.MavenModuleSetBuild$MavenModuleSetBuildExecution.post2(MavenModuleSetBuild.java:1047)
	at hudson.model.AbstractBuild$AbstractBuildExecution.post(AbstractBuild.java:665)
	at hudson.model.Run.execute(Run.java:1766)
	at hudson.maven.MavenModuleSetBuild.run(MavenModuleSetBuild.java:531)
	at hudson.model.ResourceController.execute(ResourceController.java:98)
	at hudson.model.Executor.run(Executor.java:410)
Caused by: org.eclipse.aether.deployment.DeploymentException: Failed to retrieve remote metadata
org.apache.commons:commons-jcs:2.0-SNAPSHOT/maven-metadata.xml: Could not transfer metadata
org.apache.commons:commons-jcs:2.0-SNAPSHOT/maven-metadata.xml from/to apache.snapshots.https
(https://repository.apache.org/content/repositories/snapshots): Connection refused
	at org.eclipse.aether.internal.impl.DefaultDeployer.upload(DefaultDeployer.java:470)
	at org.eclipse.aether.internal.impl.DefaultDeployer.deploy(DefaultDeployer.java:314)
	at org.eclipse.aether.internal.impl.DefaultDeployer.deploy(DefaultDeployer.java:269)
	at org.eclipse.aether.internal.impl.DefaultRepositorySystem.deploy(DefaultRepositorySystem.java:413)
	at org.apache.maven.artifact.deployer.DefaultArtifactDeployer.deploy(DefaultArtifactDeployer.java:139)
	... 11 more
Caused by: org.eclipse.aether.transfer.MetadataTransferException: Could not transfer metadata
org.apache.commons:commons-jcs:2.0-SNAPSHOT/maven-metadata.xml from/to apache.snapshots.https
(https://repository.apache.org/content/repositories/snapshots): Connection refused
	at org.eclipse.aether.connector.wagon.WagonRepositoryConnector$5.wrap(WagonRepositoryConnector.java:995)
	at org.eclipse.aether.connector.wagon.WagonRepositoryConnector$5.wrap(WagonRepositoryConnector.java:983)
	at org.eclipse.aether.connector.wagon.WagonRepositoryConnector$GetTask.run(WagonRepositoryConnector.java:725)
	at org.eclipse.aether.util.concurrency.RunnableErrorForwarder$1.run(RunnableErrorForwarder.java:67)
	at java.util.concurrent.ThreadPoolExecutor.runWorker(ThreadPoolExecutor.java:1142)
	at java.util.concurrent.ThreadPoolExecutor$Worker.run(ThreadPoolExecutor.java:617)
	at java.lang.Thread.run(Thread.java:745)
Caused by: org.apache.maven.wagon.TransferFailedException: Connection refused
	at org.apache.maven.wagon.shared.http4.AbstractHttpClientWagon.fillInputData(AbstractHttpClientWagon.java:892)
	at org.apache.maven.wagon.StreamWagon.getInputStream(StreamWagon.java:116)
	at org.apache.maven.wagon.StreamWagon.getIfNewer(StreamWagon.java:88)
	at org.apache.maven.wagon.StreamWagon.get(StreamWagon.java:61)
	at org.eclipse.aether.connector.wagon.WagonRepositoryConnector$GetTask.run(WagonRepositoryConnector.java:660)
	... 4 more
Caused by: java.net.ConnectException: Connection refused
	at java.net.PlainSocketImpl.socketConnect(Native Method)
	at java.net.AbstractPlainSocketImpl.doConnect(AbstractPlainSocketImpl.java:345)
	at java.net.AbstractPlainSocketImpl.connectToAddress(AbstractPlainSocketImpl.java:206)
	at java.net.AbstractPlainSocketImpl.connect(AbstractPlainSocketImpl.java:188)
	at java.net.SocksSocketImpl.connect(SocksSocketImpl.java:392)
	at java.net.Socket.connect(Socket.java:589)
	at sun.security.ssl.SSLSocketImpl.connect(SSLSocketImpl.java:649)
	at org.apache.http.conn.ssl.SSLSocketFactory.connectSocket(SSLSocketFactory.java:532)
	at org.apache.http.conn.ssl.SSLSocketFactory.connectSocket(SSLSocketFactory.java:409)
	at org.apache.maven.wagon.shared.http4.ConfigurableSSLSocketFactoryDecorator.connectSocket(ConfigurableSSLSocketFactoryDecorator.java:64)
	at org.apache.http.impl.conn.DefaultClientConnectionOperator.openConnection(DefaultClientConnectionOperator.java:177)
	at org.apache.http.impl.conn.ManagedClientConnectionImpl.open(ManagedClientConnectionImpl.java:304)
	at org.apache.http.impl.client.DefaultRequestDirector.tryConnect(DefaultRequestDirector.java:611)
	at org.apache.http.impl.client.DefaultRequestDirector.execute(DefaultRequestDirector.java:446)
	at org.apache.http.impl.client.AbstractHttpClient.doExecute(AbstractHttpClient.java:882)
	at org.apache.http.impl.client.CloseableHttpClient.execute(CloseableHttpClient.java:82)
	at org.apache.http.impl.client.CloseableHttpClient.execute(CloseableHttpClient.java:55)
	at org.apache.maven.wagon.shared.http4.AbstractHttpClientWagon.execute(AbstractHttpClientWagon.java:746)
	at org.apache.maven.wagon.shared.http4.AbstractHttpClientWagon.fillInputData(AbstractHttpClientWagon.java:886)
	... 8 more
[INFO] Deployment failed after 9.6 sec
Build step 'Deploy artifacts to Maven repository' changed build result to FAILURE

---------------------------------------------------------------------
To unsubscribe, e-mail: dev-unsubscribe@commons.apache.org
For additional commands, e-mail: dev-help@commons.apache.org


Mime
View raw message