commons-dev mailing list archives

Site index · List index
Message view « Date » · « Thread »
Top « Date » · « Thread »
From Apache Jenkins Server <jenk...@builds.apache.org>
Subject Build failed in Jenkins: Commons-CRYPTO-JDK1.8 #132
Date Sat, 26 Nov 2016 09:17:19 GMT
See <https://builds.apache.org/job/Commons-CRYPTO-JDK1.8/132/changes>

Changes:

[beneritter] Fix broken JavaDoc link

[beneritter] Sort pom.xml elements

------------------------------------------
Started by an SCM change
[EnvInject] - Loading node environment variables.
Building remotely on H12 (ubuntu) in workspace <https://builds.apache.org/job/Commons-CRYPTO-JDK1.8/ws/>
 > git rev-parse --is-inside-work-tree # timeout=10
Fetching changes from the remote Git repository
 > git config remote.origin.url https://git-wip-us.apache.org/repos/asf/commons-crypto.git
# timeout=10
Fetching upstream changes from https://git-wip-us.apache.org/repos/asf/commons-crypto.git
 > git --version # timeout=10
 > git -c core.askpass=true fetch --tags --progress https://git-wip-us.apache.org/repos/asf/commons-crypto.git
+refs/heads/*:refs/remotes/origin/*
 > git rev-parse refs/remotes/origin/master^{commit} # timeout=10
 > git rev-parse refs/remotes/origin/origin/master^{commit} # timeout=10
Checking out Revision 87586f391b6c3d8532c61d453eaac7fa0e3f403d (refs/remotes/origin/master)
 > git config core.sparsecheckout # timeout=10
 > git checkout -f 87586f391b6c3d8532c61d453eaac7fa0e3f403d
 > git rev-list 9c0a452f7607dc8f41034133693e43c43fbdca11 # timeout=10
Setting MAVEN_3_0_4_HOME=/home/jenkins/tools/maven/apache-maven-3.0.4
Setting JDK_1_7_0_79_UNLIMITED_SECURITY__HOME=/home/jenkins/tools/java/jdk1.7.0_79-unlimited-security
Setting JDK1_8_0_66_UNLIMITED_SECURITY_HOME=/home/jenkins/tools/java/jdk1.8.0_66-unlimited-security
Parsing POMs
ERROR: Failed to parse POMs
java.io.IOException: remote file operation failed: <https://builds.apache.org/job/Commons-CRYPTO-JDK1.8/ws/>
at hudson.remoting.Channel@7cec34a:H12: hudson.remoting.ProxyException: hudson.maven.MavenModuleSetBuild$MavenExecutionException:
org.apache.maven.project.ProjectBuildingException: Some problems were encountered while processing
the POMs:
[ERROR] Malformed POM <https://builds.apache.org/job/Commons-CRYPTO-JDK1.8/ws/pom.xml>:
expected START_TAG or END_TAG not TEXT (position: TEXT seen ...<name>Apache Commons
Crypto</name>>\n  <d... @30:5)  @ <https://builds.apache.org/job/Commons-CRYPTO-JDK1.8/ws/pom.xml,>
line 30, column 5

	at hudson.FilePath.act(FilePath.java:1014)
	at hudson.FilePath.act(FilePath.java:996)
	at hudson.maven.MavenModuleSetBuild$MavenModuleSetBuildExecution.parsePoms(MavenModuleSetBuild.java:960)
	at hudson.maven.MavenModuleSetBuild$MavenModuleSetBuildExecution.doRun(MavenModuleSetBuild.java:679)
	at hudson.model.AbstractBuild$AbstractBuildExecution.run(AbstractBuild.java:534)
	at hudson.model.Run.execute(Run.java:1741)
	at hudson.maven.MavenModuleSetBuild.run(MavenModuleSetBuild.java:531)
	at hudson.model.ResourceController.execute(ResourceController.java:98)
	at hudson.model.Executor.run(Executor.java:410)
Caused by: hudson.remoting.ProxyException: hudson.maven.MavenModuleSetBuild$MavenExecutionException:
org.apache.maven.project.ProjectBuildingException: Some problems were encountered while processing
the POMs:
[ERROR] Malformed POM <https://builds.apache.org/job/Commons-CRYPTO-JDK1.8/ws/pom.xml>:
expected START_TAG or END_TAG not TEXT (position: TEXT seen ...<name>Apache Commons
Crypto</name>>\n  <d... @30:5)  @ <https://builds.apache.org/job/Commons-CRYPTO-JDK1.8/ws/pom.xml,>
line 30, column 5

	at hudson.maven.MavenModuleSetBuild$PomParser.invoke(MavenModuleSetBuild.java:1364)
	at hudson.maven.MavenModuleSetBuild$PomParser.invoke(MavenModuleSetBuild.java:1098)
	at hudson.FilePath$FileCallableWrapper.call(FilePath.java:2772)
	at hudson.remoting.UserRequest.perform(UserRequest.java:153)
	at hudson.remoting.UserRequest.perform(UserRequest.java:50)
	at hudson.remoting.Request$2.run(Request.java:332)
	at hudson.remoting.InterceptingExecutorService$1.call(InterceptingExecutorService.java:68)
	at java.util.concurrent.FutureTask.run(FutureTask.java:262)
	at java.util.concurrent.ThreadPoolExecutor.runWorker(ThreadPoolExecutor.java:1145)
	at java.util.concurrent.ThreadPoolExecutor$Worker.run(ThreadPoolExecutor.java:615)
	at java.lang.Thread.run(Thread.java:745)
	at ......remote call to H12(Native Method)
	at hudson.remoting.Channel.attachCallSiteStackTrace(Channel.java:1416)
	at hudson.remoting.UserResponse.retrieve(UserRequest.java:253)
	at hudson.remoting.Channel.call(Channel.java:781)
	at hudson.FilePath.act(FilePath.java:1007)
	... 8 more
Caused by: hudson.remoting.ProxyException: org.apache.maven.project.ProjectBuildingException:
Some problems were encountered while processing the POMs:
[ERROR] Malformed POM <https://builds.apache.org/job/Commons-CRYPTO-JDK1.8/ws/pom.xml>:
expected START_TAG or END_TAG not TEXT (position: TEXT seen ...<name>Apache Commons
Crypto</name>>\n  <d... @30:5)  @ <https://builds.apache.org/job/Commons-CRYPTO-JDK1.8/ws/pom.xml,>
line 30, column 5

	at org.apache.maven.project.DefaultProjectBuilder.build(DefaultProjectBuilder.java:364)
	at hudson.maven.MavenEmbedder.buildProjects(MavenEmbedder.java:361)
	at hudson.maven.MavenEmbedder.readProjects(MavenEmbedder.java:331)
	at hudson.maven.MavenModuleSetBuild$PomParser.invoke(MavenModuleSetBuild.java:1301)
	at hudson.maven.MavenModuleSetBuild$PomParser.invoke(MavenModuleSetBuild.java:1098)
	at hudson.FilePath$FileCallableWrapper.call(FilePath.java:2772)
	at hudson.remoting.UserRequest.perform(UserRequest.java:153)
	at hudson.remoting.UserRequest.perform(UserRequest.java:50)
	at hudson.remoting.Request$2.run(Request.java:332)
	at hudson.remoting.InterceptingExecutorService$1.call(InterceptingExecutorService.java:68)
	at java.util.concurrent.FutureTask.run(FutureTask.java:262)
	at java.util.concurrent.ThreadPoolExecutor.runWorker(ThreadPoolExecutor.java:1145)
	at java.util.concurrent.ThreadPoolExecutor$Worker.run(ThreadPoolExecutor.java:615)
	at java.lang.Thread.run(Thread.java:745)
Setting MAVEN_3_0_4_HOME=/home/jenkins/tools/maven/apache-maven-3.0.4
Setting JDK_1_7_0_79_UNLIMITED_SECURITY__HOME=/home/jenkins/tools/java/jdk1.7.0_79-unlimited-security
Setting JDK1_8_0_66_UNLIMITED_SECURITY_HOME=/home/jenkins/tools/java/jdk1.8.0_66-unlimited-security

---------------------------------------------------------------------
To unsubscribe, e-mail: dev-unsubscribe@commons.apache.org
For additional commands, e-mail: dev-help@commons.apache.org


Mime
View raw message