commons-dev mailing list archives

Site index · List index
Message view « Date » · « Thread »
Top « Date » · « Thread »
From Apache Jenkins Server <jenk...@builds.apache.org>
Subject Build failed in Jenkins: Commons-Lang #66
Date Sun, 23 Oct 2016 17:53:27 GMT
See <https://builds.apache.org/job/Commons-Lang/66/changes>

Changes:

[pascalschumacher] StringUtils#replacePattern: fix source code formatting

[ggregory] [LANG-1144]

[ggregory] Order entries by type.

[ggregory] [LANG-1279] Update Java requirement from Java 6 to 7.

------------------------------------------
Started by an SCM change
[EnvInject] - Loading node environment variables.
Building remotely on beam1 (beam) in workspace <https://builds.apache.org/job/Commons-Lang/ws/>
 > git rev-parse --is-inside-work-tree # timeout=10
Fetching changes from the remote Git repository
 > git config remote.origin.url https://git-wip-us.apache.org/repos/asf/commons-lang.git
# timeout=10
Fetching upstream changes from https://git-wip-us.apache.org/repos/asf/commons-lang.git
 > git --version # timeout=10
 > git -c core.askpass=true fetch --tags --progress https://git-wip-us.apache.org/repos/asf/commons-lang.git
+refs/heads/*:refs/remotes/origin/*
 > git rev-parse refs/remotes/origin/master^{commit} # timeout=10
 > git rev-parse refs/remotes/origin/origin/master^{commit} # timeout=10
Checking out Revision 7e8df326f4e66bd4bc38d8d4626700e4cf338ea5 (refs/remotes/origin/master)
 > git config core.sparsecheckout # timeout=10
 > git checkout -f 7e8df326f4e66bd4bc38d8d4626700e4cf338ea5
 > git rev-list 65ed41ff7a8cfb0bbc03620e186382a16e23db56 # timeout=10
Parsing POMs
Established TCP socket on 34387
maven32-agent.jar already up to date
maven32-interceptor.jar already up to date
maven3-interceptor-commons.jar already up to date
[Commons-Lang] $ /home/jenkins/tools/java/latest1.6/bin/java -Xmx2g -Xms256m -XX:MaxPermSize=512m
-cp /home/jenkins/jenkins-slave/maven32-agent.jar:/home/jenkins/tools/maven/apache-maven-3.2.5/boot/plexus-classworlds-2.5.2.jar:/home/jenkins/tools/maven/apache-maven-3.2.5/conf/logging
jenkins.maven3.agent.Maven32Main /home/jenkins/tools/maven/apache-maven-3.2.5 /home/jenkins/jenkins-slave/slave.jar
/home/jenkins/jenkins-slave/maven32-interceptor.jar /home/jenkins/jenkins-slave/maven3-interceptor-commons.jar
34387
<===[JENKINS REMOTING CAPACITY]===>   channel started
ERROR: [JENKINS-18403] JDK 5 not supported to run Maven; retrying with slave Java and setting
compile/test properties to point to /home/jenkins/tools/java/latest1.6
Established TCP socket on 50228
maven32-agent.jar already up to date
maven32-interceptor.jar already up to date
maven3-interceptor-commons.jar already up to date
[Commons-Lang] $ /usr/local/jenkins/java/jdk1.7.0_55/jre/bin/java -Xmx2g -Xms256m -XX:MaxPermSize=512m
-cp /home/jenkins/jenkins-slave/maven32-agent.jar:/home/jenkins/tools/maven/apache-maven-3.2.5/boot/plexus-classworlds-2.5.2.jar:/home/jenkins/tools/maven/apache-maven-3.2.5/conf/logging
jenkins.maven3.agent.Maven32Main /home/jenkins/tools/maven/apache-maven-3.2.5 /home/jenkins/jenkins-slave/slave.jar
/home/jenkins/jenkins-slave/maven32-interceptor.jar /home/jenkins/jenkins-slave/maven3-interceptor-commons.jar
50228
<===[JENKINS REMOTING CAPACITY]===>   channel started
Executing Maven:  -B -f <https://builds.apache.org/job/Commons-Lang/ws/pom.xml> -Dmaven.repo.local=/home/jenkins/jenkins-slave/maven-repositories/1
clean install javadoc:javadoc --batch-mode -Dgpg.skip -Prelease
[INFO] Scanning for projects...
[INFO]                                                                         
[INFO] ------------------------------------------------------------------------
[INFO] Building Apache Commons Lang 3.6-SNAPSHOT
[INFO] ------------------------------------------------------------------------
[INFO] 
[INFO] --- maven-clean-plugin:3.0.0:clean (default-clean) @ commons-lang3 ---
[INFO] Deleting <https://builds.apache.org/job/Commons-Lang/ws/target>
[INFO] 
[INFO] --- maven-enforcer-plugin:1.4.1:enforce (enforce-maven-3) @ commons-lang3 ---
[INFO] 
[INFO] --- build-helper-maven-plugin:1.10:parse-version (parse-version) @ commons-lang3 ---
[INFO] 
[INFO] --- maven-antrun-plugin:1.8:run (javadoc.resources) @ commons-lang3 ---
[INFO] Executing tasks

main:
     [copy] Copying 2 files to <https://builds.apache.org/job/Commons-Lang/ws/target/apidocs/META-INF>
[INFO] Executed tasks
[INFO] 
[INFO] --- maven-remote-resources-plugin:1.5:process (process-resource-bundles) @ commons-lang3
---
[INFO] 
[INFO] --- buildnumber-maven-plugin:1.4:create (default) @ commons-lang3 ---
[INFO] Executing: /bin/sh -c cd '<https://builds.apache.org/job/Commons-Lang/ws/'> &&
'git' 'rev-parse' '--verify' 'HEAD'
[INFO] Working directory: <https://builds.apache.org/job/Commons-Lang/ws/>
[INFO] Storing buildNumber: 7e8df326f4e66bd4bc38d8d4626700e4cf338ea5 at timestamp: 1477245179264
[WARNING] Cannot get the branch information from the git repository: 
Detecting the current branch failed: fatal: ref HEAD is not a symbolic ref

[INFO] Executing: /bin/sh -c cd '<https://builds.apache.org/job/Commons-Lang/ws/'> &&
'git' 'rev-parse' '--verify' 'HEAD'
[INFO] Working directory: <https://builds.apache.org/job/Commons-Lang/ws/>
[INFO] Storing buildScmBranch: UNKNOWN
[INFO] 
[INFO] --- maven-resources-plugin:2.7:resources (default-resources) @ commons-lang3 ---
[INFO] Using 'ISO-8859-1' encoding to copy filtered resources.
[INFO] skip non existing resourceDirectory <https://builds.apache.org/job/Commons-Lang/ws/src/main/resources>
[INFO] Copying 2 resources to META-INF
[INFO] 
[INFO] --- maven-compiler-plugin:3.5.1:compile (default-compile) @ commons-lang3 ---
[INFO] Changes detected - recompiling the module!
[INFO] Compiling 143 source files to <https://builds.apache.org/job/Commons-Lang/ws/target/classes>
[INFO] <https://builds.apache.org/job/Commons-Lang/ws/src/main/java/org/apache/commons/lang3/time/FastDatePrinter.java>:
Some input files use or override a deprecated API.
[INFO] <https://builds.apache.org/job/Commons-Lang/ws/src/main/java/org/apache/commons/lang3/time/FastDatePrinter.java>:
Recompile with -Xlint:deprecation for details.
[INFO] <https://builds.apache.org/job/Commons-Lang/ws/src/main/java/org/apache/commons/lang3/StringUtils.java>:
Some input files use unchecked or unsafe operations.
[INFO] <https://builds.apache.org/job/Commons-Lang/ws/src/main/java/org/apache/commons/lang3/StringUtils.java>:
Recompile with -Xlint:unchecked for details.
[INFO] 
[INFO] --- maven-bundle-plugin:3.0.1:manifest (bundle-manifest) @ commons-lang3 ---
[INFO] 
[INFO] --- animal-sniffer-maven-plugin:1.15:check (checkAPIcompatibility) @ commons-lang3
---
[INFO] Checking unresolved references to org.codehaus.mojo.signature:java17:1.0
[INFO] 
[INFO] --- maven-resources-plugin:2.7:testResources (default-testResources) @ commons-lang3
---
[INFO] Using 'ISO-8859-1' encoding to copy filtered resources.
[INFO] Copying 2 resources
[INFO] Copying 2 resources to META-INF
[INFO] 
[INFO] --- maven-compiler-plugin:3.5.1:testCompile (default-testCompile) @ commons-lang3 ---
[INFO] Changes detected - recompiling the module!
[INFO] Compiling 162 source files to <https://builds.apache.org/job/Commons-Lang/ws/target/test-classes>
[INFO] <https://builds.apache.org/job/Commons-Lang/ws/src/test/java/org/apache/commons/lang3/ArrayUtilsTest.java>:
<https://builds.apache.org/job/Commons-Lang/ws/src/test/java/org/apache/commons/lang3/ArrayUtilsTest.java>
uses unchecked or unsafe operations.
[INFO] <https://builds.apache.org/job/Commons-Lang/ws/src/test/java/org/apache/commons/lang3/ArrayUtilsTest.java>:
Recompile with -Xlint:unchecked for details.
[INFO] 
[INFO] --- maven-surefire-plugin:2.19.1:test (default-test) @ commons-lang3 ---

-------------------------------------------------------
 T E S T S
-------------------------------------------------------

Results :

Tests run: 0, Failures: 0, Errors: 0, Skipped: 0

[JENKINS] Recording test results
[INFO] ------------------------------------------------------------------------
[INFO] BUILD FAILURE
[INFO] ------------------------------------------------------------------------
[INFO] Total time: 18.394 s
[INFO] Finished at: 2016-10-23T17:53:13+00:00
[INFO] Final Memory: 40M/615M
[INFO] ------------------------------------------------------------------------
Waiting for Jenkins to finish collecting data
[ERROR] Failed to execute goal org.apache.maven.plugins:maven-surefire-plugin:2.19.1:test
(default-test) on project commons-lang3: Execution default-test of goal org.apache.maven.plugins:maven-surefire-plugin:2.19.1:test
failed: There was an error in the forked process
[ERROR] java.lang.UnsupportedClassVersionError: org/apache/commons/lang3/reflect/FieldUtilsTest
: Unsupported major.minor version 51.0
[ERROR] at java.lang.ClassLoader.defineClass1(Native Method)
[ERROR] at java.lang.ClassLoader.defineClassCond(ClassLoader.java:631)
[ERROR] at java.lang.ClassLoader.defineClass(ClassLoader.java:615)
[ERROR] at java.security.SecureClassLoader.defineClass(SecureClassLoader.java:141)
[ERROR] at java.net.URLClassLoader.defineClass(URLClassLoader.java:283)
[ERROR] at java.net.URLClassLoader.access$000(URLClassLoader.java:58)
[ERROR] at java.net.URLClassLoader$1.run(URLClassLoader.java:197)
[ERROR] at java.security.AccessController.doPrivileged(Native Method)
[ERROR] at java.net.URLClassLoader.findClass(URLClassLoader.java:190)
[ERROR] at java.lang.ClassLoader.loadClass(ClassLoader.java:306)
[ERROR] at sun.misc.Launcher$AppClassLoader.loadClass(Launcher.java:301)
[ERROR] at java.lang.ClassLoader.loadClass(ClassLoader.java:247)
[ERROR] at org.apache.maven.surefire.util.DefaultScanResult.loadClass(DefaultScanResult.java:131)
[ERROR] at org.apache.maven.surefire.util.DefaultScanResult.applyFilter(DefaultScanResult.java:96)
[ERROR] at org.apache.maven.surefire.junit4.JUnit4Provider.scanClassPath(JUnit4Provider.java:311)
[ERROR] at org.apache.maven.surefire.junit4.JUnit4Provider.setTestsToRun(JUnit4Provider.java:191)
[ERROR] at org.apache.maven.surefire.junit4.JUnit4Provider.invoke(JUnit4Provider.java:134)
[ERROR] at org.apache.maven.surefire.booter.ForkedBooter.invokeProviderInSameClassLoader(ForkedBooter.java:290)
[ERROR] at org.apache.maven.surefire.booter.ForkedBooter.runSuitesInProcess(ForkedBooter.java:242)
[ERROR] at org.apache.maven.surefire.booter.ForkedBooter.main(ForkedBooter.java:121)
[ERROR] -> [Help 1]
[ERROR] 
[ERROR] To see the full stack trace of the errors, re-run Maven with the -e switch.
[ERROR] Re-run Maven using the -X switch to enable full debug logging.
[ERROR] 
[ERROR] For more information about the errors and possible solutions, please read the following
articles:
[ERROR] [Help 1] http://cwiki.apache.org/confluence/display/MAVEN/PluginExecutionException
[JENKINS] Archiving <https://builds.apache.org/job/Commons-Lang/ws/pom.xml> to org.apache.commons/commons-lang3/3.6-SNAPSHOT/commons-lang3-3.6-SNAPSHOT.pom
Sending e-mails to: dev@commons.apache.org
channel stopped

---------------------------------------------------------------------
To unsubscribe, e-mail: dev-unsubscribe@commons.apache.org
For additional commands, e-mail: dev-help@commons.apache.org


Mime
View raw message