commons-dev mailing list archives

Site index · List index
Message view « Date » · « Thread »
Top « Date » · « Thread »
From Apache Jenkins Server <jenk...@builds.apache.org>
Subject Build failed in Jenkins: Commons-Lang » Apache Commons Lang #29
Date Sun, 11 Sep 2016 12:53:38 GMT
See <https://builds.apache.org/job/Commons-Lang/org.apache.commons$commons-lang3/29/changes>

Changes:

[beneritter] The behavior for empty arrays is documented in the @return JavaDoc tag

[beneritter] Revert "[LANG-1201] Add a TimeUnit-like classes for base 2 and base 10

[beneritter] Correct issue number for LANG-1120 in changes.xml

[britter] Revert "[LANG-1227] Add XMLCharacter class."

------------------------------------------
[...truncated 100 lines...]
  symbol:   class DigitalBase10SizeUnit
  location: package org.apache.commons.lang3
[ERROR] <https://builds.apache.org/job/Commons-Lang/org.apache.commons$commons-lang3/ws/src/test/java/org/apache/commons/lang3/DigitalBase10SizeUnitTest.java>:[21,1]
static import only from classes and interfaces
[ERROR] <https://builds.apache.org/job/Commons-Lang/org.apache.commons$commons-lang3/ws/src/test/java/org/apache/commons/lang3/DigitalBase10SizeUnitTest.java>:[22,39]
cannot find symbol
  symbol:   class DigitalBase10SizeUnit
  location: package org.apache.commons.lang3
[ERROR] <https://builds.apache.org/job/Commons-Lang/org.apache.commons$commons-lang3/ws/src/test/java/org/apache/commons/lang3/DigitalBase10SizeUnitTest.java>:[22,1]
static import only from classes and interfaces
[ERROR] <https://builds.apache.org/job/Commons-Lang/org.apache.commons$commons-lang3/ws/src/test/java/org/apache/commons/lang3/DigitalBase10SizeUnitTest.java>:[23,39]
cannot find symbol
  symbol:   class DigitalBase10SizeUnit
  location: package org.apache.commons.lang3
[ERROR] <https://builds.apache.org/job/Commons-Lang/org.apache.commons$commons-lang3/ws/src/test/java/org/apache/commons/lang3/DigitalBase10SizeUnitTest.java>:[23,1]
static import only from classes and interfaces
[ERROR] <https://builds.apache.org/job/Commons-Lang/org.apache.commons$commons-lang3/ws/src/test/java/org/apache/commons/lang3/DigitalBase10SizeUnitTest.java>:[24,39]
cannot find symbol
  symbol:   class DigitalBase10SizeUnit
  location: package org.apache.commons.lang3
[ERROR] <https://builds.apache.org/job/Commons-Lang/org.apache.commons$commons-lang3/ws/src/test/java/org/apache/commons/lang3/DigitalBase10SizeUnitTest.java>:[24,1]
static import only from classes and interfaces
[ERROR] <https://builds.apache.org/job/Commons-Lang/org.apache.commons$commons-lang3/ws/src/test/java/org/apache/commons/lang3/DigitalBase10SizeUnitTest.java>:[25,39]
cannot find symbol
  symbol:   class DigitalBase10SizeUnit
  location: package org.apache.commons.lang3
[ERROR] <https://builds.apache.org/job/Commons-Lang/org.apache.commons$commons-lang3/ws/src/test/java/org/apache/commons/lang3/DigitalBase10SizeUnitTest.java>:[25,1]
static import only from classes and interfaces
[ERROR] <https://builds.apache.org/job/Commons-Lang/org.apache.commons$commons-lang3/ws/src/test/java/org/apache/commons/lang3/DigitalBase2SizeUnitTest.java>:[34,32]
cannot find symbol
  symbol:   variable BITS
  location: class org.apache.commons.lang3.DigitalBase2SizeUnitTest
[ERROR] <https://builds.apache.org/job/Commons-Lang/org.apache.commons$commons-lang3/ws/src/test/java/org/apache/commons/lang3/DigitalBase2SizeUnitTest.java>:[35,33]
cannot find symbol
  symbol:   variable BYTES
  location: class org.apache.commons.lang3.DigitalBase2SizeUnitTest
[ERROR] <https://builds.apache.org/job/Commons-Lang/org.apache.commons$commons-lang3/ws/src/test/java/org/apache/commons/lang3/DigitalBase2SizeUnitTest.java>:[36,35]
cannot find symbol
  symbol:   variable KILOBYTES
  location: class org.apache.commons.lang3.DigitalBase2SizeUnitTest
[ERROR] <https://builds.apache.org/job/Commons-Lang/org.apache.commons$commons-lang3/ws/src/test/java/org/apache/commons/lang3/DigitalBase2SizeUnitTest.java>:[37,38]
cannot find symbol
  symbol:   variable MEGABYTES
  location: class org.apache.commons.lang3.DigitalBase2SizeUnitTest
[ERROR] <https://builds.apache.org/job/Commons-Lang/org.apache.commons$commons-lang3/ws/src/test/java/org/apache/commons/lang3/DigitalBase2SizeUnitTest.java>:[38,42]
cannot find symbol
  symbol:   variable GIGABYTES
  location: class org.apache.commons.lang3.DigitalBase2SizeUnitTest
[ERROR] <https://builds.apache.org/job/Commons-Lang/org.apache.commons$commons-lang3/ws/src/test/java/org/apache/commons/lang3/DigitalBase2SizeUnitTest.java>:[39,45]
cannot find symbol
  symbol:   variable TERABYTES
  location: class org.apache.commons.lang3.DigitalBase2SizeUnitTest
[ERROR] <https://builds.apache.org/job/Commons-Lang/org.apache.commons$commons-lang3/ws/src/test/java/org/apache/commons/lang3/DigitalBase2SizeUnitTest.java>:[41,49]
cannot find symbol
  symbol:   variable BYTES
  location: class org.apache.commons.lang3.DigitalBase2SizeUnitTest
[ERROR] <https://builds.apache.org/job/Commons-Lang/org.apache.commons$commons-lang3/ws/src/test/java/org/apache/commons/lang3/DigitalBase2SizeUnitTest.java>:[41,32]
cannot find symbol
  symbol:   variable BYTES
  location: class org.apache.commons.lang3.DigitalBase2SizeUnitTest
[ERROR] <https://builds.apache.org/job/Commons-Lang/org.apache.commons$commons-lang3/ws/src/test/java/org/apache/commons/lang3/DigitalBase2SizeUnitTest.java>:[42,52]
cannot find symbol
  symbol:   variable KILOBYTES
  location: class org.apache.commons.lang3.DigitalBase2SizeUnitTest
[ERROR] <https://builds.apache.org/job/Commons-Lang/org.apache.commons$commons-lang3/ws/src/test/java/org/apache/commons/lang3/DigitalBase2SizeUnitTest.java>:[42,35]
cannot find symbol
  symbol:   variable BYTES
  location: class org.apache.commons.lang3.DigitalBase2SizeUnitTest
[ERROR] <https://builds.apache.org/job/Commons-Lang/org.apache.commons$commons-lang3/ws/src/test/java/org/apache/commons/lang3/DigitalBase2SizeUnitTest.java>:[43,55]
cannot find symbol
  symbol:   variable MEGABYTES
  location: class org.apache.commons.lang3.DigitalBase2SizeUnitTest
[ERROR] <https://builds.apache.org/job/Commons-Lang/org.apache.commons$commons-lang3/ws/src/test/java/org/apache/commons/lang3/DigitalBase2SizeUnitTest.java>:[43,38]
cannot find symbol
  symbol:   variable BYTES
  location: class org.apache.commons.lang3.DigitalBase2SizeUnitTest
[ERROR] <https://builds.apache.org/job/Commons-Lang/org.apache.commons$commons-lang3/ws/src/test/java/org/apache/commons/lang3/DigitalBase2SizeUnitTest.java>:[44,59]
cannot find symbol
  symbol:   variable GIGABYTES
  location: class org.apache.commons.lang3.DigitalBase2SizeUnitTest
[ERROR] <https://builds.apache.org/job/Commons-Lang/org.apache.commons$commons-lang3/ws/src/test/java/org/apache/commons/lang3/DigitalBase2SizeUnitTest.java>:[44,42]
cannot find symbol
  symbol:   variable BYTES
  location: class org.apache.commons.lang3.DigitalBase2SizeUnitTest
[ERROR] <https://builds.apache.org/job/Commons-Lang/org.apache.commons$commons-lang3/ws/src/test/java/org/apache/commons/lang3/DigitalBase2SizeUnitTest.java>:[45,62]
cannot find symbol
  symbol:   variable TERABYTES
  location: class org.apache.commons.lang3.DigitalBase2SizeUnitTest
[ERROR] <https://builds.apache.org/job/Commons-Lang/org.apache.commons$commons-lang3/ws/src/test/java/org/apache/commons/lang3/DigitalBase2SizeUnitTest.java>:[45,45]
cannot find symbol
  symbol:   variable BYTES
  location: class org.apache.commons.lang3.DigitalBase2SizeUnitTest
[ERROR] <https://builds.apache.org/job/Commons-Lang/org.apache.commons$commons-lang3/ws/src/test/java/org/apache/commons/lang3/DigitalBase2SizeUnitTest.java>:[50,32]
cannot find symbol
  symbol:   variable BITS
  location: class org.apache.commons.lang3.DigitalBase2SizeUnitTest
[ERROR] <https://builds.apache.org/job/Commons-Lang/org.apache.commons$commons-lang3/ws/src/test/java/org/apache/commons/lang3/DigitalBase2SizeUnitTest.java>:[51,32]
cannot find symbol
  symbol:   variable BYTES
  location: class org.apache.commons.lang3.DigitalBase2SizeUnitTest
[ERROR] <https://builds.apache.org/job/Commons-Lang/org.apache.commons$commons-lang3/ws/src/test/java/org/apache/commons/lang3/DigitalBase2SizeUnitTest.java>:[52,35]
cannot find symbol
  symbol:   variable KILOBYTES
  location: class org.apache.commons.lang3.DigitalBase2SizeUnitTest
[ERROR] <https://builds.apache.org/job/Commons-Lang/org.apache.commons$commons-lang3/ws/src/test/java/org/apache/commons/lang3/DigitalBase2SizeUnitTest.java>:[53,38]
cannot find symbol
  symbol:   variable MEGABYTES
  location: class org.apache.commons.lang3.DigitalBase2SizeUnitTest
[ERROR] <https://builds.apache.org/job/Commons-Lang/org.apache.commons$commons-lang3/ws/src/test/java/org/apache/commons/lang3/DigitalBase2SizeUnitTest.java>:[54,42]
cannot find symbol
  symbol:   variable GIGABYTES
  location: class org.apache.commons.lang3.DigitalBase2SizeUnitTest
[ERROR] <https://builds.apache.org/job/Commons-Lang/org.apache.commons$commons-lang3/ws/src/test/java/org/apache/commons/lang3/DigitalBase2SizeUnitTest.java>:[55,45]
cannot find symbol
  symbol:   variable TERABYTES
  location: class org.apache.commons.lang3.DigitalBase2SizeUnitTest
[ERROR] <https://builds.apache.org/job/Commons-Lang/org.apache.commons$commons-lang3/ws/src/test/java/org/apache/commons/lang3/DigitalBase2SizeUnitTest.java>:[57,49]
cannot find symbol
  symbol:   variable BYTES
  location: class org.apache.commons.lang3.DigitalBase2SizeUnitTest
[ERROR] <https://builds.apache.org/job/Commons-Lang/org.apache.commons$commons-lang3/ws/src/test/java/org/apache/commons/lang3/DigitalBase2SizeUnitTest.java>:[57,32]
cannot find symbol
  symbol:   variable BYTES
  location: class org.apache.commons.lang3.DigitalBase2SizeUnitTest
[ERROR] <https://builds.apache.org/job/Commons-Lang/org.apache.commons$commons-lang3/ws/src/test/java/org/apache/commons/lang3/DigitalBase2SizeUnitTest.java>:[58,52]
cannot find symbol
  symbol:   variable KILOBYTES
  location: class org.apache.commons.lang3.DigitalBase2SizeUnitTest
[ERROR] <https://builds.apache.org/job/Commons-Lang/org.apache.commons$commons-lang3/ws/src/test/java/org/apache/commons/lang3/DigitalBase2SizeUnitTest.java>:[58,35]
cannot find symbol
  symbol:   variable BYTES
  location: class org.apache.commons.lang3.DigitalBase2SizeUnitTest
[ERROR] <https://builds.apache.org/job/Commons-Lang/org.apache.commons$commons-lang3/ws/src/test/java/org/apache/commons/lang3/DigitalBase2SizeUnitTest.java>:[59,55]
cannot find symbol
  symbol:   variable MEGABYTES
  location: class org.apache.commons.lang3.DigitalBase2SizeUnitTest
[ERROR] <https://builds.apache.org/job/Commons-Lang/org.apache.commons$commons-lang3/ws/src/test/java/org/apache/commons/lang3/DigitalBase2SizeUnitTest.java>:[59,38]
cannot find symbol
  symbol:   variable BYTES
  location: class org.apache.commons.lang3.DigitalBase2SizeUnitTest
[ERROR] <https://builds.apache.org/job/Commons-Lang/org.apache.commons$commons-lang3/ws/src/test/java/org/apache/commons/lang3/DigitalBase2SizeUnitTest.java>:[60,59]
cannot find symbol
  symbol:   variable GIGABYTES
  location: class org.apache.commons.lang3.DigitalBase2SizeUnitTest
[ERROR] <https://builds.apache.org/job/Commons-Lang/org.apache.commons$commons-lang3/ws/src/test/java/org/apache/commons/lang3/DigitalBase2SizeUnitTest.java>:[60,42]
cannot find symbol
  symbol:   variable BYTES
  location: class org.apache.commons.lang3.DigitalBase2SizeUnitTest
[ERROR] <https://builds.apache.org/job/Commons-Lang/org.apache.commons$commons-lang3/ws/src/test/java/org/apache/commons/lang3/DigitalBase2SizeUnitTest.java>:[61,62]
cannot find symbol
  symbol:   variable TERABYTES
  location: class org.apache.commons.lang3.DigitalBase2SizeUnitTest
[ERROR] <https://builds.apache.org/job/Commons-Lang/org.apache.commons$commons-lang3/ws/src/test/java/org/apache/commons/lang3/DigitalBase2SizeUnitTest.java>:[61,45]
cannot find symbol
  symbol:   variable BYTES
  location: class org.apache.commons.lang3.DigitalBase2SizeUnitTest
[ERROR] <https://builds.apache.org/job/Commons-Lang/org.apache.commons$commons-lang3/ws/src/test/java/org/apache/commons/lang3/DigitalBase2SizeUnitTest.java>:[66,32]
cannot find symbol
  symbol:   variable BYTES
  location: class org.apache.commons.lang3.DigitalBase2SizeUnitTest
[ERROR] <https://builds.apache.org/job/Commons-Lang/org.apache.commons$commons-lang3/ws/src/test/java/org/apache/commons/lang3/DigitalBase2SizeUnitTest.java>:[67,32]
cannot find symbol
  symbol:   variable KILOBYTES
  location: class org.apache.commons.lang3.DigitalBase2SizeUnitTest
[ERROR] <https://builds.apache.org/job/Commons-Lang/org.apache.commons$commons-lang3/ws/src/test/java/org/apache/commons/lang3/DigitalBase2SizeUnitTest.java>:[68,32]
cannot find symbol
  symbol:   variable MEGABYTES
  location: class org.apache.commons.lang3.DigitalBase2SizeUnitTest
[ERROR] <https://builds.apache.org/job/Commons-Lang/org.apache.commons$commons-lang3/ws/src/test/java/org/apache/commons/lang3/DigitalBase2SizeUnitTest.java>:[69,32]
cannot find symbol
  symbol:   variable GIGABYTES
  location: class org.apache.commons.lang3.DigitalBase2SizeUnitTest
[ERROR] <https://builds.apache.org/job/Commons-Lang/org.apache.commons$commons-lang3/ws/src/test/java/org/apache/commons/lang3/DigitalBase2SizeUnitTest.java>:[70,35]
cannot find symbol
  symbol:   variable TERABYTES
  location: class org.apache.commons.lang3.DigitalBase2SizeUnitTest
[ERROR] <https://builds.apache.org/job/Commons-Lang/org.apache.commons$commons-lang3/ws/src/test/java/org/apache/commons/lang3/DigitalBase2SizeUnitTest.java>:[72,63]
cannot find symbol
  symbol:   variable BYTES
  location: class org.apache.commons.lang3.DigitalBase2SizeUnitTest
[ERROR] <https://builds.apache.org/job/Commons-Lang/org.apache.commons$commons-lang3/ws/src/test/java/org/apache/commons/lang3/DigitalBase2SizeUnitTest.java>:[72,32]
cannot find symbol
  symbol:   variable GIGABYTES
  location: class org.apache.commons.lang3.DigitalBase2SizeUnitTest
[ERROR] <https://builds.apache.org/job/Commons-Lang/org.apache.commons$commons-lang3/ws/src/test/java/org/apache/commons/lang3/DigitalBase2SizeUnitTest.java>:[73,59]
cannot find symbol
  symbol:   variable KILOBYTES
  location: class org.apache.commons.lang3.DigitalBase2SizeUnitTest
[ERROR] <https://builds.apache.org/job/Commons-Lang/org.apache.commons$commons-lang3/ws/src/test/java/org/apache/commons/lang3/DigitalBase2SizeUnitTest.java>:[73,32]
cannot find symbol
  symbol:   variable GIGABYTES
  location: class org.apache.commons.lang3.DigitalBase2SizeUnitTest
[ERROR] <https://builds.apache.org/job/Commons-Lang/org.apache.commons$commons-lang3/ws/src/test/java/org/apache/commons/lang3/DigitalBase2SizeUnitTest.java>:[74,56]
cannot find symbol
  symbol:   variable MEGABYTES
  location: class org.apache.commons.lang3.DigitalBase2SizeUnitTest
[ERROR] <https://builds.apache.org/job/Commons-Lang/org.apache.commons$commons-lang3/ws/src/test/java/org/apache/commons/lang3/DigitalBase2SizeUnitTest.java>:[74,32]
cannot find symbol
  symbol:   variable GIGABYTES
  location: class org.apache.commons.lang3.DigitalBase2SizeUnitTest
[ERROR] <https://builds.apache.org/job/Commons-Lang/org.apache.commons$commons-lang3/ws/src/test/java/org/apache/commons/lang3/DigitalBase2SizeUnitTest.java>:[75,53]
cannot find symbol
  symbol:   variable GIGABYTES
  location: class org.apache.commons.lang3.DigitalBase2SizeUnitTest
[ERROR] <https://builds.apache.org/job/Commons-Lang/org.apache.commons$commons-lang3/ws/src/test/java/org/apache/commons/lang3/DigitalBase2SizeUnitTest.java>:[75,32]
cannot find symbol
  symbol:   variable GIGABYTES
  location: class org.apache.commons.lang3.DigitalBase2SizeUnitTest
[ERROR] <https://builds.apache.org/job/Commons-Lang/org.apache.commons$commons-lang3/ws/src/test/java/org/apache/commons/lang3/DigitalBase2SizeUnitTest.java>:[76,56]
cannot find symbol
  symbol:   variable TERABYTES
  location: class org.apache.commons.lang3.DigitalBase2SizeUnitTest
[ERROR] <https://builds.apache.org/job/Commons-Lang/org.apache.commons$commons-lang3/ws/src/test/java/org/apache/commons/lang3/DigitalBase2SizeUnitTest.java>:[76,35]
cannot find symbol
  symbol:   variable GIGABYTES
  location: class org.apache.commons.lang3.DigitalBase2SizeUnitTest
[ERROR] <https://builds.apache.org/job/Commons-Lang/org.apache.commons$commons-lang3/ws/src/test/java/org/apache/commons/lang3/DigitalBase2SizeUnitTest.java>:[81,32]
cannot find symbol
  symbol:   variable BYTES
  location: class org.apache.commons.lang3.DigitalBase2SizeUnitTest
[ERROR] <https://builds.apache.org/job/Commons-Lang/org.apache.commons$commons-lang3/ws/src/test/java/org/apache/commons/lang3/DigitalBase2SizeUnitTest.java>:[82,32]
cannot find symbol
  symbol:   variable KILOBYTES
  location: class org.apache.commons.lang3.DigitalBase2SizeUnitTest
[ERROR] <https://builds.apache.org/job/Commons-Lang/org.apache.commons$commons-lang3/ws/src/test/java/org/apache/commons/lang3/DigitalBase2SizeUnitTest.java>:[83,35]
cannot find symbol
  symbol:   variable MEGABYTES
  location: class org.apache.commons.lang3.DigitalBase2SizeUnitTest
[ERROR] <https://builds.apache.org/job/Commons-Lang/org.apache.commons$commons-lang3/ws/src/test/java/org/apache/commons/lang3/DigitalBase2SizeUnitTest.java>:[84,38]
cannot find symbol
  symbol:   variable GIGABYTES
  location: class org.apache.commons.lang3.DigitalBase2SizeUnitTest
[ERROR] <https://builds.apache.org/job/Commons-Lang/org.apache.commons$commons-lang3/ws/src/test/java/org/apache/commons/lang3/DigitalBase2SizeUnitTest.java>:[85,42]
cannot find symbol
  symbol:   variable TERABYTES
  location: class org.apache.commons.lang3.DigitalBase2SizeUnitTest
[ERROR] <https://builds.apache.org/job/Commons-Lang/org.apache.commons$commons-lang3/ws/src/test/java/org/apache/commons/lang3/DigitalBase2SizeUnitTest.java>:[87,56]
cannot find symbol
  symbol:   variable BYTES
  location: class org.apache.commons.lang3.DigitalBase2SizeUnitTest
[ERROR] <https://builds.apache.org/job/Commons-Lang/org.apache.commons$commons-lang3/ws/src/test/java/org/apache/commons/lang3/DigitalBase2SizeUnitTest.java>:[87,32]
cannot find symbol
  symbol:   variable KILOBYTES
  location: class org.apache.commons.lang3.DigitalBase2SizeUnitTest
[ERROR] <https://builds.apache.org/job/Commons-Lang/org.apache.commons$commons-lang3/ws/src/test/java/org/apache/commons/lang3/DigitalBase2SizeUnitTest.java>:[88,53]
cannot find symbol
  symbol:   variable KILOBYTES
  location: class org.apache.commons.lang3.DigitalBase2SizeUnitTest
[ERROR] <https://builds.apache.org/job/Commons-Lang/org.apache.commons$commons-lang3/ws/src/test/java/org/apache/commons/lang3/DigitalBase2SizeUnitTest.java>:[88,32]
cannot find symbol
  symbol:   variable KILOBYTES
  location: class org.apache.commons.lang3.DigitalBase2SizeUnitTest
[ERROR] <https://builds.apache.org/job/Commons-Lang/org.apache.commons$commons-lang3/ws/src/test/java/org/apache/commons/lang3/DigitalBase2SizeUnitTest.java>:[89,56]
cannot find symbol
  symbol:   variable MEGABYTES
  location: class org.apache.commons.lang3.DigitalBase2SizeUnitTest
[ERROR] <https://builds.apache.org/job/Commons-Lang/org.apache.commons$commons-lang3/ws/src/test/java/org/apache/commons/lang3/DigitalBase2SizeUnitTest.java>:[89,35]
cannot find symbol
  symbol:   variable KILOBYTES
  location: class org.apache.commons.lang3.DigitalBase2SizeUnitTest
[ERROR] <https://builds.apache.org/job/Commons-Lang/org.apache.commons$commons-lang3/ws/src/test/java/org/apache/commons/lang3/DigitalBase2SizeUnitTest.java>:[90,59]
cannot find symbol
  symbol:   variable GIGABYTES
  location: class org.apache.commons.lang3.DigitalBase2SizeUnitTest
[ERROR] <https://builds.apache.org/job/Commons-Lang/org.apache.commons$commons-lang3/ws/src/test/java/org/apache/commons/lang3/DigitalBase2SizeUnitTest.java>:[90,38]
cannot find symbol
  symbol:   variable KILOBYTES
  location: class org.apache.commons.lang3.DigitalBase2SizeUnitTest
[ERROR] <https://builds.apache.org/job/Commons-Lang/org.apache.commons$commons-lang3/ws/src/test/java/org/apache/commons/lang3/DigitalBase2SizeUnitTest.java>:[91,63]
cannot find symbol
  symbol:   variable TERABYTES
  location: class org.apache.commons.lang3.DigitalBase2SizeUnitTest
[ERROR] <https://builds.apache.org/job/Commons-Lang/org.apache.commons$commons-lang3/ws/src/test/java/org/apache/commons/lang3/DigitalBase2SizeUnitTest.java>:[91,42]
cannot find symbol
  symbol:   variable KILOBYTES
  location: class org.apache.commons.lang3.DigitalBase2SizeUnitTest
[ERROR] <https://builds.apache.org/job/Commons-Lang/org.apache.commons$commons-lang3/ws/src/test/java/org/apache/commons/lang3/DigitalBase2SizeUnitTest.java>:[96,32]
cannot find symbol
  symbol:   variable BYTES
  location: class org.apache.commons.lang3.DigitalBase2SizeUnitTest
[ERROR] <https://builds.apache.org/job/Commons-Lang/org.apache.commons$commons-lang3/ws/src/test/java/org/apache/commons/lang3/DigitalBase2SizeUnitTest.java>:[97,32]
cannot find symbol
  symbol:   variable KILOBYTES
  location: class org.apache.commons.lang3.DigitalBase2SizeUnitTest
[ERROR] <https://builds.apache.org/job/Commons-Lang/org.apache.commons$commons-lang3/ws/src/test/java/org/apache/commons/lang3/DigitalBase2SizeUnitTest.java>:[98,32]
cannot find symbol
  symbol:   variable MEGABYTES
  location: class org.apache.commons.lang3.DigitalBase2SizeUnitTest
[ERROR] <https://builds.apache.org/job/Commons-Lang/org.apache.commons$commons-lang3/ws/src/test/java/org/apache/commons/lang3/DigitalBase2SizeUnitTest.java>:[99,35]
cannot find symbol
  symbol:   variable GIGABYTES
  location: class org.apache.commons.lang3.DigitalBase2SizeUnitTest
[ERROR] <https://builds.apache.org/job/Commons-Lang/org.apache.commons$commons-lang3/ws/src/test/java/org/apache/commons/lang3/DigitalBase2SizeUnitTest.java>:[100,38]
cannot find symbol
  symbol:   variable TERABYTES
  location: class org.apache.commons.lang3.DigitalBase2SizeUnitTest
[ERROR] <https://builds.apache.org/job/Commons-Lang/org.apache.commons$commons-lang3/ws/src/test/java/org/apache/commons/lang3/DigitalBase2SizeUnitTest.java>:[102,59]
cannot find symbol
  symbol:   variable BYTES
  location: class org.apache.commons.lang3.DigitalBase2SizeUnitTest
[ERROR] <https://builds.apache.org/job/Commons-Lang/org.apache.commons$commons-lang3/ws/src/test/java/org/apache/commons/lang3/DigitalBase2SizeUnitTest.java>:[102,32]
cannot find symbol
  symbol:   variable MEGABYTES
  location: class org.apache.commons.lang3.DigitalBase2SizeUnitTest
[ERROR] <https://builds.apache.org/job/Commons-Lang/org.apache.commons$commons-lang3/ws/src/test/java/org/apache/commons/lang3/DigitalBase2SizeUnitTest.java>:[103,56]
cannot find symbol
  symbol:   variable KILOBYTES
  location: class org.apache.commons.lang3.DigitalBase2SizeUnitTest
[ERROR] <https://builds.apache.org/job/Commons-Lang/org.apache.commons$commons-lang3/ws/src/test/java/org/apache/commons/lang3/DigitalBase2SizeUnitTest.java>:[103,32]
cannot find symbol
  symbol:   variable MEGABYTES
  location: class org.apache.commons.lang3.DigitalBase2SizeUnitTest
[ERROR] <https://builds.apache.org/job/Commons-Lang/org.apache.commons$commons-lang3/ws/src/test/java/org/apache/commons/lang3/DigitalBase2SizeUnitTest.java>:[104,53]
cannot find symbol
  symbol:   variable MEGABYTES
  location: class org.apache.commons.lang3.DigitalBase2SizeUnitTest
[ERROR] <https://builds.apache.org/job/Commons-Lang/org.apache.commons$commons-lang3/ws/src/test/java/org/apache/commons/lang3/DigitalBase2SizeUnitTest.java>:[104,32]
cannot find symbol
  symbol:   variable MEGABYTES
  location: class org.apache.commons.lang3.DigitalBase2SizeUnitTest
[ERROR] <https://builds.apache.org/job/Commons-Lang/org.apache.commons$commons-lang3/ws/src/test/java/org/apache/commons/lang3/DigitalBase2SizeUnitTest.java>:[105,56]
cannot find symbol
  symbol:   variable GIGABYTES
  location: class org.apache.commons.lang3.DigitalBase2SizeUnitTest
[ERROR] <https://builds.apache.org/job/Commons-Lang/org.apache.commons$commons-lang3/ws/src/test/java/org/apache/commons/lang3/DigitalBase2SizeUnitTest.java>:[105,35]
cannot find symbol
  symbol:   variable MEGABYTES
  location: class org.apache.commons.lang3.DigitalBase2SizeUnitTest
[ERROR] <https://builds.apache.org/job/Commons-Lang/org.apache.commons$commons-lang3/ws/src/test/java/org/apache/commons/lang3/DigitalBase2SizeUnitTest.java>:[106,59]
cannot find symbol
  symbol:   variable TERABYTES
  location: class org.apache.commons.lang3.DigitalBase2SizeUnitTest
[INFO] 100 errors 
[INFO] -------------------------------------------------------------

---------------------------------------------------------------------
To unsubscribe, e-mail: dev-unsubscribe@commons.apache.org
For additional commands, e-mail: dev-help@commons.apache.org


Mime
View raw message