commons-dev mailing list archives

Site index · List index
Message view « Date » · « Thread »
Top « Date » · « Thread »
From Apache Jenkins Server <jenk...@builds.apache.org>
Subject Build failed in Jenkins: Commons-CRYPTO-JDK1.8 #75
Date Fri, 01 Jul 2016 14:52:20 GMT
See <https://builds.apache.org/job/Commons-CRYPTO-JDK1.8/75/>

------------------------------------------
Started by user sebb
[EnvInject] - Loading node environment variables.
Building remotely on ubuntu3 (Ubuntu ubuntu legacy-ubuntu) in workspace <https://builds.apache.org/job/Commons-CRYPTO-JDK1.8/ws/>
 > git rev-parse --is-inside-work-tree # timeout=10
Fetching changes from the remote Git repository
 > git config remote.origin.url https://git-wip-us.apache.org/repos/asf/commons-crypto.git
# timeout=10
Fetching upstream changes from https://git-wip-us.apache.org/repos/asf/commons-crypto.git
 > git --version # timeout=10
 > git -c core.askpass=true fetch --tags --progress https://git-wip-us.apache.org/repos/asf/commons-crypto.git
+refs/heads/*:refs/remotes/origin/*
 > git rev-parse refs/remotes/origin/master^{commit} # timeout=10
 > git rev-parse refs/remotes/origin/origin/master^{commit} # timeout=10
Checking out Revision 45de8b8d33d13c351475a8a6e81dd1a0fdb93bef (refs/remotes/origin/master)
 > git config core.sparsecheckout # timeout=10
 > git checkout -f 45de8b8d33d13c351475a8a6e81dd1a0fdb93bef
 > git rev-list 45de8b8d33d13c351475a8a6e81dd1a0fdb93bef # timeout=10
Setting MAVEN_3_0_4_HOME=/home/jenkins/tools/maven/apache-maven-3.0.4
Setting JDK_1_7_0_79_UNLIMITED_SECURITY__HOME=/home/jenkins/tools/java/jdk1.7.0_79-unlimited-security
Setting JDK1_8_0_66_UNLIMITED_SECURITY_HOME=/home/jenkins/tools/java/jdk1.8.0_66-unlimited-security
Parsing POMs
Established TCP socket on 48188
maven3-agent.jar already up to date
maven3-interceptor.jar already up to date
maven3-interceptor-commons.jar already up to date
[Commons-CRYPTO-JDK1.8] $ /home/jenkins/tools/java/jdk1.8.0_66-unlimited-security/bin/java
-Xmx2g -Xms256m -XX:MaxPermSize=512m -cp /home/jenkins/jenkins-slave/maven3-agent.jar:/home/jenkins/tools/maven/apache-maven-3.0.4/boot/plexus-classworlds-2.4.jar
org.jvnet.hudson.maven3.agent.Maven3Main /home/jenkins/tools/maven/apache-maven-3.0.4 /x1/jenkins/jenkins-slave/slave.jar
/home/jenkins/jenkins-slave/maven3-interceptor.jar /home/jenkins/jenkins-slave/maven3-interceptor-commons.jar
48188
Java HotSpot(TM) 64-Bit Server VM warning: ignoring option MaxPermSize=512m; support was removed
in 8.0
<===[JENKINS REMOTING CAPACITY]===>   channel started
Executing Maven:  -B -f <https://builds.apache.org/job/Commons-CRYPTO-JDK1.8/ws/pom.xml>
-Dmaven.repo.local=/home/jenkins/jenkins-slave/maven-repositories/1 clean apache-rat:check
test site
[INFO] Scanning for projects...
[INFO]                                                                         
[INFO] ------------------------------------------------------------------------
[INFO] Building Apache Commons Crypto 1.0.0-SNAPSHOT
[INFO] ------------------------------------------------------------------------
[INFO] 
[INFO] --- maven-clean-plugin:3.0.0:clean (default-clean) @ commons-crypto ---
[INFO] Deleting <https://builds.apache.org/job/Commons-CRYPTO-JDK1.8/ws/target>
[INFO] 
[INFO] --- apache-rat-plugin:0.11:check (default-cli) @ commons-crypto ---
[INFO] 51 implicit excludes (use -debug for more details).
[INFO] Exclude: site-content/**
[INFO] Exclude: .checkstyle
[INFO] Exclude: .fbprefs
[INFO] Exclude: .pmd
[INFO] Exclude: src/site/resources/download_*.cgi
[INFO] Exclude: src/site/resources/profile.*
[INFO] 106 resources included (use -debug for more details)
[INFO] Rat check: Summary of files. Unapproved: 1 unknown: 1 generated: 0 approved: 100 licence.
[INFO] ------------------------------------------------------------------------
[INFO] BUILD FAILURE
[INFO] ------------------------------------------------------------------------
[INFO] Total time: 5.312s
[INFO] Finished at: Fri Jul 01 14:52:35 UTC 2016
[INFO] Final Memory: 14M/245M
[INFO] ------------------------------------------------------------------------
Waiting for Jenkins to finish collecting data
[ERROR] Failed to execute goal org.apache.rat:apache-rat-plugin:0.11:check (default-cli) on
project commons-crypto: Too many files with unapproved license: 1 See RAT report in: <https://builds.apache.org/job/Commons-CRYPTO-JDK1.8/ws/target/rat.txt>
-> [Help 1]
[ERROR] 
[ERROR] To see the full stack trace of the errors, re-run Maven with the -e switch.
[ERROR] Re-run Maven using the -X switch to enable full debug logging.
[ERROR] 
[ERROR] For more information about the errors and possible solutions, please read the following
articles:
[ERROR] [Help 1] http://cwiki.apache.org/confluence/display/MAVEN/MojoFailureException
[JENKINS] Archiving <https://builds.apache.org/job/Commons-CRYPTO-JDK1.8/ws/pom.xml>
to org.apache.commons/commons-crypto/1.0.0-SNAPSHOT/commons-crypto-1.0.0-SNAPSHOT.pom
Sending e-mails to: dev@commons.apache.org
channel stopped

---------------------------------------------------------------------
To unsubscribe, e-mail: dev-unsubscribe@commons.apache.org
For additional commands, e-mail: dev-help@commons.apache.org


Mime
View raw message