commons-dev mailing list archives

Site index · List index
Message view « Date » · « Thread »
Top « Date » · « Thread »
From Apache Jenkins Server <jenk...@builds.apache.org>
Subject Build failed in Jenkins: commons-bcel #11
Date Wed, 15 Jun 2016 21:37:28 GMT
See <https://builds.apache.org/job/commons-bcel/11/changes>

Changes:

[dbrosius] add missing isVarArgs to AccessFlags

------------------------------------------
[...truncated 121 lines...]
Running org.apache.bcel.CounterVisitorTestCase
Tests run: 37, Failures: 0, Errors: 0, Skipped: 0, Time elapsed: 0.016 sec - in org.apache.bcel.CounterVisitorTestCase
Running org.apache.bcel.classfile.UtilityTestCase
Tests run: 1, Failures: 0, Errors: 0, Skipped: 0, Time elapsed: 0.001 sec - in org.apache.bcel.classfile.UtilityTestCase
Running org.apache.bcel.EnumAccessFlagTestCase
Tests run: 1, Failures: 0, Errors: 0, Skipped: 0, Time elapsed: 0 sec - in org.apache.bcel.EnumAccessFlagTestCase
Running org.apache.bcel.PerformanceTest
parsing /home/jenkins/jenkins-slave/tools/hudson.model.JDK/JDK_1.7_latest_/jre/lib/alt-rt.jar
parsing /home/jenkins/jenkins-slave/tools/hudson.model.JDK/JDK_1.7_latest_/jre/lib/charsets.jar
parsing /home/jenkins/jenkins-slave/tools/hudson.model.JDK/JDK_1.7_latest_/jre/lib/javaws.jar
parsing /home/jenkins/jenkins-slave/tools/hudson.model.JDK/JDK_1.7_latest_/jre/lib/jfr.jar
parsing /home/jenkins/jenkins-slave/tools/hudson.model.JDK/JDK_1.7_latest_/jre/lib/jfxrt.jar
parsing /home/jenkins/jenkins-slave/tools/hudson.model.JDK/JDK_1.7_latest_/jre/lib/resources.jar
parsing /home/jenkins/jenkins-slave/tools/hudson.model.JDK/JDK_1.7_latest_/jre/lib/management-agent.jar
parsing /home/jenkins/jenkins-slave/tools/hudson.model.JDK/JDK_1.7_latest_/jre/lib/rt.jar
parsing /home/jenkins/jenkins-slave/tools/hudson.model.JDK/JDK_1.7_latest_/jre/lib/jce.jar
parsing /home/jenkins/jenkins-slave/tools/hudson.model.JDK/JDK_1.7_latest_/jre/lib/plugin.jar
parsing /home/jenkins/jenkins-slave/tools/hudson.model.JDK/JDK_1.7_latest_/jre/lib/deploy.jar
parsing /home/jenkins/jenkins-slave/tools/hudson.model.JDK/JDK_1.7_latest_/jre/lib/jsse.jar
Tests run: 1, Failures: 0, Errors: 0, Skipped: 0, Time elapsed: 5.419 sec - in org.apache.bcel.PerformanceTest
Running org.apache.bcel.InstructionFinderTestCase
Tests run: 1, Failures: 0, Errors: 0, Skipped: 0, Time elapsed: 0.02 sec - in org.apache.bcel.InstructionFinderTestCase
Running org.apache.bcel.verifier.VerifierArrayAccessTestCase
Tests run: 2, Failures: 0, Errors: 0, Skipped: 0, Time elapsed: 0.071 sec - in org.apache.bcel.verifier.VerifierArrayAccessTestCase
Running org.apache.bcel.verifier.VerifierInvokeTestCase
Tests run: 4, Failures: 0, Errors: 0, Skipped: 0, Time elapsed: 0.047 sec - in org.apache.bcel.verifier.VerifierInvokeTestCase
Running org.apache.bcel.verifier.VerifierReturnTestCase
Tests run: 2, Failures: 0, Errors: 0, Skipped: 0, Time elapsed: 0.013 sec - in org.apache.bcel.verifier.VerifierReturnTestCase
Running org.apache.bcel.verifier.VerifierTestCase
Tests run: 1, Failures: 0, Errors: 0, Skipped: 0, Time elapsed: 0.001 sec - in org.apache.bcel.verifier.VerifierTestCase
Running org.apache.bcel.EnclosingMethodAttributeTestCase
Tests run: 3, Failures: 0, Errors: 0, Skipped: 0, Time elapsed: 0.001 sec - in org.apache.bcel.EnclosingMethodAttributeTestCase
Running org.apache.bcel.AnnotationAccessFlagTestCase
Tests run: 1, Failures: 0, Errors: 0, Skipped: 0, Time elapsed: 0.001 sec - in org.apache.bcel.AnnotationAccessFlagTestCase
Running org.apache.bcel.util.BCELifierTestCase
Tests run: 2, Failures: 0, Errors: 0, Skipped: 0, Time elapsed: 1.432 sec - in org.apache.bcel.util.BCELifierTestCase
Running org.apache.bcel.util.Class2HTMLTestCase
Tests run: 1, Failures: 0, Errors: 0, Skipped: 0, Time elapsed: 0.01 sec - in org.apache.bcel.util.Class2HTMLTestCase

Results :

Tests run: 102, Failures: 0, Errors: 0, Skipped: 0

[JENKINS] Recording test results
[INFO] 
[INFO] --- maven-jar-plugin:2.6:jar (default-jar) @ bcel ---
[INFO] Building jar: <https://builds.apache.org/job/commons-bcel/ws/target/bcel-6.0-SNAPSHOT.jar>
[INFO] 
[INFO] --- maven-site-plugin:3.4:attach-descriptor (attach-descriptor) @ bcel ---
[INFO] 
[INFO] >>> maven-javadoc-plugin:2.10.3:javadoc (create-javadoc-jar) > generate-sources
@ bcel >>>
[INFO] 
[INFO] --- maven-enforcer-plugin:1.4.1:enforce (enforce-maven-3) @ bcel ---
[INFO] 
[INFO] --- build-helper-maven-plugin:1.10:parse-version (parse-version) @ bcel ---
[INFO] 
[INFO] --- maven-antrun-plugin:1.8:run (javadoc.resources) @ bcel ---
[INFO] Executing tasks

main:
[INFO] Executed tasks
[WARNING] Failed to getClass for org.apache.maven.plugin.javadoc.JavadocReport
[INFO] 
[INFO] <<< maven-javadoc-plugin:2.10.3:javadoc (create-javadoc-jar) < generate-sources
@ bcel <<<
[INFO] 
[INFO] --- maven-javadoc-plugin:2.10.3:javadoc (create-javadoc-jar) @ bcel ---
[INFO] 
26 warnings
[WARNING] Javadoc Warnings
[WARNING] <https://builds.apache.org/job/commons-bcel/ws/src/main/java/org/apache/bcel/Const.java>:271:
warning - @return tag has no arguments.
[WARNING] <https://builds.apache.org/job/commons-bcel/ws/src/main/java/org/apache/bcel/Const.java>:369:
warning - @return tag has no arguments.
[WARNING] <https://builds.apache.org/job/commons-bcel/ws/src/main/java/org/apache/bcel/Const.java>:395:
warning - @return tag has no arguments.
[WARNING] <https://builds.apache.org/job/commons-bcel/ws/src/main/java/org/apache/bcel/Const.java>:1755:
warning - @return tag has no arguments.
[WARNING] <https://builds.apache.org/job/commons-bcel/ws/src/main/java/org/apache/bcel/Const.java>:1777:
warning - @return tag has no arguments.
[WARNING] <https://builds.apache.org/job/commons-bcel/ws/src/main/java/org/apache/bcel/Const.java>:1796:
warning - @return tag has no arguments.
[WARNING] <https://builds.apache.org/job/commons-bcel/ws/src/main/java/org/apache/bcel/Const.java>:1873:
warning - @return tag has no arguments.
[WARNING] <https://builds.apache.org/job/commons-bcel/ws/src/main/java/org/apache/bcel/Const.java>:2087:
warning - @return tag has no arguments.
[WARNING] <https://builds.apache.org/job/commons-bcel/ws/src/main/java/org/apache/bcel/Const.java>:2154:
warning - @return tag has no arguments.
[WARNING] <https://builds.apache.org/job/commons-bcel/ws/src/main/java/org/apache/bcel/Const.java>:2203:
warning - @return tag has no arguments.
[WARNING] <https://builds.apache.org/job/commons-bcel/ws/src/main/java/org/apache/bcel/Const.java>:2230:
warning - @return tag has no arguments.
[WARNING] <https://builds.apache.org/job/commons-bcel/ws/src/main/java/org/apache/bcel/Const.java>:2281:
warning - @return tag has no arguments.
[WARNING] <https://builds.apache.org/job/commons-bcel/ws/src/main/java/org/apache/bcel/Const.java>:395:
warning - @param argument "index" is not a parameter name.
[WARNING] <https://builds.apache.org/job/commons-bcel/ws/src/main/java/org/apache/bcel/ExceptionConst.java>:66:
warning - Tag @link: can't find createExceptions(EXCS, Class...) in org.apache.bcel.ExceptionConstants
[WARNING] <https://builds.apache.org/job/commons-bcel/ws/src/main/java/org/apache/bcel/generic/BranchInstruction.java>:272:
warning - @return tag cannot be used in method with void return type.
[WARNING] <https://builds.apache.org/job/commons-bcel/ws/src/main/java/org/apache/bcel/generic/FieldOrMethod.java>:82:
warning - Tag @link: can't find getReferenceType() in org.apache.bcel.generic.FieldOrMethod
[WARNING] <https://builds.apache.org/job/commons-bcel/ws/src/main/java/org/apache/bcel/generic/Select.java>:383:
warning - @return tag has no arguments.
[WARNING] <https://builds.apache.org/job/commons-bcel/ws/src/main/java/org/apache/bcel/generic/Type.java>:120:
warning - Tag @see: reference not found: OperandStack#push(Type)
[WARNING] <https://builds.apache.org/job/commons-bcel/ws/src/main/java/org/apache/bcel/generic/Type.java>:120:
warning - Tag @see: reference not found: LocalVariables#set(int, Type)
[WARNING] <https://builds.apache.org/job/commons-bcel/ws/src/main/java/org/apache/bcel/classfile/ClassFormatException.java>:44:
warning - Tag @inheritDoc cannot be used in constructor documentation.  It can only be used
in the following types of documentation: method, inline text.
[WARNING] <https://builds.apache.org/job/commons-bcel/ws/src/main/java/org/apache/bcel/classfile/ClassFormatException.java>:44:
warning - Tag @inheritDoc cannot be used in constructor documentation.  It can only be used
in the following types of documentation: method, inline text.
[WARNING] <https://builds.apache.org/job/commons-bcel/ws/src/main/java/org/apache/bcel/classfile/ClassFormatException.java>:44:
warning - Tag @inheritDoc cannot be used in constructor documentation.  It can only be used
in the following types of documentation: method, inline text.
[WARNING] <https://builds.apache.org/job/commons-bcel/ws/src/main/java/org/apache/bcel/classfile/DescendingVisitor.java>:278:
warning - @Override is an unknown tag.
[WARNING] <https://builds.apache.org/job/commons-bcel/ws/src/main/java/org/apache/bcel/classfile/StackMapEntry.java>:328:
warning - @param argument "int" is not a parameter name.
[WARNING] <https://builds.apache.org/job/commons-bcel/ws/src/main/java/org/apache/bcel/util/InstructionFinder.java>:67:
warning - Tag @see: reference not found: Instruction
[WARNING] <https://builds.apache.org/job/commons-bcel/ws/src/main/java/org/apache/bcel/classfile/ClassFormatException.java>:44:
warning - Tag @inheritDoc cannot be used in constructor documentation.  It can only be used
in the following types of documentation: method, inline text.
[JENKINS] Archiving  javadoc
[INFO] 
[INFO] --- maven-javadoc-plugin:2.10.3:jar (create-javadoc-jar) @ bcel ---
[INFO] 
26 warnings
[WARNING] Javadoc Warnings
[WARNING] <https://builds.apache.org/job/commons-bcel/ws/src/main/java/org/apache/bcel/Const.java>:271:
warning - @return tag has no arguments.
[WARNING] <https://builds.apache.org/job/commons-bcel/ws/src/main/java/org/apache/bcel/Const.java>:369:
warning - @return tag has no arguments.
[WARNING] <https://builds.apache.org/job/commons-bcel/ws/src/main/java/org/apache/bcel/Const.java>:395:
warning - @return tag has no arguments.
[WARNING] <https://builds.apache.org/job/commons-bcel/ws/src/main/java/org/apache/bcel/Const.java>:1755:
warning - @return tag has no arguments.
[WARNING] <https://builds.apache.org/job/commons-bcel/ws/src/main/java/org/apache/bcel/Const.java>:1777:
warning - @return tag has no arguments.
[WARNING] <https://builds.apache.org/job/commons-bcel/ws/src/main/java/org/apache/bcel/Const.java>:1796:
warning - @return tag has no arguments.
[WARNING] <https://builds.apache.org/job/commons-bcel/ws/src/main/java/org/apache/bcel/Const.java>:1873:
warning - @return tag has no arguments.
[WARNING] <https://builds.apache.org/job/commons-bcel/ws/src/main/java/org/apache/bcel/Const.java>:2087:
warning - @return tag has no arguments.
[WARNING] <https://builds.apache.org/job/commons-bcel/ws/src/main/java/org/apache/bcel/Const.java>:2154:
warning - @return tag has no arguments.
[WARNING] <https://builds.apache.org/job/commons-bcel/ws/src/main/java/org/apache/bcel/Const.java>:2203:
warning - @return tag has no arguments.
[WARNING] <https://builds.apache.org/job/commons-bcel/ws/src/main/java/org/apache/bcel/Const.java>:2230:
warning - @return tag has no arguments.
[WARNING] <https://builds.apache.org/job/commons-bcel/ws/src/main/java/org/apache/bcel/Const.java>:2281:
warning - @return tag has no arguments.
[WARNING] <https://builds.apache.org/job/commons-bcel/ws/src/main/java/org/apache/bcel/Const.java>:395:
warning - @param argument "index" is not a parameter name.
[WARNING] <https://builds.apache.org/job/commons-bcel/ws/src/main/java/org/apache/bcel/ExceptionConst.java>:66:
warning - Tag @link: can't find createExceptions(EXCS, Class...) in org.apache.bcel.ExceptionConstants
[WARNING] <https://builds.apache.org/job/commons-bcel/ws/src/main/java/org/apache/bcel/generic/BranchInstruction.java>:272:
warning - @return tag cannot be used in method with void return type.
[WARNING] <https://builds.apache.org/job/commons-bcel/ws/src/main/java/org/apache/bcel/generic/FieldOrMethod.java>:82:
warning - Tag @link: can't find getReferenceType() in org.apache.bcel.generic.FieldOrMethod
[WARNING] <https://builds.apache.org/job/commons-bcel/ws/src/main/java/org/apache/bcel/generic/Select.java>:383:
warning - @return tag has no arguments.
[WARNING] <https://builds.apache.org/job/commons-bcel/ws/src/main/java/org/apache/bcel/generic/Type.java>:120:
warning - Tag @see: reference not found: OperandStack#push(Type)
[WARNING] <https://builds.apache.org/job/commons-bcel/ws/src/main/java/org/apache/bcel/generic/Type.java>:120:
warning - Tag @see: reference not found: LocalVariables#set(int, Type)
[WARNING] <https://builds.apache.org/job/commons-bcel/ws/src/main/java/org/apache/bcel/classfile/ClassFormatException.java>:44:
warning - Tag @inheritDoc cannot be used in constructor documentation.  It can only be used
in the following types of documentation: method, inline text.
[WARNING] <https://builds.apache.org/job/commons-bcel/ws/src/main/java/org/apache/bcel/classfile/ClassFormatException.java>:44:
warning - Tag @inheritDoc cannot be used in constructor documentation.  It can only be used
in the following types of documentation: method, inline text.
[WARNING] <https://builds.apache.org/job/commons-bcel/ws/src/main/java/org/apache/bcel/classfile/ClassFormatException.java>:44:
warning - Tag @inheritDoc cannot be used in constructor documentation.  It can only be used
in the following types of documentation: method, inline text.
[WARNING] <https://builds.apache.org/job/commons-bcel/ws/src/main/java/org/apache/bcel/classfile/DescendingVisitor.java>:278:
warning - @Override is an unknown tag.
[WARNING] <https://builds.apache.org/job/commons-bcel/ws/src/main/java/org/apache/bcel/classfile/StackMapEntry.java>:328:
warning - @param argument "int" is not a parameter name.
[WARNING] <https://builds.apache.org/job/commons-bcel/ws/src/main/java/org/apache/bcel/util/InstructionFinder.java>:67:
warning - Tag @see: reference not found: Instruction
[WARNING] <https://builds.apache.org/job/commons-bcel/ws/src/main/java/org/apache/bcel/classfile/ClassFormatException.java>:44:
warning - Tag @inheritDoc cannot be used in constructor documentation.  It can only be used
in the following types of documentation: method, inline text.
[INFO] Building jar: <https://builds.apache.org/job/commons-bcel/ws/target/bcel-6.0-SNAPSHOT-javadoc.jar>
[INFO] 
[INFO] >>> maven-source-plugin:3.0.0:jar (create-source-jar) > generate-sources
@ bcel >>>
[INFO] 
[INFO] --- maven-enforcer-plugin:1.4.1:enforce (enforce-maven-3) @ bcel ---
[INFO] 
[INFO] --- build-helper-maven-plugin:1.10:parse-version (parse-version) @ bcel ---
[INFO] 
[INFO] --- maven-antrun-plugin:1.8:run (javadoc.resources) @ bcel ---
[INFO] Executing tasks

main:
[INFO] Executed tasks
[WARNING] Failed to getClass for org.apache.maven.plugins.source.SourceJarMojo
[INFO] 
[INFO] <<< maven-source-plugin:3.0.0:jar (create-source-jar) < generate-sources
@ bcel <<<
[INFO] 
[INFO] --- maven-source-plugin:3.0.0:jar (create-source-jar) @ bcel ---
[INFO] Building jar: <https://builds.apache.org/job/commons-bcel/ws/target/bcel-6.0-SNAPSHOT-sources.jar>
[INFO] 
[INFO] >>> maven-source-plugin:3.0.0:test-jar (create-source-jar) > generate-sources
@ bcel >>>
[INFO] 
[INFO] --- maven-enforcer-plugin:1.4.1:enforce (enforce-maven-3) @ bcel ---
[INFO] 
[INFO] --- build-helper-maven-plugin:1.10:parse-version (parse-version) @ bcel ---
[INFO] 
[INFO] --- maven-antrun-plugin:1.8:run (javadoc.resources) @ bcel ---
[INFO] Executing tasks

main:
[INFO] Executed tasks
[WARNING] Failed to getClass for org.apache.maven.plugins.source.TestSourceJarMojo
[INFO] 
[INFO] <<< maven-source-plugin:3.0.0:test-jar (create-source-jar) < generate-sources
@ bcel <<<
[INFO] 
[INFO] --- maven-source-plugin:3.0.0:test-jar (create-source-jar) @ bcel ---
[INFO] Building jar: <https://builds.apache.org/job/commons-bcel/ws/target/bcel-6.0-SNAPSHOT-test-sources.jar>
[INFO] 
[INFO] --- maven-jar-plugin:2.6:test-jar (default) @ bcel ---
[INFO] Building jar: <https://builds.apache.org/job/commons-bcel/ws/target/bcel-6.0-SNAPSHOT-tests.jar>
[INFO] 
[INFO] --- maven-assembly-plugin:2.6:single (default) @ bcel ---
[INFO] Reading assembly descriptor: src/assembly/bin.xml
[INFO] Reading assembly descriptor: src/assembly/src.xml
[INFO] Building tar: <https://builds.apache.org/job/commons-bcel/ws/target/bcel-6.0-SNAPSHOT-bin.tar.gz>
[INFO] Building zip: <https://builds.apache.org/job/commons-bcel/ws/target/bcel-6.0-SNAPSHOT-bin.zip>
[INFO] Building tar: <https://builds.apache.org/job/commons-bcel/ws/target/bcel-6.0-SNAPSHOT-src.tar.gz>
[INFO] Building zip: <https://builds.apache.org/job/commons-bcel/ws/target/bcel-6.0-SNAPSHOT-src.zip>
[INFO] 
[INFO] --- maven-gpg-plugin:1.6:sign (sign-artifacts) @ bcel ---
[INFO] 
[INFO] --- maven-install-plugin:2.5.2:install (default-install) @ bcel ---
[INFO] Installing <https://builds.apache.org/job/commons-bcel/ws/target/bcel-6.0-SNAPSHOT.jar>
to /home/jenkins/jenkins-slave/maven-repositories/0/org/apache/bcel/bcel/6.0-SNAPSHOT/bcel-6.0-SNAPSHOT.jar
[INFO] Installing <https://builds.apache.org/job/commons-bcel/ws/pom.xml> to /home/jenkins/jenkins-slave/maven-repositories/0/org/apache/bcel/bcel/6.0-SNAPSHOT/bcel-6.0-SNAPSHOT.pom
[INFO] Installing <https://builds.apache.org/job/commons-bcel/ws/target/bcel-6.0-SNAPSHOT-javadoc.jar>
to /home/jenkins/jenkins-slave/maven-repositories/0/org/apache/bcel/bcel/6.0-SNAPSHOT/bcel-6.0-SNAPSHOT-javadoc.jar
[INFO] Installing <https://builds.apache.org/job/commons-bcel/ws/target/bcel-6.0-SNAPSHOT-sources.jar>
to /home/jenkins/jenkins-slave/maven-repositories/0/org/apache/bcel/bcel/6.0-SNAPSHOT/bcel-6.0-SNAPSHOT-sources.jar
[INFO] Installing <https://builds.apache.org/job/commons-bcel/ws/target/bcel-6.0-SNAPSHOT-test-sources.jar>
to /home/jenkins/jenkins-slave/maven-repositories/0/org/apache/bcel/bcel/6.0-SNAPSHOT/bcel-6.0-SNAPSHOT-test-sources.jar
[INFO] Installing <https://builds.apache.org/job/commons-bcel/ws/target/bcel-6.0-SNAPSHOT-tests.jar>
to /home/jenkins/jenkins-slave/maven-repositories/0/org/apache/bcel/bcel/6.0-SNAPSHOT/bcel-6.0-SNAPSHOT-tests.jar
[INFO] Installing <https://builds.apache.org/job/commons-bcel/ws/target/bcel-6.0-SNAPSHOT-bin.tar.gz>
to /home/jenkins/jenkins-slave/maven-repositories/0/org/apache/bcel/bcel/6.0-SNAPSHOT/bcel-6.0-SNAPSHOT-bin.tar.gz
[INFO] Installing <https://builds.apache.org/job/commons-bcel/ws/target/bcel-6.0-SNAPSHOT-bin.zip>
to /home/jenkins/jenkins-slave/maven-repositories/0/org/apache/bcel/bcel/6.0-SNAPSHOT/bcel-6.0-SNAPSHOT-bin.zip
[INFO] Installing <https://builds.apache.org/job/commons-bcel/ws/target/bcel-6.0-SNAPSHOT-src.tar.gz>
to /home/jenkins/jenkins-slave/maven-repositories/0/org/apache/bcel/bcel/6.0-SNAPSHOT/bcel-6.0-SNAPSHOT-src.tar.gz
[INFO] Installing <https://builds.apache.org/job/commons-bcel/ws/target/bcel-6.0-SNAPSHOT-src.zip>
to /home/jenkins/jenkins-slave/maven-repositories/0/org/apache/bcel/bcel/6.0-SNAPSHOT/bcel-6.0-SNAPSHOT-src.zip
[INFO] ------------------------------------------------------------------------
[INFO] BUILD SUCCESS
[INFO] ------------------------------------------------------------------------
[INFO] Total time: 01:17 min
[INFO] Finished at: 2016-06-15T21:37:27+00:00
[INFO] Final Memory: 43M/590M
[INFO] ------------------------------------------------------------------------
[JENKINS] Archiving <https://builds.apache.org/job/commons-bcel/ws/pom.xml> to org.apache.bcel/bcel/6.0-SNAPSHOT/bcel-6.0-SNAPSHOT.pom
[JENKINS] Archiving <https://builds.apache.org/job/commons-bcel/ws/target/bcel-6.0-SNAPSHOT.jar>
to org.apache.bcel/bcel/6.0-SNAPSHOT/bcel-6.0-SNAPSHOT.jar
[JENKINS] Archiving <https://builds.apache.org/job/commons-bcel/ws/target/bcel-6.0-SNAPSHOT-javadoc.jar>
to org.apache.bcel/bcel/6.0-SNAPSHOT/bcel-6.0-SNAPSHOT-javadoc.jar
[JENKINS] Archiving <https://builds.apache.org/job/commons-bcel/ws/target/bcel-6.0-SNAPSHOT-sources.jar>
to org.apache.bcel/bcel/6.0-SNAPSHOT/bcel-6.0-SNAPSHOT-sources.jar
[JENKINS] Archiving <https://builds.apache.org/job/commons-bcel/ws/target/bcel-6.0-SNAPSHOT-test-sources.jar>
to org.apache.bcel/bcel/6.0-SNAPSHOT/bcel-6.0-SNAPSHOT-test-sources.jar
[JENKINS] Archiving <https://builds.apache.org/job/commons-bcel/ws/target/bcel-6.0-SNAPSHOT-tests.jar>
to org.apache.bcel/bcel/6.0-SNAPSHOT/bcel-6.0-SNAPSHOT-tests.jar
[JENKINS] Archiving <https://builds.apache.org/job/commons-bcel/ws/target/bcel-6.0-SNAPSHOT-bin.tar.gz>
to org.apache.bcel/bcel/6.0-SNAPSHOT/bcel-6.0-SNAPSHOT-bin.tar.gz
[JENKINS] Archiving <https://builds.apache.org/job/commons-bcel/ws/target/bcel-6.0-SNAPSHOT-bin.zip>
to org.apache.bcel/bcel/6.0-SNAPSHOT/bcel-6.0-SNAPSHOT-bin.zip
[JENKINS] Archiving <https://builds.apache.org/job/commons-bcel/ws/target/bcel-6.0-SNAPSHOT-src.tar.gz>
to org.apache.bcel/bcel/6.0-SNAPSHOT/bcel-6.0-SNAPSHOT-src.tar.gz
[JENKINS] Archiving <https://builds.apache.org/job/commons-bcel/ws/target/bcel-6.0-SNAPSHOT-src.zip>
to org.apache.bcel/bcel/6.0-SNAPSHOT/bcel-6.0-SNAPSHOT-src.zip
channel stopped
Maven RedeployPublisher use remote beam2 maven settings from : /home/jenkins/.m2/settings.xml
[INFO] Deployment in https://repository.apache.org/content/repositories/snapshots (id=apache.snapshots.https,uniqueVersion=true)
Deploying the main artifact bcel-6.0-SNAPSHOT.jar
Downloading: https://repository.apache.org/content/repositories/snapshots/org/apache/bcel/bcel/6.0-SNAPSHOT/maven-metadata.xml
ERROR: Failed to retrieve remote metadata org.apache.bcel:bcel:6.0-SNAPSHOT/maven-metadata.xml:
Could not transfer metadata org.apache.bcel:bcel:6.0-SNAPSHOT/maven-metadata.xml from/to apache.snapshots.https
(https://repository.apache.org/content/repositories/snapshots): Failed to transfer file: https://repository.apache.org/content/repositories/snapshots/org/apache/bcel/bcel/6.0-SNAPSHOT/maven-metadata.xml.
Return code is: 503 , ReasonPhrase:Service Unavailable.
org.apache.maven.artifact.deployer.ArtifactDeploymentException: Failed to retrieve remote
metadata org.apache.bcel:bcel:6.0-SNAPSHOT/maven-metadata.xml: Could not transfer metadata
org.apache.bcel:bcel:6.0-SNAPSHOT/maven-metadata.xml from/to apache.snapshots.https (https://repository.apache.org/content/repositories/snapshots):
Failed to transfer file: https://repository.apache.org/content/repositories/snapshots/org/apache/bcel/bcel/6.0-SNAPSHOT/maven-metadata.xml.
Return code is: 503 , ReasonPhrase:Service Unavailable.
	at org.apache.maven.artifact.deployer.DefaultArtifactDeployer.deploy(DefaultArtifactDeployer.java:143)
	at hudson.maven.reporters.MavenArtifactRecord.deploy(MavenArtifactRecord.java:193)
	at hudson.maven.RedeployPublisher.perform(RedeployPublisher.java:176)
	at hudson.tasks.BuildStepMonitor$1.perform(BuildStepMonitor.java:20)
	at hudson.model.AbstractBuild$AbstractBuildExecution.perform(AbstractBuild.java:782)
	at hudson.model.AbstractBuild$AbstractBuildExecution.performAllBuildSteps(AbstractBuild.java:723)
	at hudson.maven.MavenModuleSetBuild$MavenModuleSetBuildExecution.post2(MavenModuleSetBuild.java:1047)
	at hudson.model.AbstractBuild$AbstractBuildExecution.post(AbstractBuild.java:668)
	at hudson.model.Run.execute(Run.java:1763)
	at hudson.maven.MavenModuleSetBuild.run(MavenModuleSetBuild.java:531)
	at hudson.model.ResourceController.execute(ResourceController.java:98)
	at hudson.model.Executor.run(Executor.java:410)
Caused by: org.eclipse.aether.deployment.DeploymentException: Failed to retrieve remote metadata
org.apache.bcel:bcel:6.0-SNAPSHOT/maven-metadata.xml: Could not transfer metadata org.apache.bcel:bcel:6.0-SNAPSHOT/maven-metadata.xml
from/to apache.snapshots.https (https://repository.apache.org/content/repositories/snapshots):
Failed to transfer file: https://repository.apache.org/content/repositories/snapshots/org/apache/bcel/bcel/6.0-SNAPSHOT/maven-metadata.xml.
Return code is: 503 , ReasonPhrase:Service Unavailable.
	at org.eclipse.aether.internal.impl.DefaultDeployer.upload(DefaultDeployer.java:470)
	at org.eclipse.aether.internal.impl.DefaultDeployer.deploy(DefaultDeployer.java:314)
	at org.eclipse.aether.internal.impl.DefaultDeployer.deploy(DefaultDeployer.java:269)
	at org.eclipse.aether.internal.impl.DefaultRepositorySystem.deploy(DefaultRepositorySystem.java:413)
	at org.apache.maven.artifact.deployer.DefaultArtifactDeployer.deploy(DefaultArtifactDeployer.java:139)
	... 11 more
Caused by: org.eclipse.aether.transfer.MetadataTransferException: Could not transfer metadata
org.apache.bcel:bcel:6.0-SNAPSHOT/maven-metadata.xml from/to apache.snapshots.https (https://repository.apache.org/content/repositories/snapshots):
Failed to transfer file: https://repository.apache.org/content/repositories/snapshots/org/apache/bcel/bcel/6.0-SNAPSHOT/maven-metadata.xml.
Return code is: 503 , ReasonPhrase:Service Unavailable.
	at org.eclipse.aether.connector.wagon.WagonRepositoryConnector$5.wrap(WagonRepositoryConnector.java:995)
	at org.eclipse.aether.connector.wagon.WagonRepositoryConnector$5.wrap(WagonRepositoryConnector.java:983)
	at org.eclipse.aether.connector.wagon.WagonRepositoryConnector$GetTask.run(WagonRepositoryConnector.java:725)
	at org.eclipse.aether.util.concurrency.RunnableErrorForwarder$1.run(RunnableErrorForwarder.java:67)
	at java.util.concurrent.ThreadPoolExecutor.runWorker(ThreadPoolExecutor.java:1145)
	at java.util.concurrent.ThreadPoolExecutor$Worker.run(ThreadPoolExecutor.java:615)
	at java.lang.Thread.run(Thread.java:745)
Caused by: org.apache.maven.wagon.TransferFailedException: Failed to transfer file: https://repository.apache.org/content/repositories/snapshots/org/apache/bcel/bcel/6.0-SNAPSHOT/maven-metadata.xml.
Return code is: 503 , ReasonPhrase:Service Unavailable.
	at org.apache.maven.wagon.shared.http4.AbstractHttpClientWagon.fillInputData(AbstractHttpClientWagon.java:945)
	at org.apache.maven.wagon.StreamWagon.getInputStream(StreamWagon.java:116)
	at org.apache.maven.wagon.StreamWagon.getIfNewer(StreamWagon.java:88)
	at org.apache.maven.wagon.StreamWagon.get(StreamWagon.java:61)
	at org.eclipse.aether.connector.wagon.WagonRepositoryConnector$GetTask.run(WagonRepositoryConnector.java:660)
	... 4 more
[INFO] Deployment failed after 0.82 sec
Build step 'Deploy artifacts to Maven repository' changed build result to FAILURE

---------------------------------------------------------------------
To unsubscribe, e-mail: dev-unsubscribe@commons.apache.org
For additional commands, e-mail: dev-help@commons.apache.org


Mime
View raw message