commons-dev mailing list archives

Site index · List index
Message view « Date » · « Thread »
Top « Date » · « Thread »
From Apache Jenkins Server <jenk...@builds.apache.org>
Subject Build failed in Jenkins: commons-csv #1
Date Thu, 19 May 2016 13:48:47 GMT
See <https://builds.apache.org/job/commons-csv/1/>

------------------------------------------
[...truncated 150 lines...]
Downloading: http://repo.maven.apache.org/maven2/com/h2database/h2/1.4.182/h2-1.4.182.jar
Downloaded: http://repo.maven.apache.org/maven2/commons-io/commons-io/2.5/commons-io-2.5.jar
(204 KB at 3774.2 KB/sec)
Downloaded: http://repo.maven.apache.org/maven2/com/h2database/h2/1.4.182/h2-1.4.182.jar (1646
KB at 8068.2 KB/sec)
[INFO] 
[INFO] --- maven-clean-plugin:3.0.0:clean (default-clean) @ commons-csv ---
[INFO] 
[INFO] --- maven-enforcer-plugin:1.4.1:enforce (enforce-maven-3) @ commons-csv ---
[INFO] 
[INFO] --- build-helper-maven-plugin:1.10:parse-version (parse-version) @ commons-csv ---
[INFO] 
[INFO] --- maven-antrun-plugin:1.8:run (javadoc.resources) @ commons-csv ---
[INFO] Executing tasks

main:
     [copy] Copying 2 files to <https://builds.apache.org/job/commons-csv/ws/target/apidocs/META-INF>
[INFO] Executed tasks
[INFO] 
[INFO] --- maven-remote-resources-plugin:1.5:process (default) @ commons-csv ---
[INFO] 
[INFO] --- buildnumber-maven-plugin:1.4:create (default) @ commons-csv ---
[INFO] Executing: /bin/sh -c cd '<https://builds.apache.org/job/commons-csv/ws/'> &&
'svn' '--non-interactive' 'info'
[INFO] Working directory: <https://builds.apache.org/job/commons-csv/ws/>
[INFO] Storing buildNumber: 1744569 at timestamp: 1463665340572
[INFO] Executing: /bin/sh -c cd '<https://builds.apache.org/job/commons-csv/ws/'> &&
'svn' '--non-interactive' 'info'
[INFO] Working directory: <https://builds.apache.org/job/commons-csv/ws/>
[INFO] Storing buildScmBranch: trunk
[INFO] 
[INFO] --- maven-resources-plugin:2.7:resources (default-resources) @ commons-csv ---
[INFO] Using 'UTF-8' encoding to copy filtered resources.
[INFO] skip non existing resourceDirectory <https://builds.apache.org/job/commons-csv/ws/src/main/resources>
[INFO] Copying 2 resources to META-INF
[INFO] 
[INFO] --- maven-compiler-plugin:3.5.1:compile (default-compile) @ commons-csv ---
[INFO] Changes detected - recompiling the module!
[INFO] Compiling 11 source files to <https://builds.apache.org/job/commons-csv/ws/target/classes>
[INFO] 
[INFO] --- maven-bundle-plugin:3.0.1:manifest (bundle-manifest) @ commons-csv ---
[INFO] 
[INFO] --- animal-sniffer-maven-plugin:1.15:check (checkAPIcompatibility) @ commons-csv ---
Downloading: http://repo.maven.apache.org/maven2/org/codehaus/mojo/animal-sniffer/1.15/animal-sniffer-1.15.pom
Downloaded: http://repo.maven.apache.org/maven2/org/codehaus/mojo/animal-sniffer/1.15/animal-sniffer-1.15.pom
(3 KB at 19.7 KB/sec)
Downloading: http://repo.maven.apache.org/maven2/org/codehaus/mojo/java-boot-classpath-detector/1.15/java-boot-classpath-detector-1.15.pom
Downloaded: http://repo.maven.apache.org/maven2/org/codehaus/mojo/java-boot-classpath-detector/1.15/java-boot-classpath-detector-1.15.pom
(3 KB at 61.0 KB/sec)
Downloading: http://repo.maven.apache.org/maven2/org/codehaus/mojo/animal-sniffer/1.15/animal-sniffer-1.15.jar
Downloading: http://repo.maven.apache.org/maven2/org/codehaus/mojo/java-boot-classpath-detector/1.15/java-boot-classpath-detector-1.15.jar
Downloaded: http://repo.maven.apache.org/maven2/org/codehaus/mojo/java-boot-classpath-detector/1.15/java-boot-classpath-detector-1.15.jar
(5 KB at 118.7 KB/sec)
Downloaded: http://repo.maven.apache.org/maven2/org/codehaus/mojo/animal-sniffer/1.15/animal-sniffer-1.15.jar
(33 KB at 165.2 KB/sec)
[INFO] Checking unresolved references to org.codehaus.mojo.signature:java16:1.0
Downloading: http://repo.maven.apache.org/maven2/org/codehaus/mojo/signature/java16/1.0/java16-1.0.signature
Downloaded: http://repo.maven.apache.org/maven2/org/codehaus/mojo/signature/java16/1.0/java16-1.0.signature
(579 KB at 9646.0 KB/sec)
[INFO] 
[INFO] --- maven-resources-plugin:2.7:testResources (default-testResources) @ commons-csv
---
[INFO] Using 'UTF-8' encoding to copy filtered resources.
[INFO] Copying 15 resources
[INFO] Copying 2 resources to META-INF
[INFO] 
[INFO] --- maven-compiler-plugin:3.5.1:testCompile (default-testCompile) @ commons-csv ---
[INFO] Changes detected - recompiling the module!
[INFO] Compiling 17 source files to <https://builds.apache.org/job/commons-csv/ws/target/test-classes>
[INFO] <https://builds.apache.org/job/commons-csv/ws/src/test/java/org/apache/commons/csv/CSVPrinterTest.java>:
<https://builds.apache.org/job/commons-csv/ws/src/test/java/org/apache/commons/csv/CSVPrinterTest.java>
uses or overrides a deprecated API.
[INFO] <https://builds.apache.org/job/commons-csv/ws/src/test/java/org/apache/commons/csv/CSVPrinterTest.java>:
Recompile with -Xlint:deprecation for details.
[INFO] 
[INFO] --- jacoco-maven-plugin:0.7.6.201602180812:prepare-agent (prepare-agent) @ commons-csv
---
Downloading: http://repo.maven.apache.org/maven2/org/jacoco/org.jacoco.agent/0.7.6.201602180812/org.jacoco.agent-0.7.6.201602180812.pom
Downloaded: http://repo.maven.apache.org/maven2/org/jacoco/org.jacoco.agent/0.7.6.201602180812/org.jacoco.agent-0.7.6.201602180812.pom
(3 KB at 72.3 KB/sec)
Downloading: http://repo.maven.apache.org/maven2/org/jacoco/org.jacoco.core/0.7.6.201602180812/org.jacoco.core-0.7.6.201602180812.pom
Downloaded: http://repo.maven.apache.org/maven2/org/jacoco/org.jacoco.core/0.7.6.201602180812/org.jacoco.core-0.7.6.201602180812.pom
(2 KB at 30.6 KB/sec)
Downloading: http://repo.maven.apache.org/maven2/org/ow2/asm/asm-debug-all/5.0.4/asm-debug-all-5.0.4.pom
Downloaded: http://repo.maven.apache.org/maven2/org/ow2/asm/asm-debug-all/5.0.4/asm-debug-all-5.0.4.pom
(2 KB at 49.7 KB/sec)
Downloading: http://repo.maven.apache.org/maven2/org/jacoco/org.jacoco.report/0.7.6.201602180812/org.jacoco.report-0.7.6.201602180812.pom
Downloaded: http://repo.maven.apache.org/maven2/org/jacoco/org.jacoco.report/0.7.6.201602180812/org.jacoco.report-0.7.6.201602180812.pom
(2 KB at 34.0 KB/sec)
Downloading: http://repo.maven.apache.org/maven2/org/jacoco/org.jacoco.agent/0.7.6.201602180812/org.jacoco.agent-0.7.6.201602180812-runtime.jar
Downloading: http://repo.maven.apache.org/maven2/org/jacoco/org.jacoco.core/0.7.6.201602180812/org.jacoco.core-0.7.6.201602180812.jar
Downloading: http://repo.maven.apache.org/maven2/org/ow2/asm/asm-debug-all/5.0.4/asm-debug-all-5.0.4.jar
Downloading: http://repo.maven.apache.org/maven2/org/jacoco/org.jacoco.report/0.7.6.201602180812/org.jacoco.report-0.7.6.201602180812.jar
Downloaded: http://repo.maven.apache.org/maven2/org/jacoco/org.jacoco.core/0.7.6.201602180812/org.jacoco.core-0.7.6.201602180812.jar
(133 KB at 3085.1 KB/sec)
Downloaded: http://repo.maven.apache.org/maven2/org/jacoco/org.jacoco.agent/0.7.6.201602180812/org.jacoco.agent-0.7.6.201602180812-runtime.jar
(283 KB at 6274.0 KB/sec)
Downloaded: http://repo.maven.apache.org/maven2/org/jacoco/org.jacoco.report/0.7.6.201602180812/org.jacoco.report-0.7.6.201602180812.jar
(139 KB at 1316.8 KB/sec)
Downloaded: http://repo.maven.apache.org/maven2/org/ow2/asm/asm-debug-all/5.0.4/asm-debug-all-5.0.4.jar
(371 KB at 3009.4 KB/sec)
[INFO] argLine set to -javaagent:/home/jenkins/jenkins-slave/maven-repositories/1/org/jacoco/org.jacoco.agent/0.7.6.201602180812/org.jacoco.agent-0.7.6.201602180812-runtime.jar=destfile=<https://builds.apache.org/job/commons-csv/ws/target/jacoco.exec>
[INFO] 
[INFO] --- maven-surefire-plugin:2.19.1:test (default-test) @ commons-csv ---
[INFO] Tests are skipped.
[INFO] 
[INFO] --- maven-jar-plugin:2.6:jar (default-jar) @ commons-csv ---
[INFO] Building jar: <https://builds.apache.org/job/commons-csv/ws/target/commons-csv-1.4-SNAPSHOT.jar>
[INFO] 
[INFO] --- maven-site-plugin:3.4:attach-descriptor (attach-descriptor) @ commons-csv ---
Downloading: http://repo.maven.apache.org/maven2/org/apache/maven/wagon/wagon-ssh/2.10/wagon-ssh-2.10.pom
Downloaded: http://repo.maven.apache.org/maven2/org/apache/maven/wagon/wagon-ssh/2.10/wagon-ssh-2.10.pom
(6 KB at 147.5 KB/sec)
Downloading: http://repo.maven.apache.org/maven2/org/apache/maven/wagon/wagon-providers/2.10/wagon-providers-2.10.pom
Downloaded: http://repo.maven.apache.org/maven2/org/apache/maven/wagon/wagon-providers/2.10/wagon-providers-2.10.pom
(3 KB at 66.6 KB/sec)
Downloading: http://repo.maven.apache.org/maven2/org/apache/maven/wagon/wagon-ssh-common/2.10/wagon-ssh-common-2.10.pom
Downloaded: http://repo.maven.apache.org/maven2/org/apache/maven/wagon/wagon-ssh-common/2.10/wagon-ssh-common-2.10.pom
(2 KB at 44.9 KB/sec)
Downloading: http://repo.maven.apache.org/maven2/org/apache/maven/wagon/wagon-ssh/2.10/wagon-ssh-2.10.jar
Downloading: http://repo.maven.apache.org/maven2/org/apache/maven/wagon/wagon-ssh-common/2.10/wagon-ssh-common-2.10.jar
Downloaded: http://repo.maven.apache.org/maven2/org/apache/maven/wagon/wagon-ssh/2.10/wagon-ssh-2.10.jar
(30 KB at 732.4 KB/sec)
Downloaded: http://repo.maven.apache.org/maven2/org/apache/maven/wagon/wagon-ssh-common/2.10/wagon-ssh-common-2.10.jar
(26 KB at 597.5 KB/sec)
[INFO] 
[INFO] --- maven-enforcer-plugin:1.4.1:enforce (enforce-maven-3) @ commons-csv ---
[INFO] 
[INFO] --- build-helper-maven-plugin:1.10:parse-version (parse-version) @ commons-csv ---
[INFO] 
[INFO] --- maven-antrun-plugin:1.8:run (javadoc.resources) @ commons-csv ---
[INFO] Executing tasks

main:
[INFO] Executed tasks
[WARNING] Failed to getClass for org.apache.maven.plugin.javadoc.JavadocReport
[INFO] 
[INFO] --- maven-javadoc-plugin:2.10.3:javadoc (create-javadoc-jar) @ commons-csv ---
[INFO] 
1 warning
[WARNING] Javadoc Warnings
[WARNING] warning: [options] bootstrap class path not set in conjunction with -source 1.6
[JENKINS] Archiving  javadoc
[INFO] 
[INFO] --- maven-javadoc-plugin:2.10.3:jar (create-javadoc-jar) @ commons-csv ---
[INFO] 
1 warning
[WARNING] Javadoc Warnings
[WARNING] warning: [options] bootstrap class path not set in conjunction with -source 1.6
[INFO] Building jar: <https://builds.apache.org/job/commons-csv/ws/target/commons-csv-1.4-SNAPSHOT-javadoc.jar>
[INFO] 
[INFO] --- maven-enforcer-plugin:1.4.1:enforce (enforce-maven-3) @ commons-csv ---
[INFO] 
[INFO] --- build-helper-maven-plugin:1.10:parse-version (parse-version) @ commons-csv ---
[INFO] 
[INFO] --- maven-antrun-plugin:1.8:run (javadoc.resources) @ commons-csv ---
[INFO] Executing tasks

main:
[INFO] Executed tasks
[WARNING] Failed to getClass for org.apache.maven.plugins.source.SourceJarMojo
[INFO] 
[INFO] --- maven-source-plugin:3.0.0:jar (create-source-jar) @ commons-csv ---
[INFO] Building jar: <https://builds.apache.org/job/commons-csv/ws/target/commons-csv-1.4-SNAPSHOT-sources.jar>
[INFO] 
[INFO] --- maven-enforcer-plugin:1.4.1:enforce (enforce-maven-3) @ commons-csv ---
[INFO] 
[INFO] --- build-helper-maven-plugin:1.10:parse-version (parse-version) @ commons-csv ---
[INFO] 
[INFO] --- maven-antrun-plugin:1.8:run (javadoc.resources) @ commons-csv ---
[INFO] Executing tasks

main:
[INFO] Executed tasks
[WARNING] Failed to getClass for org.apache.maven.plugins.source.TestSourceJarMojo
[INFO] 
[INFO] --- maven-source-plugin:3.0.0:test-jar (create-source-jar) @ commons-csv ---
[INFO] Building jar: <https://builds.apache.org/job/commons-csv/ws/target/commons-csv-1.4-SNAPSHOT-test-sources.jar>
[INFO] 
[INFO] --- maven-jar-plugin:2.6:test-jar (default) @ commons-csv ---
[INFO] Building jar: <https://builds.apache.org/job/commons-csv/ws/target/commons-csv-1.4-SNAPSHOT-tests.jar>
[INFO] 
[INFO] --- maven-assembly-plugin:2.6:single (default) @ commons-csv ---
Downloading: http://repo.maven.apache.org/maven2/org/codehaus/plexus/plexus-archiver/3.0.1/plexus-archiver-3.0.1.pom
Downloaded: http://repo.maven.apache.org/maven2/org/codehaus/plexus/plexus-archiver/3.0.1/plexus-archiver-3.0.1.pom
(6 KB at 44.1 KB/sec)
Downloading: http://repo.maven.apache.org/maven2/org/iq80/snappy/snappy/0.3/snappy-0.3.pom
Downloaded: http://repo.maven.apache.org/maven2/org/iq80/snappy/snappy/0.3/snappy-0.3.pom
(15 KB at 360.6 KB/sec)
Downloading: http://repo.maven.apache.org/maven2/org/iq80/snappy/snappy/0.3/snappy-0.3.jar
Downloading: http://repo.maven.apache.org/maven2/org/codehaus/plexus/plexus-archiver/3.0.1/plexus-archiver-3.0.1.jar
Downloaded: http://repo.maven.apache.org/maven2/org/iq80/snappy/snappy/0.3/snappy-0.3.jar
(48 KB at 1161.5 KB/sec)
Downloaded: http://repo.maven.apache.org/maven2/org/codehaus/plexus/plexus-archiver/3.0.1/plexus-archiver-3.0.1.jar
(373 KB at 1805.8 KB/sec)
[INFO] Reading assembly descriptor: src/assembly/bin.xml
[INFO] Reading assembly descriptor: src/assembly/src.xml
[INFO] Building tar: <https://builds.apache.org/job/commons-csv/ws/target/commons-csv-1.4-SNAPSHOT-bin.tar.gz>
[INFO] Building zip: <https://builds.apache.org/job/commons-csv/ws/target/commons-csv-1.4-SNAPSHOT-bin.zip>
[INFO] Building tar: <https://builds.apache.org/job/commons-csv/ws/target/commons-csv-1.4-SNAPSHOT-src.tar.gz>
[INFO] Building zip: <https://builds.apache.org/job/commons-csv/ws/target/commons-csv-1.4-SNAPSHOT-src.zip>
[INFO] 
[INFO] --- maven-gpg-plugin:1.6:sign (sign-artifacts) @ commons-csv ---
[INFO] 
[INFO] --- jacoco-maven-plugin:0.7.6.201602180812:check (check) @ commons-csv ---
[INFO] Skipping JaCoCo execution due to missing execution data <https://builds.apache.org/job/commons-csv/ws/target/jacoco.exec>
[INFO] 
[INFO] --- maven-install-plugin:2.5.2:install (default-install) @ commons-csv ---
[INFO] Installing <https://builds.apache.org/job/commons-csv/ws/target/commons-csv-1.4-SNAPSHOT.jar>
to /home/jenkins/jenkins-slave/maven-repositories/1/org/apache/commons/commons-csv/1.4-SNAPSHOT/commons-csv-1.4-SNAPSHOT.jar
[INFO] Installing <https://builds.apache.org/job/commons-csv/ws/pom.xml> to /home/jenkins/jenkins-slave/maven-repositories/1/org/apache/commons/commons-csv/1.4-SNAPSHOT/commons-csv-1.4-SNAPSHOT.pom
[INFO] Installing <https://builds.apache.org/job/commons-csv/ws/target/commons-csv-1.4-SNAPSHOT-javadoc.jar>
to /home/jenkins/jenkins-slave/maven-repositories/1/org/apache/commons/commons-csv/1.4-SNAPSHOT/commons-csv-1.4-SNAPSHOT-javadoc.jar
[INFO] Installing <https://builds.apache.org/job/commons-csv/ws/target/commons-csv-1.4-SNAPSHOT-sources.jar>
to /home/jenkins/jenkins-slave/maven-repositories/1/org/apache/commons/commons-csv/1.4-SNAPSHOT/commons-csv-1.4-SNAPSHOT-sources.jar
[INFO] Installing <https://builds.apache.org/job/commons-csv/ws/target/commons-csv-1.4-SNAPSHOT-test-sources.jar>
to /home/jenkins/jenkins-slave/maven-repositories/1/org/apache/commons/commons-csv/1.4-SNAPSHOT/commons-csv-1.4-SNAPSHOT-test-sources.jar
[INFO] Installing <https://builds.apache.org/job/commons-csv/ws/target/commons-csv-1.4-SNAPSHOT-tests.jar>
to /home/jenkins/jenkins-slave/maven-repositories/1/org/apache/commons/commons-csv/1.4-SNAPSHOT/commons-csv-1.4-SNAPSHOT-tests.jar
[INFO] Installing <https://builds.apache.org/job/commons-csv/ws/target/commons-csv-1.4-SNAPSHOT-bin.tar.gz>
to /home/jenkins/jenkins-slave/maven-repositories/1/org/apache/commons/commons-csv/1.4-SNAPSHOT/commons-csv-1.4-SNAPSHOT-bin.tar.gz
[INFO] Installing <https://builds.apache.org/job/commons-csv/ws/target/commons-csv-1.4-SNAPSHOT-bin.zip>
to /home/jenkins/jenkins-slave/maven-repositories/1/org/apache/commons/commons-csv/1.4-SNAPSHOT/commons-csv-1.4-SNAPSHOT-bin.zip
[INFO] Installing <https://builds.apache.org/job/commons-csv/ws/target/commons-csv-1.4-SNAPSHOT-src.tar.gz>
to /home/jenkins/jenkins-slave/maven-repositories/1/org/apache/commons/commons-csv/1.4-SNAPSHOT/commons-csv-1.4-SNAPSHOT-src.tar.gz
[INFO] Installing <https://builds.apache.org/job/commons-csv/ws/target/commons-csv-1.4-SNAPSHOT-src.zip>
to /home/jenkins/jenkins-slave/maven-repositories/1/org/apache/commons/commons-csv/1.4-SNAPSHOT/commons-csv-1.4-SNAPSHOT-src.zip
[INFO] ------------------------------------------------------------------------
[INFO] BUILD SUCCESS
[INFO] ------------------------------------------------------------------------
[INFO] Total time: 1:04.892s
[INFO] Finished at: Thu May 19 13:43:15 UTC 2016
[INFO] Final Memory: 34M/310M
[INFO] ------------------------------------------------------------------------
Waiting for Jenkins to finish collecting data
[JENKINS] Archiving <https://builds.apache.org/job/commons-csv/ws/pom.xml> to org.apache.commons/commons-csv/1.4-SNAPSHOT/commons-csv-1.4-SNAPSHOT.pom
[JENKINS] Archiving <https://builds.apache.org/job/commons-csv/ws/target/commons-csv-1.4-SNAPSHOT.jar>
to org.apache.commons/commons-csv/1.4-SNAPSHOT/commons-csv-1.4-SNAPSHOT.jar
[JENKINS] Archiving <https://builds.apache.org/job/commons-csv/ws/target/commons-csv-1.4-SNAPSHOT-javadoc.jar>
to org.apache.commons/commons-csv/1.4-SNAPSHOT/commons-csv-1.4-SNAPSHOT-javadoc.jar
[JENKINS] Archiving <https://builds.apache.org/job/commons-csv/ws/target/commons-csv-1.4-SNAPSHOT-sources.jar>
to org.apache.commons/commons-csv/1.4-SNAPSHOT/commons-csv-1.4-SNAPSHOT-sources.jar
[JENKINS] Archiving <https://builds.apache.org/job/commons-csv/ws/target/commons-csv-1.4-SNAPSHOT-test-sources.jar>
to org.apache.commons/commons-csv/1.4-SNAPSHOT/commons-csv-1.4-SNAPSHOT-test-sources.jar
[JENKINS] Archiving <https://builds.apache.org/job/commons-csv/ws/target/commons-csv-1.4-SNAPSHOT-tests.jar>
to org.apache.commons/commons-csv/1.4-SNAPSHOT/commons-csv-1.4-SNAPSHOT-tests.jar
[JENKINS] Archiving <https://builds.apache.org/job/commons-csv/ws/target/commons-csv-1.4-SNAPSHOT-bin.tar.gz>
to org.apache.commons/commons-csv/1.4-SNAPSHOT/commons-csv-1.4-SNAPSHOT-bin.tar.gz
[JENKINS] Archiving <https://builds.apache.org/job/commons-csv/ws/target/commons-csv-1.4-SNAPSHOT-bin.zip>
to org.apache.commons/commons-csv/1.4-SNAPSHOT/commons-csv-1.4-SNAPSHOT-bin.zip
[JENKINS] Archiving <https://builds.apache.org/job/commons-csv/ws/target/commons-csv-1.4-SNAPSHOT-src.tar.gz>
to org.apache.commons/commons-csv/1.4-SNAPSHOT/commons-csv-1.4-SNAPSHOT-src.tar.gz
[JENKINS] Archiving <https://builds.apache.org/job/commons-csv/ws/target/commons-csv-1.4-SNAPSHOT-src.zip>
to org.apache.commons/commons-csv/1.4-SNAPSHOT/commons-csv-1.4-SNAPSHOT-src.zip
No prior successful build to compare, so performing full copy of artifacts
channel stopped
Maven RedeployPublisher use remote beam2 maven settings from : /home/jenkins/.m2/settings.xml
[INFO] Deployment in https://repository.apache.org/content/repositories/snapshots (id=apache.snapshots.https,uniqueVersion=true)
Deploying the main artifact commons-csv-1.4-SNAPSHOT.jar
Downloading: https://repository.apache.org/content/repositories/snapshots/org/apache/commons/commons-csv/1.4-SNAPSHOT/maven-metadata.xml
ERROR: Failed to retrieve remote metadata org.apache.commons:commons-csv:1.4-SNAPSHOT/maven-metadata.xml:
Could not transfer metadata org.apache.commons:commons-csv:1.4-SNAPSHOT/maven-metadata.xml
from/to apache.snapshots.https (https://repository.apache.org/content/repositories/snapshots):
Failed to transfer file: https://repository.apache.org/content/repositories/snapshots/org/apache/commons/commons-csv/1.4-SNAPSHOT/maven-metadata.xml.
Return code is: 502 , ReasonPhrase:Proxy Error.
org.apache.maven.artifact.deployer.ArtifactDeploymentException: Failed to retrieve remote
metadata org.apache.commons:commons-csv:1.4-SNAPSHOT/maven-metadata.xml: Could not transfer
metadata org.apache.commons:commons-csv:1.4-SNAPSHOT/maven-metadata.xml from/to apache.snapshots.https
(https://repository.apache.org/content/repositories/snapshots): Failed to transfer file: https://repository.apache.org/content/repositories/snapshots/org/apache/commons/commons-csv/1.4-SNAPSHOT/maven-metadata.xml.
Return code is: 502 , ReasonPhrase:Proxy Error.
	at org.apache.maven.artifact.deployer.DefaultArtifactDeployer.deploy(DefaultArtifactDeployer.java:143)
	at hudson.maven.reporters.MavenArtifactRecord.deploy(MavenArtifactRecord.java:193)
	at hudson.maven.RedeployPublisher.perform(RedeployPublisher.java:176)
	at hudson.tasks.BuildStepMonitor$1.perform(BuildStepMonitor.java:20)
	at hudson.model.AbstractBuild$AbstractBuildExecution.perform(AbstractBuild.java:782)
	at hudson.model.AbstractBuild$AbstractBuildExecution.performAllBuildSteps(AbstractBuild.java:723)
	at hudson.maven.MavenModuleSetBuild$MavenModuleSetBuildExecution.post2(MavenModuleSetBuild.java:1047)
	at hudson.model.AbstractBuild$AbstractBuildExecution.post(AbstractBuild.java:668)
	at hudson.model.Run.execute(Run.java:1763)
	at hudson.maven.MavenModuleSetBuild.run(MavenModuleSetBuild.java:531)
	at hudson.model.ResourceController.execute(ResourceController.java:98)
	at hudson.model.Executor.run(Executor.java:410)
Caused by: org.eclipse.aether.deployment.DeploymentException: Failed to retrieve remote metadata
org.apache.commons:commons-csv:1.4-SNAPSHOT/maven-metadata.xml: Could not transfer metadata
org.apache.commons:commons-csv:1.4-SNAPSHOT/maven-metadata.xml from/to apache.snapshots.https
(https://repository.apache.org/content/repositories/snapshots): Failed to transfer file: https://repository.apache.org/content/repositories/snapshots/org/apache/commons/commons-csv/1.4-SNAPSHOT/maven-metadata.xml.
Return code is: 502 , ReasonPhrase:Proxy Error.
	at org.eclipse.aether.internal.impl.DefaultDeployer.upload(DefaultDeployer.java:470)
	at org.eclipse.aether.internal.impl.DefaultDeployer.deploy(DefaultDeployer.java:314)
	at org.eclipse.aether.internal.impl.DefaultDeployer.deploy(DefaultDeployer.java:269)
	at org.eclipse.aether.internal.impl.DefaultRepositorySystem.deploy(DefaultRepositorySystem.java:413)
	at org.apache.maven.artifact.deployer.DefaultArtifactDeployer.deploy(DefaultArtifactDeployer.java:139)
	... 11 more
Caused by: org.eclipse.aether.transfer.MetadataTransferException: Could not transfer metadata
org.apache.commons:commons-csv:1.4-SNAPSHOT/maven-metadata.xml from/to apache.snapshots.https
(https://repository.apache.org/content/repositories/snapshots): Failed to transfer file: https://repository.apache.org/content/repositories/snapshots/org/apache/commons/commons-csv/1.4-SNAPSHOT/maven-metadata.xml.
Return code is: 502 , ReasonPhrase:Proxy Error.
	at org.eclipse.aether.connector.wagon.WagonRepositoryConnector$5.wrap(WagonRepositoryConnector.java:995)
	at org.eclipse.aether.connector.wagon.WagonRepositoryConnector$5.wrap(WagonRepositoryConnector.java:983)
	at org.eclipse.aether.connector.wagon.WagonRepositoryConnector$GetTask.run(WagonRepositoryConnector.java:725)
	at org.eclipse.aether.util.concurrency.RunnableErrorForwarder$1.run(RunnableErrorForwarder.java:67)
	at java.util.concurrent.ThreadPoolExecutor.runWorker(ThreadPoolExecutor.java:1145)
	at java.util.concurrent.ThreadPoolExecutor$Worker.run(ThreadPoolExecutor.java:615)
	at java.lang.Thread.run(Thread.java:745)
Caused by: org.apache.maven.wagon.TransferFailedException: Failed to transfer file: https://repository.apache.org/content/repositories/snapshots/org/apache/commons/commons-csv/1.4-SNAPSHOT/maven-metadata.xml.
Return code is: 502 , ReasonPhrase:Proxy Error.
	at org.apache.maven.wagon.shared.http4.AbstractHttpClientWagon.fillInputData(AbstractHttpClientWagon.java:945)
	at org.apache.maven.wagon.StreamWagon.getInputStream(StreamWagon.java:116)
	at org.apache.maven.wagon.StreamWagon.getIfNewer(StreamWagon.java:88)
	at org.apache.maven.wagon.StreamWagon.get(StreamWagon.java:61)
	at org.eclipse.aether.connector.wagon.WagonRepositoryConnector$GetTask.run(WagonRepositoryConnector.java:660)
	... 4 more
[INFO] Deployment failed after 5 min 14 sec
Build step 'Deploy artifacts to Maven repository' changed build result to FAILURE

---------------------------------------------------------------------
To unsubscribe, e-mail: dev-unsubscribe@commons.apache.org
For additional commands, e-mail: dev-help@commons.apache.org


Mime
View raw message