commons-dev mailing list archives

Site index · List index
Message view « Date » · « Thread »
Top « Date » · « Thread »
From Apache Jenkins Server <jenk...@builds.apache.org>
Subject Build failed in Jenkins: Commons-Compress-Windows #10
Date Fri, 08 Apr 2016 18:24:03 GMT
See <https://builds.apache.org/job/Commons-Compress-Windows/10/changes>

Changes:

[sebb] Some more lost EOL properties

------------------------------------------
[...truncated 183 lines...]
Tests run: 1, Failures: 0, Errors: 0, Skipped: 0, Time elapsed: 0 sec - in org.apache.commons.compress.archivers.zip.ScatterZipOutputStreamTest
Running org.apache.commons.compress.archivers.zip.StreamCompressorTest
Tests run: 2, Failures: 0, Errors: 0, Skipped: 0, Time elapsed: 0.001 sec - in org.apache.commons.compress.archivers.zip.StreamCompressorTest
Running org.apache.commons.compress.archivers.zip.UTF8ZipFilesTest
Tests run: 17, Failures: 0, Errors: 0, Skipped: 0, Time elapsed: 0 sec - in org.apache.commons.compress.archivers.zip.UTF8ZipFilesTest
Running org.apache.commons.compress.archivers.zip.X000A_NTFSTest
Tests run: 1, Failures: 0, Errors: 0, Skipped: 0, Time elapsed: 0 sec - in org.apache.commons.compress.archivers.zip.X000A_NTFSTest
Running org.apache.commons.compress.archivers.zip.X5455_ExtendedTimestampTest
Tests run: 7, Failures: 0, Errors: 0, Skipped: 0, Time elapsed: 0.001 sec - in org.apache.commons.compress.archivers.zip.X5455_ExtendedTimestampTest
Running org.apache.commons.compress.archivers.zip.X7875_NewUnixTest
Tests run: 5, Failures: 0, Errors: 0, Skipped: 0, Time elapsed: 0.001 sec - in org.apache.commons.compress.archivers.zip.X7875_NewUnixTest
Running org.apache.commons.compress.archivers.zip.Zip64ExtendedInformationExtraFieldTest
Tests run: 12, Failures: 0, Errors: 0, Skipped: 0, Time elapsed: 0.001 sec - in org.apache.commons.compress.archivers.zip.Zip64ExtendedInformationExtraFieldTest
Running org.apache.commons.compress.archivers.zip.ZipArchiveEntryTest
Tests run: 8, Failures: 0, Errors: 0, Skipped: 0, Time elapsed: 0.038 sec - in org.apache.commons.compress.archivers.zip.ZipArchiveEntryTest
Running org.apache.commons.compress.archivers.zip.ZipArchiveInputStreamTest
Tests run: 7, Failures: 1, Errors: 0, Skipped: 0, Time elapsed: 0 sec <<< FAILURE!
- in org.apache.commons.compress.archivers.zip.ZipArchiveInputStreamTest
testUnshrinkEntry(org.apache.commons.compress.archivers.zip.ZipArchiveInputStreamTest)  Time
elapsed: 0 sec  <<< FAILURE!
java.lang.AssertionError: array lengths differed, expected.length=80 actual.length=76
	at org.junit.Assert.fail(Assert.java:88)
	at org.junit.internal.ComparisonCriteria.assertArraysAreSameLength(ComparisonCriteria.java:76)
	at org.junit.internal.ComparisonCriteria.arrayEquals(ComparisonCriteria.java:37)
	at org.junit.Assert.internalArrayEquals(Assert.java:532)
	at org.junit.Assert.assertArrayEquals(Assert.java:341)
	at org.junit.Assert.assertArrayEquals(Assert.java:352)
	at org.apache.commons.compress.archivers.zip.ZipArchiveInputStreamTest.testUnshrinkEntry(ZipArchiveInputStreamTest.java:137)

Running org.apache.commons.compress.archivers.zip.ZipEightByteIntegerTest
Tests run: 6, Failures: 0, Errors: 0, Skipped: 0, Time elapsed: 0 sec - in org.apache.commons.compress.archivers.zip.ZipEightByteIntegerTest
Running org.apache.commons.compress.archivers.zip.ZipEncodingTest
Tests run: 3, Failures: 0, Errors: 0, Skipped: 0, Time elapsed: 0 sec - in org.apache.commons.compress.archivers.zip.ZipEncodingTest
Running org.apache.commons.compress.archivers.zip.ZipFileTest
Tests run: 12, Failures: 1, Errors: 0, Skipped: 0, Time elapsed: 0 sec <<< FAILURE!
- in org.apache.commons.compress.archivers.zip.ZipFileTest
testUnshrinking(org.apache.commons.compress.archivers.zip.ZipFileTest)  Time elapsed: 0 sec
 <<< FAILURE!
java.lang.AssertionError: array lengths differed, expected.length=80 actual.length=76
	at org.junit.Assert.fail(Assert.java:88)
	at org.junit.internal.ComparisonCriteria.assertArraysAreSameLength(ComparisonCriteria.java:76)
	at org.junit.internal.ComparisonCriteria.arrayEquals(ComparisonCriteria.java:37)
	at org.junit.Assert.internalArrayEquals(Assert.java:532)
	at org.junit.Assert.assertArrayEquals(Assert.java:341)
	at org.junit.Assert.assertArrayEquals(Assert.java:352)
	at org.apache.commons.compress.archivers.zip.ZipFileTest.testUnshrinking(ZipFileTest.java:258)

Running org.apache.commons.compress.archivers.zip.ZipLongTest
Tests run: 6, Failures: 0, Errors: 0, Skipped: 0, Time elapsed: 0 sec - in org.apache.commons.compress.archivers.zip.ZipLongTest
Running org.apache.commons.compress.archivers.zip.ZipShortTest
Tests run: 6, Failures: 0, Errors: 0, Skipped: 0, Time elapsed: 0.001 sec - in org.apache.commons.compress.archivers.zip.ZipShortTest
Running org.apache.commons.compress.archivers.zip.ZipUtilTest
Tests run: 10, Failures: 0, Errors: 0, Skipped: 0, Time elapsed: 0.001 sec - in org.apache.commons.compress.archivers.zip.ZipUtilTest
Running org.apache.commons.compress.archivers.ZipTestCase
Tests run: 13, Failures: 0, Errors: 0, Skipped: 0, Time elapsed: 0.02 sec - in org.apache.commons.compress.archivers.ZipTestCase
Running org.apache.commons.compress.ArchiveUtilsTest
Tests run: 3, Failures: 0, Errors: 0, Skipped: 0, Time elapsed: 0.007 sec - in org.apache.commons.compress.ArchiveUtilsTest
Running org.apache.commons.compress.ChainingTestCase
Tests run: 2, Failures: 0, Errors: 0, Skipped: 0, Time elapsed: 0.007 sec - in org.apache.commons.compress.ChainingTestCase
Running org.apache.commons.compress.changes.ChangeSetTestCase
Tests run: 28, Failures: 0, Errors: 0, Skipped: 0, Time elapsed: 0.378 sec - in org.apache.commons.compress.changes.ChangeSetTestCase
Running org.apache.commons.compress.compressors.bzip2.BlockSortTest
Tests run: 7, Failures: 0, Errors: 0, Skipped: 0, Time elapsed: 0.103 sec - in org.apache.commons.compress.compressors.bzip2.BlockSortTest
Running org.apache.commons.compress.compressors.bzip2.BZip2CompressorInputStreamTest
Tests run: 2, Failures: 0, Errors: 0, Skipped: 0, Time elapsed: 0.791 sec - in org.apache.commons.compress.compressors.bzip2.BZip2CompressorInputStreamTest
Running org.apache.commons.compress.compressors.bzip2.PythonTruncatedBzip2Test
Attempt to read the whole thing in, should throw ...
Tests run: 2, Failures: 0, Errors: 0, Skipped: 0, Time elapsed: 0.041 sec - in org.apache.commons.compress.compressors.bzip2.PythonTruncatedBzip2Test
Running org.apache.commons.compress.compressors.BZip2TestCase
Tests run: 5, Failures: 0, Errors: 0, Skipped: 0, Time elapsed: 0.051 sec - in org.apache.commons.compress.compressors.BZip2TestCase
Running org.apache.commons.compress.compressors.BZip2UtilsTestCase
Tests run: 3, Failures: 0, Errors: 0, Skipped: 0, Time elapsed: 0.004 sec - in org.apache.commons.compress.compressors.BZip2UtilsTestCase
Running org.apache.commons.compress.compressors.deflate.DeflateCompressorInputStreamTest
Tests run: 4, Failures: 0, Errors: 0, Skipped: 0, Time elapsed: 0.004 sec - in org.apache.commons.compress.compressors.deflate.DeflateCompressorInputStreamTest
Running org.apache.commons.compress.compressors.deflate.DeflateCompressorOutputStreamTest
Tests run: 1, Failures: 0, Errors: 0, Skipped: 0, Time elapsed: 0.002 sec - in org.apache.commons.compress.compressors.deflate.DeflateCompressorOutputStreamTest
Running org.apache.commons.compress.compressors.deflate.DeflateParametersTest
Tests run: 3, Failures: 0, Errors: 0, Skipped: 0, Time elapsed: 0.002 sec - in org.apache.commons.compress.compressors.deflate.DeflateParametersTest
Running org.apache.commons.compress.compressors.DeflateTestCase
Tests run: 4, Failures: 0, Errors: 0, Skipped: 0, Time elapsed: 0.009 sec - in org.apache.commons.compress.compressors.DeflateTestCase
Running org.apache.commons.compress.compressors.DetectCompressorTestCase
Tests run: 3, Failures: 0, Errors: 0, Skipped: 0, Time elapsed: 0.088 sec - in org.apache.commons.compress.compressors.DetectCompressorTestCase
Running org.apache.commons.compress.compressors.FramedSnappyTestCase
Tests run: 3, Failures: 0, Errors: 0, Skipped: 0, Time elapsed: 0.08 sec - in org.apache.commons.compress.compressors.FramedSnappyTestCase
Running org.apache.commons.compress.compressors.GZipTestCase
Tests run: 13, Failures: 0, Errors: 0, Skipped: 0, Time elapsed: 0.046 sec - in org.apache.commons.compress.compressors.GZipTestCase
Running org.apache.commons.compress.compressors.GzipUtilsTestCase
Tests run: 3, Failures: 0, Errors: 0, Skipped: 0, Time elapsed: 0.002 sec - in org.apache.commons.compress.compressors.GzipUtilsTestCase
Running org.apache.commons.compress.compressors.lzma.LZMAUtilsTestCase
Tests run: 7, Failures: 0, Errors: 0, Skipped: 0, Time elapsed: 0.003 sec - in org.apache.commons.compress.compressors.lzma.LZMAUtilsTestCase
Running org.apache.commons.compress.compressors.LZMATestCase
Tests run: 2, Failures: 0, Errors: 0, Skipped: 0, Time elapsed: 0.015 sec - in org.apache.commons.compress.compressors.LZMATestCase
Running org.apache.commons.compress.compressors.pack200.Pack200UtilsTest
Tests run: 2, Failures: 0, Errors: 0, Skipped: 0, Time elapsed: 0.061 sec - in org.apache.commons.compress.compressors.pack200.Pack200UtilsTest
Running org.apache.commons.compress.compressors.Pack200TestCase
Tests run: 11, Failures: 0, Errors: 0, Skipped: 0, Time elapsed: 0.115 sec - in org.apache.commons.compress.compressors.Pack200TestCase
Running org.apache.commons.compress.compressors.snappy.FramedSnappyCompressorInputStreamTest
Tests run: 6, Failures: 0, Errors: 0, Skipped: 0, Time elapsed: 0.165 sec - in org.apache.commons.compress.compressors.snappy.FramedSnappyCompressorInputStreamTest
Running org.apache.commons.compress.compressors.xz.XZCompressorInputStreamTest
Tests run: 1, Failures: 0, Errors: 0, Skipped: 0, Time elapsed: 0.003 sec - in org.apache.commons.compress.compressors.xz.XZCompressorInputStreamTest
Running org.apache.commons.compress.compressors.xz.XZUtilsTestCase
Tests run: 7, Failures: 0, Errors: 0, Skipped: 0, Time elapsed: 0.009 sec - in org.apache.commons.compress.compressors.xz.XZUtilsTestCase
Running org.apache.commons.compress.compressors.XZTestCase
XZTestCase: HeapMax=2075918336 bytes 1979.75 MB
Tests run: 4, Failures: 0, Errors: 0, Skipped: 0, Time elapsed: 0.192 sec - in org.apache.commons.compress.compressors.XZTestCase
Running org.apache.commons.compress.compressors.ZTestCase
Tests run: 4, Failures: 0, Errors: 0, Skipped: 0, Time elapsed: 0.04 sec - in org.apache.commons.compress.compressors.ZTestCase
Running org.apache.commons.compress.DetectArchiverTestCase
Tests run: 7, Failures: 0, Errors: 0, Skipped: 0, Time elapsed: 0.034 sec - in org.apache.commons.compress.DetectArchiverTestCase
Running org.apache.commons.compress.IOMethodsTest
Tests run: 10, Failures: 0, Errors: 0, Skipped: 0, Time elapsed: 0.092 sec - in org.apache.commons.compress.IOMethodsTest
Running org.apache.commons.compress.utils.BitInputStreamTest
Tests run: 12, Failures: 0, Errors: 0, Skipped: 0, Time elapsed: 0.005 sec - in org.apache.commons.compress.utils.BitInputStreamTest
Running org.apache.commons.compress.utils.CharsetsTest
Tests run: 7, Failures: 0, Errors: 0, Skipped: 0, Time elapsed: 0.002 sec - in org.apache.commons.compress.utils.CharsetsTest
Running org.apache.commons.compress.utils.CountingStreamTest
Tests run: 2, Failures: 0, Errors: 0, Skipped: 0, Time elapsed: 0.002 sec - in org.apache.commons.compress.utils.CountingStreamTest
Running org.apache.commons.compress.utils.IOUtilsTest
Tests run: 3, Failures: 0, Errors: 0, Skipped: 0, Time elapsed: 0.003 sec - in org.apache.commons.compress.utils.IOUtilsTest

Results :

Failed tests: 
  ArchiveReadTest.testArchive:103 Problem checking <https://builds.apache.org/job/Commons-Compress-Windows/ws/target\test-classes\archives\FreeBSD.ar>
  ArchiveReadTest.testArchive:103 Problem checking <https://builds.apache.org/job/Commons-Compress-Windows/ws/target\test-classes\archives\SunOS.ar>
  ZipArchiveInputStreamTest.testUnshrinkEntry:137 array lengths differed, expected.length=80
actual.length=76
  ZipFileTest.testUnshrinking:258 array lengths differed, expected.length=80 actual.length=76

Tests run: 567, Failures: 4, Errors: 0, Skipped: 2

[ERROR] There are test failures.

Please refer to <https://builds.apache.org/job/Commons-Compress-Windows/ws/target\surefire-reports>
for the individual test results.
[JENKINS] Recording test results
[INFO] 
[INFO] --- maven-jar-plugin:2.6:jar (default-jar) @ commons-compress ---
[INFO] Building jar: <https://builds.apache.org/job/Commons-Compress-Windows/ws/target\commons-compress-1.12-SNAPSHOT.jar>
[INFO] 
[INFO] --- maven-site-plugin:3.4:attach-descriptor (attach-descriptor) @ commons-compress
---
[INFO] 
[INFO] --- maven-enforcer-plugin:1.3.1:enforce (enforce-maven-3) @ commons-compress ---
[INFO] 
[INFO] --- build-helper-maven-plugin:1.9.1:parse-version (parse-version) @ commons-compress
---
[INFO] 
[INFO] --- maven-antrun-plugin:1.8:run (javadoc.resources) @ commons-compress ---
[INFO] Executing tasks

main:
[INFO] Executed tasks
[WARNING] Failed to getClass for org.apache.maven.plugin.javadoc.JavadocReport
[INFO] 
[INFO] --- maven-javadoc-plugin:2.10.3:javadoc (create-javadoc-jar) @ commons-compress ---
[INFO] 
1 warning
[WARNING] Javadoc Warnings
[WARNING] warning: [options] bootstrap class path not set in conjunction with -source 1.5
[INFO] Fixed Javadoc frame injection vulnerability (CVE-2013-1571) in 1 files.
[JENKINS] Archiving  javadoc
[INFO] 
[INFO] --- maven-javadoc-plugin:2.10.3:jar (create-javadoc-jar) @ commons-compress ---
[INFO] 
1 warning
[WARNING] Javadoc Warnings
[WARNING] warning: [options] bootstrap class path not set in conjunction with -source 1.5
[INFO] Fixed Javadoc frame injection vulnerability (CVE-2013-1571) in 1 files.
[INFO] Building jar: <https://builds.apache.org/job/Commons-Compress-Windows/ws/target\commons-compress-1.12-SNAPSHOT-javadoc.jar>
[INFO] 
[INFO] --- maven-assembly-plugin:2.5.5:single (default) @ commons-compress ---
[INFO] Reading assembly descriptor: src/main/assembly/bin.xml
[INFO] Reading assembly descriptor: src/main/assembly/src.xml
[INFO] Building tar: <https://builds.apache.org/job/Commons-Compress-Windows/ws/target\commons-compress-1.12-SNAPSHOT-bin.tar.gz>
[INFO] Building zip: <https://builds.apache.org/job/Commons-Compress-Windows/ws/target\commons-compress-1.12-SNAPSHOT-bin.zip>
[INFO] Building tar: <https://builds.apache.org/job/Commons-Compress-Windows/ws/target\commons-compress-1.12-SNAPSHOT-src.tar.gz>
[INFO] Building zip: <https://builds.apache.org/job/Commons-Compress-Windows/ws/target\commons-compress-1.12-SNAPSHOT-src.zip>
[INFO] 
[INFO] --- maven-enforcer-plugin:1.3.1:enforce (enforce-maven-3) @ commons-compress ---
[INFO] 
[INFO] --- build-helper-maven-plugin:1.9.1:parse-version (parse-version) @ commons-compress
---
[INFO] 
[INFO] --- maven-antrun-plugin:1.8:run (javadoc.resources) @ commons-compress ---
[INFO] Executing tasks

main:
[INFO] Executed tasks
[WARNING] Failed to getClass for org.apache.maven.plugin.source.SourceJarMojo
[INFO] 
[INFO] --- maven-source-plugin:2.4:jar (create-source-jar) @ commons-compress ---
[INFO] Building jar: <https://builds.apache.org/job/Commons-Compress-Windows/ws/target\commons-compress-1.12-SNAPSHOT-sources.jar>
[INFO] 
[INFO] --- maven-enforcer-plugin:1.3.1:enforce (enforce-maven-3) @ commons-compress ---
[INFO] 
[INFO] --- build-helper-maven-plugin:1.9.1:parse-version (parse-version) @ commons-compress
---
[INFO] 
[INFO] --- maven-antrun-plugin:1.8:run (javadoc.resources) @ commons-compress ---
[INFO] Executing tasks

main:
[INFO] Executed tasks
[WARNING] Failed to getClass for org.apache.maven.plugin.source.TestSourceJarMojo
[INFO] 
[INFO] --- maven-source-plugin:2.4:test-jar (create-source-jar) @ commons-compress ---
[INFO] Building jar: <https://builds.apache.org/job/Commons-Compress-Windows/ws/target\commons-compress-1.12-SNAPSHOT-test-sources.jar>
[INFO] 
[INFO] --- maven-jar-plugin:2.6:test-jar (default) @ commons-compress ---
[INFO] Building jar: <https://builds.apache.org/job/Commons-Compress-Windows/ws/target\commons-compress-1.12-SNAPSHOT-tests.jar>
[INFO] 
[INFO] --- maven-gpg-plugin:1.6:sign (sign-artifacts) @ commons-compress ---
[INFO] 
[INFO] --- maven-install-plugin:2.5.2:install (default-install) @ commons-compress ---
[INFO] Installing <https://builds.apache.org/job/Commons-Compress-Windows/ws/target\commons-compress-1.12-SNAPSHOT.jar>
to f:\jenkins\jenkins-slave\maven-repositories\1\org\apache\commons\commons-compress\1.12-SNAPSHOT\commons-compress-1.12-SNAPSHOT.jar
[INFO] Installing <https://builds.apache.org/job/Commons-Compress-Windows/ws/pom.xml>
to f:\jenkins\jenkins-slave\maven-repositories\1\org\apache\commons\commons-compress\1.12-SNAPSHOT\commons-compress-1.12-SNAPSHOT.pom
[INFO] Installing <https://builds.apache.org/job/Commons-Compress-Windows/ws/target\commons-compress-1.12-SNAPSHOT-javadoc.jar>
to f:\jenkins\jenkins-slave\maven-repositories\1\org\apache\commons\commons-compress\1.12-SNAPSHOT\commons-compress-1.12-SNAPSHOT-javadoc.jar
[INFO] Installing <https://builds.apache.org/job/Commons-Compress-Windows/ws/target\commons-compress-1.12-SNAPSHOT-bin.tar.gz>
to f:\jenkins\jenkins-slave\maven-repositories\1\org\apache\commons\commons-compress\1.12-SNAPSHOT\commons-compress-1.12-SNAPSHOT-bin.tar.gz
[INFO] Installing <https://builds.apache.org/job/Commons-Compress-Windows/ws/target\commons-compress-1.12-SNAPSHOT-bin.zip>
to f:\jenkins\jenkins-slave\maven-repositories\1\org\apache\commons\commons-compress\1.12-SNAPSHOT\commons-compress-1.12-SNAPSHOT-bin.zip
[INFO] Installing <https://builds.apache.org/job/Commons-Compress-Windows/ws/target\commons-compress-1.12-SNAPSHOT-src.tar.gz>
to f:\jenkins\jenkins-slave\maven-repositories\1\org\apache\commons\commons-compress\1.12-SNAPSHOT\commons-compress-1.12-SNAPSHOT-src.tar.gz
[INFO] Installing <https://builds.apache.org/job/Commons-Compress-Windows/ws/target\commons-compress-1.12-SNAPSHOT-src.zip>
to f:\jenkins\jenkins-slave\maven-repositories\1\org\apache\commons\commons-compress\1.12-SNAPSHOT\commons-compress-1.12-SNAPSHOT-src.zip
[INFO] Installing <https://builds.apache.org/job/Commons-Compress-Windows/ws/target\commons-compress-1.12-SNAPSHOT-sources.jar>
to f:\jenkins\jenkins-slave\maven-repositories\1\org\apache\commons\commons-compress\1.12-SNAPSHOT\commons-compress-1.12-SNAPSHOT-sources.jar
[INFO] Installing <https://builds.apache.org/job/Commons-Compress-Windows/ws/target\commons-compress-1.12-SNAPSHOT-test-sources.jar>
to f:\jenkins\jenkins-slave\maven-repositories\1\org\apache\commons\commons-compress\1.12-SNAPSHOT\commons-compress-1.12-SNAPSHOT-test-sources.jar
[INFO] Installing <https://builds.apache.org/job/Commons-Compress-Windows/ws/target\commons-compress-1.12-SNAPSHOT-tests.jar>
to f:\jenkins\jenkins-slave\maven-repositories\1\org\apache\commons\commons-compress\1.12-SNAPSHOT\commons-compress-1.12-SNAPSHOT-tests.jar
[INFO] 
[INFO] --- maven-deploy-plugin:2.8.2:deploy (default-deploy) @ commons-compress ---
Downloading: https://repository.apache.org/content/repositories/snapshots/org/apache/commons/commons-compress/1.12-SNAPSHOT/maven-metadata.xml
Downloaded: https://repository.apache.org/content/repositories/snapshots/org/apache/commons/commons-compress/1.12-SNAPSHOT/maven-metadata.xml
(3 KB at 4.7 KB/sec)
Uploading: https://repository.apache.org/content/repositories/snapshots/org/apache/commons/commons-compress/1.12-SNAPSHOT/commons-compress-1.12-20160408.182316-9.jar
Uploading: https://repository.apache.org/content/repositories/snapshots/org/apache/commons/commons-compress/1.12-SNAPSHOT/commons-compress-1.12-20160408.182316-9.pom
[INFO] ------------------------------------------------------------------------
[INFO] BUILD FAILURE
[INFO] ------------------------------------------------------------------------
[INFO] Total time: 1:23.683s
[INFO] Finished at: Fri Apr 08 11:23:17 PDT 2016
[INFO] Final Memory: 28M/247M
[INFO] ------------------------------------------------------------------------
Waiting for Jenkins to finish collecting data
[ERROR] Failed to execute goal org.apache.maven.plugins:maven-deploy-plugin:2.8.2:deploy (default-deploy)
on project commons-compress: Failed to deploy artifacts: Could not transfer artifact org.apache.commons:commons-compress:jar:1.12-20160408.182316-9
from/to apache.snapshots.https (https://repository.apache.org/content/repositories/snapshots):
Failed to transfer file: https://repository.apache.org/content/repositories/snapshots/org/apache/commons/commons-compress/1.12-SNAPSHOT/commons-compress-1.12-20160408.182316-9.jar.
Return code is: 401, ReasonPhrase:Unauthorized. -> [Help 1]
[ERROR] 
[ERROR] To see the full stack trace of the errors, re-run Maven with the -e switch.
[ERROR] Re-run Maven using the -X switch to enable full debug logging.
[ERROR] 
[ERROR] For more information about the errors and possible solutions, please read the following
articles:
[ERROR] [Help 1] http://cwiki.apache.org/confluence/display/MAVEN/MojoExecutionException
[JENKINS] Archiving <https://builds.apache.org/job/Commons-Compress-Windows/ws/pom.xml>
to org.apache.commons/commons-compress/1.12-SNAPSHOT/commons-compress-1.12-SNAPSHOT.pom
[JENKINS] Archiving <https://builds.apache.org/job/Commons-Compress-Windows/ws/target\commons-compress-1.12-SNAPSHOT.jar>
to org.apache.commons/commons-compress/1.12-SNAPSHOT/commons-compress-1.12-SNAPSHOT.jar
[JENKINS] Archiving <https://builds.apache.org/job/Commons-Compress-Windows/ws/target\commons-compress-1.12-SNAPSHOT-javadoc.jar>
to org.apache.commons/commons-compress/1.12-SNAPSHOT/commons-compress-1.12-SNAPSHOT-javadoc.jar
[JENKINS] Archiving <https://builds.apache.org/job/Commons-Compress-Windows/ws/target\commons-compress-1.12-SNAPSHOT-bin.tar.gz>
to org.apache.commons/commons-compress/1.12-SNAPSHOT/commons-compress-1.12-SNAPSHOT-bin.tar.gz
[JENKINS] Archiving <https://builds.apache.org/job/Commons-Compress-Windows/ws/target\commons-compress-1.12-SNAPSHOT-bin.zip>
to org.apache.commons/commons-compress/1.12-SNAPSHOT/commons-compress-1.12-SNAPSHOT-bin.zip
[JENKINS] Archiving <https://builds.apache.org/job/Commons-Compress-Windows/ws/target\commons-compress-1.12-SNAPSHOT-src.tar.gz>
to org.apache.commons/commons-compress/1.12-SNAPSHOT/commons-compress-1.12-SNAPSHOT-src.tar.gz
[JENKINS] Archiving <https://builds.apache.org/job/Commons-Compress-Windows/ws/target\commons-compress-1.12-SNAPSHOT-src.zip>
to org.apache.commons/commons-compress/1.12-SNAPSHOT/commons-compress-1.12-SNAPSHOT-src.zip
[JENKINS] Archiving <https://builds.apache.org/job/Commons-Compress-Windows/ws/target\commons-compress-1.12-SNAPSHOT-sources.jar>
to org.apache.commons/commons-compress/1.12-SNAPSHOT/commons-compress-1.12-SNAPSHOT-sources.jar
[JENKINS] Archiving <https://builds.apache.org/job/Commons-Compress-Windows/ws/target\commons-compress-1.12-SNAPSHOT-test-sources.jar>
to org.apache.commons/commons-compress/1.12-SNAPSHOT/commons-compress-1.12-SNAPSHOT-test-sources.jar
[JENKINS] Archiving <https://builds.apache.org/job/Commons-Compress-Windows/ws/target\commons-compress-1.12-SNAPSHOT-tests.jar>
to org.apache.commons/commons-compress/1.12-SNAPSHOT/commons-compress-1.12-SNAPSHOT-tests.jar
No prior successful build to compare, so performing full copy of artifacts
Sending e-mails to: dev@commons.apache.org
channel stopped

---------------------------------------------------------------------
To unsubscribe, e-mail: dev-unsubscribe@commons.apache.org
For additional commands, e-mail: dev-help@commons.apache.org


Mime
View raw message