commons-dev mailing list archives

Site index · List index
Message view « Date » · « Thread »
Top « Date » · « Thread »
From Apache Jenkins Server <jenk...@builds.apache.org>
Subject Build failed in Jenkins: Commons-Compress #49
Date Fri, 05 Feb 2016 21:10:59 GMT
See <https://builds.apache.org/job/Commons-Compress/49/>

------------------------------------------
Started by an SCM change
[EnvInject] - Loading node environment variables.
Building remotely on mac-mini-1 (osx mac) in workspace <https://builds.apache.org/job/Commons-Compress/ws/>
java.io.IOException: Failed to install http://archive.apache.org/dist/maven/binaries/apache-maven-3.0.4-bin.zip
to /home/jenkins/tools/maven/apache-maven-3.0.4
	at hudson.FilePath.installIfNecessaryFrom(FilePath.java:831)
	at hudson.tools.DownloadFromUrlInstaller.performInstallation(DownloadFromUrlInstaller.java:70)
	at hudson.tools.InstallerTranslator.getToolHome(InstallerTranslator.java:68)
	at hudson.tools.ToolLocationNodeProperty.getToolHome(ToolLocationNodeProperty.java:107)
	at hudson.tools.ToolInstallation.translateFor(ToolInstallation.java:205)
	at hudson.tasks.Maven$MavenInstallation.forNode(Maven.java:621)
	at hudson.maven.MavenModuleSetBuild.getEnvironment(MavenModuleSetBuild.java:183)
	at hudson.plugins.git.GitSCM.checkout(GitSCM.java:1046)
	at hudson.scm.SCM.checkout(SCM.java:484)
	at hudson.model.AbstractProject.checkout(AbstractProject.java:1274)
	at hudson.model.AbstractBuild$AbstractBuildExecution.defaultCheckout(AbstractBuild.java:609)
	at jenkins.scm.SCMCheckoutStrategy.checkout(SCMCheckoutStrategy.java:86)
	at hudson.model.AbstractBuild$AbstractBuildExecution.run(AbstractBuild.java:531)
	at hudson.model.Run.execute(Run.java:1738)
	at hudson.maven.MavenModuleSetBuild.run(MavenModuleSetBuild.java:531)
	at hudson.model.ResourceController.execute(ResourceController.java:98)
	at hudson.model.Executor.run(Executor.java:381)
Caused by: java.io.IOException: Failed to mkdirs: /home/jenkins/tools/maven/apache-maven-3.0.4
	at hudson.FilePath.mkdirs(FilePath.java:1162)
	at hudson.FilePath.installIfNecessaryFrom(FilePath.java:797)
	... 16 more
Retrying after 10 seconds
java.io.IOException: Failed to install http://archive.apache.org/dist/maven/binaries/apache-maven-3.0.4-bin.zip
to /home/jenkins/tools/maven/apache-maven-3.0.4
	at hudson.FilePath.installIfNecessaryFrom(FilePath.java:831)
	at hudson.tools.DownloadFromUrlInstaller.performInstallation(DownloadFromUrlInstaller.java:70)
	at hudson.tools.InstallerTranslator.getToolHome(InstallerTranslator.java:68)
	at hudson.tools.ToolLocationNodeProperty.getToolHome(ToolLocationNodeProperty.java:107)
	at hudson.tools.ToolInstallation.translateFor(ToolInstallation.java:205)
	at hudson.tasks.Maven$MavenInstallation.forNode(Maven.java:621)
	at hudson.maven.MavenModuleSetBuild.getEnvironment(MavenModuleSetBuild.java:183)
	at hudson.plugins.git.GitSCM.checkout(GitSCM.java:1046)
	at hudson.scm.SCM.checkout(SCM.java:484)
	at hudson.model.AbstractProject.checkout(AbstractProject.java:1274)
	at hudson.model.AbstractBuild$AbstractBuildExecution.defaultCheckout(AbstractBuild.java:609)
	at jenkins.scm.SCMCheckoutStrategy.checkout(SCMCheckoutStrategy.java:86)
	at hudson.model.AbstractBuild$AbstractBuildExecution.run(AbstractBuild.java:531)
	at hudson.model.Run.execute(Run.java:1738)
	at hudson.maven.MavenModuleSetBuild.run(MavenModuleSetBuild.java:531)
	at hudson.model.ResourceController.execute(ResourceController.java:98)
	at hudson.model.Executor.run(Executor.java:381)
Caused by: java.io.IOException: Failed to mkdirs: /home/jenkins/tools/maven/apache-maven-3.0.4
	at hudson.FilePath.mkdirs(FilePath.java:1162)
	at hudson.FilePath.installIfNecessaryFrom(FilePath.java:797)
	... 16 more
Retrying after 10 seconds
java.io.IOException: Failed to install http://archive.apache.org/dist/maven/binaries/apache-maven-3.0.4-bin.zip
to /home/jenkins/tools/maven/apache-maven-3.0.4
	at hudson.FilePath.installIfNecessaryFrom(FilePath.java:831)
	at hudson.tools.DownloadFromUrlInstaller.performInstallation(DownloadFromUrlInstaller.java:70)
	at hudson.tools.InstallerTranslator.getToolHome(InstallerTranslator.java:68)
	at hudson.tools.ToolLocationNodeProperty.getToolHome(ToolLocationNodeProperty.java:107)
	at hudson.tools.ToolInstallation.translateFor(ToolInstallation.java:205)
	at hudson.tasks.Maven$MavenInstallation.forNode(Maven.java:621)
	at hudson.maven.MavenModuleSetBuild.getEnvironment(MavenModuleSetBuild.java:183)
	at hudson.plugins.git.GitSCM.checkout(GitSCM.java:1046)
	at hudson.scm.SCM.checkout(SCM.java:484)
	at hudson.model.AbstractProject.checkout(AbstractProject.java:1274)
	at hudson.model.AbstractBuild$AbstractBuildExecution.defaultCheckout(AbstractBuild.java:609)
	at jenkins.scm.SCMCheckoutStrategy.checkout(SCMCheckoutStrategy.java:86)
	at hudson.model.AbstractBuild$AbstractBuildExecution.run(AbstractBuild.java:531)
	at hudson.model.Run.execute(Run.java:1738)
	at hudson.maven.MavenModuleSetBuild.run(MavenModuleSetBuild.java:531)
	at hudson.model.ResourceController.execute(ResourceController.java:98)
	at hudson.model.Executor.run(Executor.java:381)
Caused by: java.io.IOException: Failed to mkdirs: /home/jenkins/tools/maven/apache-maven-3.0.4
	at hudson.FilePath.mkdirs(FilePath.java:1162)
	at hudson.FilePath.installIfNecessaryFrom(FilePath.java:797)
	... 16 more

---------------------------------------------------------------------
To unsubscribe, e-mail: dev-unsubscribe@commons.apache.org
For additional commands, e-mail: dev-help@commons.apache.org


Mime
View raw message