commons-dev mailing list archives

Site index · List index
Message view « Date » · « Thread »
Top « Date » · « Thread »
From Apache Jenkins Server <jenk...@builds.apache.org>
Subject Build failed in Jenkins: commons-jcs #132
Date Thu, 10 Dec 2015 16:42:55 GMT
See <https://builds.apache.org/job/commons-jcs/132/changes>

Changes:

[tv] Fix property name

[tv] Replace copy() with standard clone()

------------------------------------------
[...truncated 232 lines...]
[INFO] Building jar: <https://builds.apache.org/job/commons-jcs/ws/commons-jcs-core/target/commons-jcs-core-2.0-SNAPSHOT-tests.jar>
[INFO] 
[INFO] --- maven-jar-plugin:2.5:test-jar (default) @ commons-jcs-core ---
[WARNING] Artifact org.apache.commons:commons-jcs-core:test-jar:tests:2.0-SNAPSHOT already
attached to project, ignoring duplicate
[INFO] 
[INFO] --- maven-site-plugin:3.4:attach-descriptor (attach-descriptor) @ commons-jcs-core
---
[INFO] 
[INFO] --- maven-enforcer-plugin:1.3.1:enforce (enforce-maven-3) @ commons-jcs-core ---
[INFO] 
[INFO] --- maven-antrun-plugin:1.7:run (javadoc.resources) @ commons-jcs-core ---
[INFO] Executing tasks

main:
[INFO] Executed tasks
[INFO] 
[INFO] --- maven-antrun-plugin:1.7:run (copy-notices) @ commons-jcs-core ---
[INFO] Executing tasks

main:
[INFO] Executed tasks
[WARNING] Failed to getClass for org.apache.maven.plugin.javadoc.JavadocReport
[INFO] 
[INFO] --- maven-javadoc-plugin:2.10.1:javadoc (create-javadoc-jar) @ commons-jcs-core ---
[INFO] 
14 warnings
[WARNING] Javadoc Warnings
[WARNING] warning: [options] bootstrap class path not set in conjunction with -source 1.6
[WARNING] <https://builds.apache.org/job/commons-jcs/ws/commons-jcs-core/src/main/java/org/apache/commons/jcs/access/CacheAccess.java>:219:
warning - Tag @see: can't find put(java.io.Serializable, java.io.Serializable,
[WARNING] org.apache.commons.jcs.engine.behavior.IElementAttributes) in org.apache.commons.jcs.access.behavior.ICacheAccess
[WARNING] <https://builds.apache.org/job/commons-jcs/ws/commons-jcs-core/src/main/java/org/apache/commons/jcs/auxiliary/disk/block/BlockDiskCache.java>:315:
warning - Tag @see: can't find doGet(java.io.Serializable) in org.apache.commons.jcs.auxiliary.disk.AbstractDiskCache
[WARNING] <https://builds.apache.org/job/commons-jcs/ws/commons-jcs-core/src/main/java/org/apache/commons/jcs/auxiliary/disk/block/BlockDiskCache.java>:431:
warning - Tag @see: can't find doRemove(java.io.Serializable) in org.apache.commons.jcs.auxiliary.disk.AbstractDiskCache
[WARNING] <https://builds.apache.org/job/commons-jcs/ws/commons-jcs-core/src/main/java/org/apache/commons/jcs/auxiliary/disk/jdbc/JDBCDiskCache.java>:457:
warning - Tag @see: can't find doGet(java.io.Serializable) in org.apache.commons.jcs.auxiliary.disk.AbstractDiskCache
[WARNING] <https://builds.apache.org/job/commons-jcs/ws/commons-jcs-core/src/main/java/org/apache/commons/jcs/auxiliary/disk/jdbc/dsfactory/JndiDataSourceFactory.java>:85:
warning - Tag @see: reference not found: org.apache.torque.dsfactory.DataSourceFactory#getDataSource
[WARNING] <https://builds.apache.org/job/commons-jcs/ws/commons-jcs-core/src/main/java/org/apache/commons/jcs/auxiliary/disk/jdbc/dsfactory/JndiDataSourceFactory.java>:112:
warning - Tag @see: reference not found: org.apache.torque.dsfactory.DataSourceFactory#initialize
[WARNING] <https://builds.apache.org/job/commons-jcs/ws/commons-jcs-core/src/main/java/org/apache/commons/jcs/auxiliary/disk/jdbc/dsfactory/SharedPoolDataSourceFactory.java>:66:
warning - Tag @see: reference not found: org.apache.torque.dsfactory.DataSourceFactory#getDataSource
[WARNING] <https://builds.apache.org/job/commons-jcs/ws/commons-jcs-core/src/main/java/org/apache/commons/jcs/auxiliary/disk/jdbc/dsfactory/SharedPoolDataSourceFactory.java>:75:
warning - Tag @see: reference not found: org.apache.torque.dsfactory.DataSourceFactory#initialize
[WARNING] <https://builds.apache.org/job/commons-jcs/ws/commons-jcs-core/src/main/java/org/apache/commons/jcs/auxiliary/lateral/socket/tcp/LateralTCPService.java>:158:
warning - Tag @see: can't find remove(java.lang.String,
[WARNING] java.io.Serializable) in org.apache.commons.jcs.engine.behavior.ICacheService
[WARNING] <https://builds.apache.org/job/commons-jcs/ws/commons-jcs-core/src/main/java/org/apache/commons/jcs/auxiliary/lateral/socket/tcp/LateralTCPService.java>:171:
warning - Tag @see: can't find remove(java.lang.String,
[WARNING] java.io.Serializable, long) in org.apache.commons.jcs.engine.behavior.ICacheServiceNonLocal
[WARNING] <https://builds.apache.org/job/commons-jcs/ws/commons-jcs-core/src/main/java/org/apache/commons/jcs/auxiliary/remote/RemoteLocation.java>:128:
warning - @returns is an unknown tag.
[WARNING] <https://builds.apache.org/job/commons-jcs/ws/commons-jcs-core/src/main/java/org/apache/commons/jcs/auxiliary/remote/RemoteUtils.java>:215:
warning - @return tag has no arguments.
[WARNING] <https://builds.apache.org/job/commons-jcs/ws/commons-jcs-core/src/main/java/org/apache/commons/jcs/auxiliary/remote/RemoteUtils.java>:228:
warning - @return tag has no arguments.
[JENKINS] Archiving  javadoc
[INFO] 
[INFO] --- maven-javadoc-plugin:2.10.1:jar (create-javadoc-jar) @ commons-jcs-core ---
[INFO] 
14 warnings
[WARNING] Javadoc Warnings
[WARNING] warning: [options] bootstrap class path not set in conjunction with -source 1.6
[WARNING] <https://builds.apache.org/job/commons-jcs/ws/commons-jcs-core/src/main/java/org/apache/commons/jcs/access/CacheAccess.java>:219:
warning - Tag @see: can't find put(java.io.Serializable, java.io.Serializable,
[WARNING] org.apache.commons.jcs.engine.behavior.IElementAttributes) in org.apache.commons.jcs.access.behavior.ICacheAccess
[WARNING] <https://builds.apache.org/job/commons-jcs/ws/commons-jcs-core/src/main/java/org/apache/commons/jcs/auxiliary/disk/block/BlockDiskCache.java>:315:
warning - Tag @see: can't find doGet(java.io.Serializable) in org.apache.commons.jcs.auxiliary.disk.AbstractDiskCache
[WARNING] <https://builds.apache.org/job/commons-jcs/ws/commons-jcs-core/src/main/java/org/apache/commons/jcs/auxiliary/disk/block/BlockDiskCache.java>:431:
warning - Tag @see: can't find doRemove(java.io.Serializable) in org.apache.commons.jcs.auxiliary.disk.AbstractDiskCache
[WARNING] <https://builds.apache.org/job/commons-jcs/ws/commons-jcs-core/src/main/java/org/apache/commons/jcs/auxiliary/disk/jdbc/JDBCDiskCache.java>:457:
warning - Tag @see: can't find doGet(java.io.Serializable) in org.apache.commons.jcs.auxiliary.disk.AbstractDiskCache
[WARNING] <https://builds.apache.org/job/commons-jcs/ws/commons-jcs-core/src/main/java/org/apache/commons/jcs/auxiliary/disk/jdbc/dsfactory/JndiDataSourceFactory.java>:85:
warning - Tag @see: reference not found: org.apache.torque.dsfactory.DataSourceFactory#getDataSource
[WARNING] <https://builds.apache.org/job/commons-jcs/ws/commons-jcs-core/src/main/java/org/apache/commons/jcs/auxiliary/disk/jdbc/dsfactory/JndiDataSourceFactory.java>:112:
warning - Tag @see: reference not found: org.apache.torque.dsfactory.DataSourceFactory#initialize
[WARNING] <https://builds.apache.org/job/commons-jcs/ws/commons-jcs-core/src/main/java/org/apache/commons/jcs/auxiliary/disk/jdbc/dsfactory/SharedPoolDataSourceFactory.java>:66:
warning - Tag @see: reference not found: org.apache.torque.dsfactory.DataSourceFactory#getDataSource
[WARNING] <https://builds.apache.org/job/commons-jcs/ws/commons-jcs-core/src/main/java/org/apache/commons/jcs/auxiliary/disk/jdbc/dsfactory/SharedPoolDataSourceFactory.java>:75:
warning - Tag @see: reference not found: org.apache.torque.dsfactory.DataSourceFactory#initialize
[WARNING] <https://builds.apache.org/job/commons-jcs/ws/commons-jcs-core/src/main/java/org/apache/commons/jcs/auxiliary/lateral/socket/tcp/LateralTCPService.java>:158:
warning - Tag @see: can't find remove(java.lang.String,
[WARNING] java.io.Serializable) in org.apache.commons.jcs.engine.behavior.ICacheService
[WARNING] <https://builds.apache.org/job/commons-jcs/ws/commons-jcs-core/src/main/java/org/apache/commons/jcs/auxiliary/lateral/socket/tcp/LateralTCPService.java>:171:
warning - Tag @see: can't find remove(java.lang.String,
[WARNING] java.io.Serializable, long) in org.apache.commons.jcs.engine.behavior.ICacheServiceNonLocal
[WARNING] <https://builds.apache.org/job/commons-jcs/ws/commons-jcs-core/src/main/java/org/apache/commons/jcs/auxiliary/remote/RemoteLocation.java>:128:
warning - @returns is an unknown tag.
[WARNING] <https://builds.apache.org/job/commons-jcs/ws/commons-jcs-core/src/main/java/org/apache/commons/jcs/auxiliary/remote/RemoteUtils.java>:215:
warning - @return tag has no arguments.
[WARNING] <https://builds.apache.org/job/commons-jcs/ws/commons-jcs-core/src/main/java/org/apache/commons/jcs/auxiliary/remote/RemoteUtils.java>:228:
warning - @return tag has no arguments.
[INFO] Building jar: <https://builds.apache.org/job/commons-jcs/ws/commons-jcs-core/target/commons-jcs-core-2.0-SNAPSHOT-javadoc.jar>
[INFO] 
[INFO] --- maven-source-plugin:2.4:jar-no-fork (attach-sources) @ commons-jcs-core ---
[INFO] Building jar: <https://builds.apache.org/job/commons-jcs/ws/commons-jcs-core/target/commons-jcs-core-2.0-SNAPSHOT-sources.jar>
[INFO] 
[INFO] --- maven-source-plugin:2.4:test-jar-no-fork (attach-test-sources) @ commons-jcs-core
---
[INFO] Building jar: <https://builds.apache.org/job/commons-jcs/ws/commons-jcs-core/target/commons-jcs-core-2.0-SNAPSHOT-test-sources.jar>
[INFO] 
[INFO] --- maven-install-plugin:2.5.2:install (default-install) @ commons-jcs-core ---
[INFO] Installing <https://builds.apache.org/job/commons-jcs/ws/commons-jcs-core/target/commons-jcs-core-2.0-SNAPSHOT.jar>
to /home/jenkins/jenkins-slave/maven-repositories/0/org/apache/commons/commons-jcs-core/2.0-SNAPSHOT/commons-jcs-core-2.0-SNAPSHOT.jar
[INFO] Installing <https://builds.apache.org/job/commons-jcs/ws/commons-jcs-core/pom.xml>
to /home/jenkins/jenkins-slave/maven-repositories/0/org/apache/commons/commons-jcs-core/2.0-SNAPSHOT/commons-jcs-core-2.0-SNAPSHOT.pom
[INFO] Installing <https://builds.apache.org/job/commons-jcs/ws/commons-jcs-core/target/commons-jcs-core-2.0-SNAPSHOT-tests.jar>
to /home/jenkins/jenkins-slave/maven-repositories/0/org/apache/commons/commons-jcs-core/2.0-SNAPSHOT/commons-jcs-core-2.0-SNAPSHOT-tests.jar
[INFO] Installing <https://builds.apache.org/job/commons-jcs/ws/commons-jcs-core/target/commons-jcs-core-2.0-SNAPSHOT-javadoc.jar>
to /home/jenkins/jenkins-slave/maven-repositories/0/org/apache/commons/commons-jcs-core/2.0-SNAPSHOT/commons-jcs-core-2.0-SNAPSHOT-javadoc.jar
[INFO] Installing <https://builds.apache.org/job/commons-jcs/ws/commons-jcs-core/target/commons-jcs-core-2.0-SNAPSHOT-sources.jar>
to /home/jenkins/jenkins-slave/maven-repositories/0/org/apache/commons/commons-jcs-core/2.0-SNAPSHOT/commons-jcs-core-2.0-SNAPSHOT-sources.jar
[INFO] Installing <https://builds.apache.org/job/commons-jcs/ws/commons-jcs-core/target/commons-jcs-core-2.0-SNAPSHOT-test-sources.jar>
to /home/jenkins/jenkins-slave/maven-repositories/0/org/apache/commons/commons-jcs-core/2.0-SNAPSHOT/commons-jcs-core-2.0-SNAPSHOT-test-sources.jar
[INFO]                                                                         
[INFO] ------------------------------------------------------------------------
[INFO] Building Apache Commons JCS :: JCache 2.0-SNAPSHOT
[INFO] ------------------------------------------------------------------------
[INFO] 
[INFO] --- maven-clean-plugin:2.6.1:clean (default-clean) @ commons-jcs-jcache ---
[INFO] Deleting <https://builds.apache.org/job/commons-jcs/ws/commons-jcs-jcache/target>
[INFO] 
[INFO] --- maven-enforcer-plugin:1.3.1:enforce (enforce-maven-3) @ commons-jcs-jcache ---
[INFO] 
[INFO] --- maven-antrun-plugin:1.7:run (javadoc.resources) @ commons-jcs-jcache ---
[INFO] Executing tasks

main:
     [copy] Copying 2 files to <https://builds.apache.org/job/commons-jcs/ws/commons-jcs-jcache/target/apidocs/META-INF>
[INFO] Executed tasks
[INFO] 
[INFO] --- maven-antrun-plugin:1.7:run (copy-notices) @ commons-jcs-jcache ---
[INFO] Executing tasks

main:
    [mkdir] Created dir: <https://builds.apache.org/job/commons-jcs/ws/commons-jcs-jcache/target/generated-resources/notices/META-INF>
     [copy] Copying 2 files to <https://builds.apache.org/job/commons-jcs/ws/commons-jcs-jcache/target/generated-resources/notices/META-INF>
     [copy] Copying <https://builds.apache.org/job/commons-jcs/ws/LICENSE.txt> to <https://builds.apache.org/job/commons-jcs/ws/commons-jcs-jcache/target/generated-resources/notices/META-INF/LICENSE.txt>
     [copy] Copying <https://builds.apache.org/job/commons-jcs/ws/NOTICE.txt> to <https://builds.apache.org/job/commons-jcs/ws/commons-jcs-jcache/target/generated-resources/notices/META-INF/NOTICE.txt>
    [mkdir] Created dir: <https://builds.apache.org/job/commons-jcs/ws/commons-jcs-jcache/target/generated-test-resources/notices/META-INF>
     [copy] Copying 2 files to <https://builds.apache.org/job/commons-jcs/ws/commons-jcs-jcache/target/generated-test-resources/notices/META-INF>
     [copy] Copying <https://builds.apache.org/job/commons-jcs/ws/LICENSE.txt> to <https://builds.apache.org/job/commons-jcs/ws/commons-jcs-jcache/target/generated-test-resources/notices/META-INF/LICENSE.txt>
     [copy] Copying <https://builds.apache.org/job/commons-jcs/ws/NOTICE.txt> to <https://builds.apache.org/job/commons-jcs/ws/commons-jcs-jcache/target/generated-test-resources/notices/META-INF/NOTICE.txt>
[INFO] Executed tasks
[INFO] 
[INFO] --- maven-remote-resources-plugin:1.5:process (default) @ commons-jcs-jcache ---
[INFO] 
[INFO] --- buildnumber-maven-plugin:1.3:create (default) @ commons-jcs-jcache ---
[INFO] Executing: /bin/sh -c cd <https://builds.apache.org/job/commons-jcs/ws/commons-jcs-jcache>
&& svn --non-interactive info
[INFO] Working directory: <https://builds.apache.org/job/commons-jcs/ws/commons-jcs-jcache>
[INFO] Storing buildNumber: ?????? at timestamp: 1449765766949
[INFO] Executing: /bin/sh -c cd <https://builds.apache.org/job/commons-jcs/ws/commons-jcs-jcache>
&& svn --non-interactive info
[INFO] Working directory: <https://builds.apache.org/job/commons-jcs/ws/commons-jcs-jcache>
[INFO] Storing buildScmBranch: UNKNOWN_BRANCH
[INFO] 
[INFO] --- build-helper-maven-plugin:1.9.1:add-resource (add-source-notices) @ commons-jcs-jcache
---
[INFO] 
[INFO] --- maven-resources-plugin:2.7:resources (default-resources) @ commons-jcs-jcache ---
[INFO] Using 'UTF-8' encoding to copy filtered resources.
[INFO] Copying 2 resources to <https://builds.apache.org/job/commons-jcs/ws/commons-jcs-jcache/target/classes>
[INFO] Copying 2 resources
[INFO] 
[INFO] --- maven-compiler-plugin:3.2:compile (default-compile) @ commons-jcs-jcache ---
[INFO] Changes detected - recompiling the module!
[INFO] Compiling 43 source files to <https://builds.apache.org/job/commons-jcs/ws/commons-jcs-jcache/target/classes>
[INFO] <https://builds.apache.org/job/commons-jcs/ws/commons-jcs-jcache/src/main/java/org/apache/commons/jcs/jcache/cdi/MakeJCacheCDIInterceptorFriendly.java>:
<https://builds.apache.org/job/commons-jcs/ws/commons-jcs-jcache/src/main/java/org/apache/commons/jcs/jcache/cdi/MakeJCacheCDIInterceptorFriendly.java>
uses or overrides a deprecated API.
[INFO] <https://builds.apache.org/job/commons-jcs/ws/commons-jcs-jcache/src/main/java/org/apache/commons/jcs/jcache/cdi/MakeJCacheCDIInterceptorFriendly.java>:
Recompile with -Xlint:deprecation for details.
[INFO] <https://builds.apache.org/job/commons-jcs/ws/commons-jcs-jcache/src/main/java/org/apache/commons/jcs/jcache/cdi/CDIJCacheHelper.java>:
Some input files use unchecked or unsafe operations.
[INFO] <https://builds.apache.org/job/commons-jcs/ws/commons-jcs-jcache/src/main/java/org/apache/commons/jcs/jcache/cdi/CDIJCacheHelper.java>:
Recompile with -Xlint:unchecked for details.
[INFO] -------------------------------------------------------------
[ERROR] COMPILATION ERROR : 
[INFO] -------------------------------------------------------------
[ERROR] <https://builds.apache.org/job/commons-jcs/ws/commons-jcs-jcache/src/main/java/org/apache/commons/jcs/jcache/JCSCache.java>:[240,72]
cannot find symbol
  symbol:   method copy()
  location: interface org.apache.commons.jcs.engine.behavior.IElementAttributes
[INFO] 1 error
[INFO] -------------------------------------------------------------
[INFO]                                                                         
[INFO] ------------------------------------------------------------------------
[INFO] Skipping Apache Commons JCS :: JCache TCK
[INFO] This project has been banned from the build due to previous failures.
[INFO] ------------------------------------------------------------------------
[INFO]                                                                         
[INFO] ------------------------------------------------------------------------
[INFO] Skipping Apache Commons JCS :: JCache Extras
[INFO] This project has been banned from the build due to previous failures.
[INFO] ------------------------------------------------------------------------
[INFO]                                                                         
[INFO] ------------------------------------------------------------------------
[INFO] Skipping Apache Commons JCS :: JCache OpenJPA
[INFO] This project has been banned from the build due to previous failures.
[INFO] ------------------------------------------------------------------------
[INFO] ------------------------------------------------------------------------
[INFO] Reactor Summary:
[INFO] 
[INFO] Apache Commons JCS ................................ SUCCESS [7.760s]
[INFO] Apache Commons JCS :: Core ........................ SUCCESS [54.429s]
[INFO] Apache Commons JCS :: JCache ...................... FAILURE [2.012s]
[INFO] Apache Commons JCS :: JCache TCK .................. SKIPPED
[INFO] Apache Commons JCS :: JCache Extras ............... SKIPPED
[INFO] Apache Commons JCS :: JCache OpenJPA .............. SKIPPED
[INFO] ------------------------------------------------------------------------
[INFO] BUILD FAILURE
[INFO] ------------------------------------------------------------------------
[INFO] Total time: 1:08.084s
[INFO] Finished at: Thu Dec 10 16:42:48 UTC 2015
[INFO] Final Memory: 38M/414M
[INFO] ------------------------------------------------------------------------
Waiting for Jenkins to finish collecting data
[ERROR] Failed to execute goal org.apache.maven.plugins:maven-compiler-plugin:3.2:compile
(default-compile) on project commons-jcs-jcache: Compilation failure
[ERROR] <https://builds.apache.org/job/commons-jcs/ws/commons-jcs-jcache/src/main/java/org/apache/commons/jcs/jcache/JCSCache.java>:[240,72]
cannot find symbol
[ERROR] symbol:   method copy()
[ERROR] location: interface org.apache.commons.jcs.engine.behavior.IElementAttributes
[ERROR] -> [Help 1]
org.apache.maven.lifecycle.LifecycleExecutionException: Failed to execute goal org.apache.maven.plugins:maven-compiler-plugin:3.2:compile
(default-compile) on project commons-jcs-jcache: Compilation failure
<https://builds.apache.org/job/commons-jcs/ws/commons-jcs-jcache/src/main/java/org/apache/commons/jcs/jcache/JCSCache.java>:[240,72]
cannot find symbol
  symbol:   method copy()
  location: interface org.apache.commons.jcs.engine.behavior.IElementAttributes

	at org.apache.maven.lifecycle.internal.MojoExecutor.execute(MojoExecutor.java:213)
	at org.apache.maven.lifecycle.internal.MojoExecutor.execute(MojoExecutor.java:153)
	at org.apache.maven.lifecycle.internal.MojoExecutor.execute(MojoExecutor.java:145)
	at org.apache.maven.lifecycle.internal.LifecycleModuleBuilder.buildProject(LifecycleModuleBuilder.java:84)
	at org.apache.maven.lifecycle.internal.LifecycleModuleBuilder.buildProject(LifecycleModuleBuilder.java:59)
	at org.apache.maven.lifecycle.internal.LifecycleStarter.singleThreadedBuild(LifecycleStarter.java:183)
	at org.apache.maven.lifecycle.internal.LifecycleStarter.execute(LifecycleStarter.java:161)
	at org.apache.maven.DefaultMaven.doExecute(DefaultMaven.java:320)
	at org.apache.maven.DefaultMaven.execute(DefaultMaven.java:156)
	at org.jvnet.hudson.maven3.launcher.Maven3Launcher.main(Maven3Launcher.java:117)
	at sun.reflect.NativeMethodAccessorImpl.invoke0(Native Method)
	at sun.reflect.NativeMethodAccessorImpl.invoke(NativeMethodAccessorImpl.java:57)
	at sun.reflect.DelegatingMethodAccessorImpl.invoke(DelegatingMethodAccessorImpl.java:43)
	at java.lang.reflect.Method.invoke(Method.java:606)
	at org.codehaus.plexus.classworlds.launcher.Launcher.launchStandard(Launcher.java:329)
	at org.codehaus.plexus.classworlds.launcher.Launcher.launch(Launcher.java:239)
	at org.jvnet.hudson.maven3.agent.Maven3Main.launch(Maven3Main.java:181)
	at sun.reflect.NativeMethodAccessorImpl.invoke0(Native Method)
	at sun.reflect.NativeMethodAccessorImpl.invoke(NativeMethodAccessorImpl.java:57)
	at sun.reflect.DelegatingMethodAccessorImpl.invoke(DelegatingMethodAccessorImpl.java:43)
	at java.lang.reflect.Method.invoke(Method.java:606)
	at hudson.maven.Maven3Builder.call(Maven3Builder.java:136)
	at hudson.maven.Maven3Builder.call(Maven3Builder.java:71)
	at hudson.remoting.UserRequest.perform(UserRequest.java:121)
	at hudson.remoting.UserRequest.perform(UserRequest.java:49)
	at hudson.remoting.Request$2.run(Request.java:326)
	at hudson.remoting.InterceptingExecutorService$1.call(InterceptingExecutorService.java:68)
	at java.util.concurrent.FutureTask.run(FutureTask.java:262)
	at java.util.concurrent.ThreadPoolExecutor.runWorker(ThreadPoolExecutor.java:1145)
	at java.util.concurrent.ThreadPoolExecutor$Worker.run(ThreadPoolExecutor.java:615)
	at java.lang.Thread.run(Thread.java:745)
Caused by: org.apache.maven.plugin.compiler.CompilationFailureException: Compilation failure
<https://builds.apache.org/job/commons-jcs/ws/commons-jcs-jcache/src/main/java/org/apache/commons/jcs/jcache/JCSCache.java>:[240,72]
cannot find symbol
  symbol:   method copy()
  location: interface org.apache.commons.jcs.engine.behavior.IElementAttributes

	at org.apache.maven.plugin.compiler.AbstractCompilerMojo.execute(AbstractCompilerMojo.java:909)
	at org.apache.maven.plugin.compiler.CompilerMojo.execute(CompilerMojo.java:129)
	at org.apache.maven.plugin.DefaultBuildPluginManager.executeMojo(DefaultBuildPluginManager.java:101)
	at org.apache.maven.lifecycle.internal.MojoExecutor.execute(MojoExecutor.java:209)
	... 30 more
[ERROR] 
[ERROR] Re-run Maven using the -X switch to enable full debug logging.
[ERROR] 
[ERROR] For more information about the errors and possible solutions, please read the following
articles:
[ERROR] [Help 1] http://cwiki.apache.org/confluence/display/MAVEN/MojoFailureException
[ERROR] 
[ERROR] After correcting the problems, you can resume the build with the command
[ERROR]   mvn <goals> -rf :commons-jcs-jcache
[JENKINS] Archiving <https://builds.apache.org/job/commons-jcs/ws/commons-jcs-core/pom.xml>
to org.apache.commons/commons-jcs-core/2.0-SNAPSHOT/commons-jcs-core-2.0-SNAPSHOT.pom
[JENKINS] Archiving <https://builds.apache.org/job/commons-jcs/ws/commons-jcs-core/target/commons-jcs-core-2.0-SNAPSHOT.jar>
to org.apache.commons/commons-jcs-core/2.0-SNAPSHOT/commons-jcs-core-2.0-SNAPSHOT.jar
[JENKINS] Archiving <https://builds.apache.org/job/commons-jcs/ws/commons-jcs-core/target/commons-jcs-core-2.0-SNAPSHOT-tests.jar>
to org.apache.commons/commons-jcs-core/2.0-SNAPSHOT/commons-jcs-core-2.0-SNAPSHOT-tests.jar
[JENKINS] Archiving <https://builds.apache.org/job/commons-jcs/ws/commons-jcs-core/target/commons-jcs-core-2.0-SNAPSHOT-javadoc.jar>
to org.apache.commons/commons-jcs-core/2.0-SNAPSHOT/commons-jcs-core-2.0-SNAPSHOT-javadoc.jar
[JENKINS] Archiving <https://builds.apache.org/job/commons-jcs/ws/commons-jcs-core/target/commons-jcs-core-2.0-SNAPSHOT-sources.jar>
to org.apache.commons/commons-jcs-core/2.0-SNAPSHOT/commons-jcs-core-2.0-SNAPSHOT-sources.jar
[JENKINS] Archiving <https://builds.apache.org/job/commons-jcs/ws/commons-jcs-core/target/commons-jcs-core-2.0-SNAPSHOT-test-sources.jar>
to org.apache.commons/commons-jcs-core/2.0-SNAPSHOT/commons-jcs-core-2.0-SNAPSHOT-test-sources.jar
[JENKINS] Archiving <https://builds.apache.org/job/commons-jcs/ws/commons-jcs-jcache/pom.xml>
to org.apache.commons/commons-jcs-jcache/2.0-SNAPSHOT/commons-jcs-jcache-2.0-SNAPSHOT.pom
[JENKINS] Archiving <https://builds.apache.org/job/commons-jcs/ws/pom.xml> to org.apache.commons/commons-jcs/2.0-SNAPSHOT/commons-jcs-2.0-SNAPSHOT.pom
[JENKINS] Archiving <https://builds.apache.org/job/commons-jcs/ws/target/commons-jcs-2.0-SNAPSHOT-site.xml>
to org.apache.commons/commons-jcs/2.0-SNAPSHOT/commons-jcs-2.0-SNAPSHOT-site.xml
[JENKINS] Archiving <https://builds.apache.org/job/commons-jcs/ws/commons-jcs-jcache-extras/pom.xml>
to org.apache.commons/commons-jcs-jcache-extras/2.0-SNAPSHOT/commons-jcs-jcache-extras-2.0-SNAPSHOT.pom
[JENKINS] Archiving <https://builds.apache.org/job/commons-jcs/ws/commons-jcs-tck-tests/pom.xml>
to org.apache.commons/commons-jcs-jcache-tck/2.0-SNAPSHOT/commons-jcs-jcache-tck-2.0-SNAPSHOT.pom
[JENKINS] Archiving <https://builds.apache.org/job/commons-jcs/ws/commons-jcs-jcache-openjpa/pom.xml>
to org.apache.commons/commons-jcs-jcache-openjpa/2.0-SNAPSHOT/commons-jcs-jcache-openjpa-2.0-SNAPSHOT.pom
Sending e-mails to: dev@commons.apache.org
channel stopped

---------------------------------------------------------------------
To unsubscribe, e-mail: dev-unsubscribe@commons.apache.org
For additional commands, e-mail: dev-help@commons.apache.org


Mime
View raw message