commons-dev mailing list archives

Site index · List index
Message view « Date » · « Thread »
Top « Date » · « Thread »
From Apache Jenkins Server <jenk...@builds.apache.org>
Subject Build failed in Jenkins: Commons-Compress #28
Date Wed, 09 Dec 2015 23:13:20 GMT
See <https://builds.apache.org/job/Commons-Compress/28/>

------------------------------------------
Started by an SCM change
[EnvInject] - Loading node environment variables.
Installing JDK jdk-7u80-oth-JPR
Downloading JDK from http://download.oracle.com/otn-pub/java/jdk/7u80-b15/jdk-7u80-macosx-x64.dmg
Downloading 206510745bytes
Installing /Users/jenkins/jenkins-home/tools/hudson.model.JDK/JDK_1.7_latest_/jdk.dmg
$ hdiutil attach -puppetstrings -mountpoint /Users/jenkins/jenkins-home/tools/hudson.model.JDK/jdk2148972722859615260dmg
/Users/jenkins/jenkins-home/tools/hudson.model.JDK/JDK_1.7_latest_/jdk.dmg
PERCENT:0.000000
MESSAGE:Checksumming Protective Master Boot Record (MBR : 0)…
MESSAGE:
MESSAGE:Protective Master Boot Record (MBR :: verified   CRC32 $A63E199D
MESSAGE:Checksumming GPT Header (Primary GPT Header : 1)…
MESSAGE:
MESSAGE: GPT Header (Primary GPT Header : 1): verified   CRC32 $DAF7B809
MESSAGE:Checksumming GPT Partition Data (Primary GPT Table : 2)…
MESSAGE:
MESSAGE:GPT Partition Data (Primary GPT Tabl: verified   CRC32 $035A270F
MESSAGE:Checksumming  (Apple_Free : 3)…
MESSAGE:
MESSAGE:                    (Apple_Free : 3): verified   CRC32 $00000000
MESSAGE:Checksumming disk image (Apple_HFS : 4)…
PERCENT:99.996094
MESSAGE:
MESSAGE:          disk image (Apple_HFS : 4): verified   CRC32 $775B02CA
MESSAGE:Checksumming  (Apple_Free : 5)…
MESSAGE:
MESSAGE:                    (Apple_Free : 5): verified   CRC32 $00000000
MESSAGE:Checksumming GPT Partition Data (Backup GPT Table : 6)…
MESSAGE:
MESSAGE:GPT Partition Data (Backup GPT Table: verified   CRC32 $035A270F
MESSAGE:Checksumming GPT Header (Backup GPT Header : 7)…
MESSAGE:
MESSAGE:  GPT Header (Backup GPT Header : 7): verified   CRC32 $453AE7A7
PERCENT:-1.000000
MESSAGE:verified   CRC32 $51FE5723
/dev/disk3          	GUID_partition_scheme          	
/dev/disk3s1        	Apple_HFS                      	/Users/jenkins/jenkins-home/tools/hudson.model.JDK/jdk2148972722859615260dmg
$ pkgutil --expand "/Users/jenkins/jenkins-home/tools/hudson.model.JDK/jdk2148972722859615260dmg/JDK
7 Update 80.pkg" /Users/jenkins/jenkins-home/tools/hudson.model.JDK/jdk6512690069386118956pkg
$ umount /Users/jenkins/jenkins-home/tools/hudson.model.JDK/jdk2148972722859615260dmg
[hudson.model.JDK] $ tar xzf /Users/jenkins/jenkins-home/tools/hudson.model.JDK/jdk6512690069386118956pkg/jdk17080.pkg/Payload
Building remotely on mac-mini-1 (osx mac) in workspace <https://builds.apache.org/job/Commons-Compress/ws/>
java.io.IOException: Failed to install http://archive.apache.org/dist/maven/binaries/apache-maven-3.0.4-bin.zip
to /home/jenkins/tools/maven/apache-maven-3.0.4
	at hudson.FilePath.installIfNecessaryFrom(FilePath.java:831)
	at hudson.tools.DownloadFromUrlInstaller.performInstallation(DownloadFromUrlInstaller.java:70)
	at hudson.tools.InstallerTranslator.getToolHome(InstallerTranslator.java:68)
	at hudson.tools.ToolLocationNodeProperty.getToolHome(ToolLocationNodeProperty.java:107)
	at hudson.tools.ToolInstallation.translateFor(ToolInstallation.java:205)
	at hudson.tasks.Maven$MavenInstallation.forNode(Maven.java:621)
	at hudson.maven.MavenModuleSetBuild.getEnvironment(MavenModuleSetBuild.java:183)
	at hudson.plugins.git.GitSCM.checkout(GitSCM.java:1036)
	at hudson.scm.SCM.checkout(SCM.java:484)
	at hudson.model.AbstractProject.checkout(AbstractProject.java:1274)
	at hudson.model.AbstractBuild$AbstractBuildExecution.defaultCheckout(AbstractBuild.java:609)
	at jenkins.scm.SCMCheckoutStrategy.checkout(SCMCheckoutStrategy.java:86)
	at hudson.model.AbstractBuild$AbstractBuildExecution.run(AbstractBuild.java:531)
	at hudson.model.Run.execute(Run.java:1738)
	at hudson.maven.MavenModuleSetBuild.run(MavenModuleSetBuild.java:531)
	at hudson.model.ResourceController.execute(ResourceController.java:98)
	at hudson.model.Executor.run(Executor.java:381)
Caused by: java.io.IOException: Failed to mkdirs: /home/jenkins/tools/maven/apache-maven-3.0.4
	at hudson.FilePath.mkdirs(FilePath.java:1162)
	at hudson.FilePath.installIfNecessaryFrom(FilePath.java:797)
	... 16 more
Retrying after 10 seconds
java.io.IOException: Failed to install http://archive.apache.org/dist/maven/binaries/apache-maven-3.0.4-bin.zip
to /home/jenkins/tools/maven/apache-maven-3.0.4
	at hudson.FilePath.installIfNecessaryFrom(FilePath.java:831)
	at hudson.tools.DownloadFromUrlInstaller.performInstallation(DownloadFromUrlInstaller.java:70)
	at hudson.tools.InstallerTranslator.getToolHome(InstallerTranslator.java:68)
	at hudson.tools.ToolLocationNodeProperty.getToolHome(ToolLocationNodeProperty.java:107)
	at hudson.tools.ToolInstallation.translateFor(ToolInstallation.java:205)
	at hudson.tasks.Maven$MavenInstallation.forNode(Maven.java:621)
	at hudson.maven.MavenModuleSetBuild.getEnvironment(MavenModuleSetBuild.java:183)
	at hudson.plugins.git.GitSCM.checkout(GitSCM.java:1036)
	at hudson.scm.SCM.checkout(SCM.java:484)
	at hudson.model.AbstractProject.checkout(AbstractProject.java:1274)
	at hudson.model.AbstractBuild$AbstractBuildExecution.defaultCheckout(AbstractBuild.java:609)
	at jenkins.scm.SCMCheckoutStrategy.checkout(SCMCheckoutStrategy.java:86)
	at hudson.model.AbstractBuild$AbstractBuildExecution.run(AbstractBuild.java:531)
	at hudson.model.Run.execute(Run.java:1738)
	at hudson.maven.MavenModuleSetBuild.run(MavenModuleSetBuild.java:531)
	at hudson.model.ResourceController.execute(ResourceController.java:98)
	at hudson.model.Executor.run(Executor.java:381)
Caused by: java.io.IOException: Failed to mkdirs: /home/jenkins/tools/maven/apache-maven-3.0.4
	at hudson.FilePath.mkdirs(FilePath.java:1162)
	at hudson.FilePath.installIfNecessaryFrom(FilePath.java:797)
	... 16 more
Retrying after 10 seconds
java.io.IOException: Failed to install http://archive.apache.org/dist/maven/binaries/apache-maven-3.0.4-bin.zip
to /home/jenkins/tools/maven/apache-maven-3.0.4
	at hudson.FilePath.installIfNecessaryFrom(FilePath.java:831)
	at hudson.tools.DownloadFromUrlInstaller.performInstallation(DownloadFromUrlInstaller.java:70)
	at hudson.tools.InstallerTranslator.getToolHome(InstallerTranslator.java:68)
	at hudson.tools.ToolLocationNodeProperty.getToolHome(ToolLocationNodeProperty.java:107)
	at hudson.tools.ToolInstallation.translateFor(ToolInstallation.java:205)
	at hudson.tasks.Maven$MavenInstallation.forNode(Maven.java:621)
	at hudson.maven.MavenModuleSetBuild.getEnvironment(MavenModuleSetBuild.java:183)
	at hudson.plugins.git.GitSCM.checkout(GitSCM.java:1036)
	at hudson.scm.SCM.checkout(SCM.java:484)
	at hudson.model.AbstractProject.checkout(AbstractProject.java:1274)
	at hudson.model.AbstractBuild$AbstractBuildExecution.defaultCheckout(AbstractBuild.java:609)
	at jenkins.scm.SCMCheckoutStrategy.checkout(SCMCheckoutStrategy.java:86)
	at hudson.model.AbstractBuild$AbstractBuildExecution.run(AbstractBuild.java:531)
	at hudson.model.Run.execute(Run.java:1738)
	at hudson.maven.MavenModuleSetBuild.run(MavenModuleSetBuild.java:531)
	at hudson.model.ResourceController.execute(ResourceController.java:98)
	at hudson.model.Executor.run(Executor.java:381)
Caused by: java.io.IOException: Failed to mkdirs: /home/jenkins/tools/maven/apache-maven-3.0.4
	at hudson.FilePath.mkdirs(FilePath.java:1162)
	at hudson.FilePath.installIfNecessaryFrom(FilePath.java:797)
	... 16 more

---------------------------------------------------------------------
To unsubscribe, e-mail: dev-unsubscribe@commons.apache.org
For additional commands, e-mail: dev-help@commons.apache.org


Mime
View raw message