commons-dev mailing list archives

Site index · List index
Message view « Date » · « Thread »
Top « Date » · « Thread »
From Apache Jenkins Server <jenk...@builds.apache.org>
Subject Build failed in Jenkins: commons-jcs #107
Date Mon, 06 Apr 2015 15:43:05 GMT
See <https://builds.apache.org/job/commons-jcs/107/changes>

Changes:

[tv] JCS-147: Provide file size limitation for Block Disk Cache and Indexed Disk Cache

------------------------------------------
[...truncated 839 lines...]
[INFO] --- maven-compiler-plugin:3.2:compile (default-compile) @ commons-jcs-jcache-openjpa
---
[INFO] Changes detected - recompiling the module!
[INFO] Compiling 4 source files to <https://builds.apache.org/job/commons-jcs/ws/commons-jcs-jcache-openjpa/target/classes>
[INFO] 
[INFO] --- maven-bundle-plugin:2.5.3:manifest (bundle-manifest) @ commons-jcs-jcache-openjpa
---
[INFO] 
[INFO] --- build-helper-maven-plugin:1.9.1:add-test-resource (add-test-notices) @ commons-jcs-jcache-openjpa
---
[INFO] 
[INFO] --- maven-resources-plugin:2.7:testResources (default-testResources) @ commons-jcs-jcache-openjpa
---
[INFO] Using 'UTF-8' encoding to copy filtered resources.
[INFO] skip non existing resourceDirectory <https://builds.apache.org/job/commons-jcs/ws/commons-jcs-jcache-openjpa/src/test/resources>
[INFO] Copying 2 resources to META-INF
[INFO] Copying 2 resources
[INFO] 
[INFO] --- maven-compiler-plugin:3.2:testCompile (default-testCompile) @ commons-jcs-jcache-openjpa
---
[INFO] Changes detected - recompiling the module!
[INFO] Compiling 1 source file to <https://builds.apache.org/job/commons-jcs/ws/commons-jcs-jcache-openjpa/target/test-classes>
[INFO] 
[INFO] --- maven-surefire-plugin:2.18:test (default-test) @ commons-jcs-jcache-openjpa ---
[JENKINS] Recording test results
[INFO] 
[INFO] --- maven-jar-plugin:2.5:jar (default-jar) @ commons-jcs-jcache-openjpa ---
[INFO] Building jar: <https://builds.apache.org/job/commons-jcs/ws/commons-jcs-jcache-openjpa/target/commons-jcs-jcache-openjpa-2.0-SNAPSHOT.jar>
[INFO] 
[INFO] --- maven-jar-plugin:2.5:test-jar (attach-test-jar) @ commons-jcs-jcache-openjpa ---
[INFO] Building jar: <https://builds.apache.org/job/commons-jcs/ws/commons-jcs-jcache-openjpa/target/commons-jcs-jcache-openjpa-2.0-SNAPSHOT-tests.jar>
[INFO] 
[INFO] --- maven-site-plugin:3.4:attach-descriptor (attach-descriptor) @ commons-jcs-jcache-openjpa
---
[INFO] 
[INFO] --- maven-enforcer-plugin:1.3.1:enforce (enforce-maven-3) @ commons-jcs-jcache-openjpa
---
[INFO] 
[INFO] --- maven-antrun-plugin:1.7:run (javadoc.resources) @ commons-jcs-jcache-openjpa ---
[INFO] Executing tasks

main:
[INFO] Executed tasks
[INFO] 
[INFO] --- maven-antrun-plugin:1.7:run (copy-notices) @ commons-jcs-jcache-openjpa ---
[INFO] Executing tasks

main:
[INFO] Executed tasks
[WARNING] Failed to getClass for org.apache.maven.plugin.javadoc.JavadocReport
[INFO] 
[INFO] --- maven-javadoc-plugin:2.10.1:javadoc (create-javadoc-jar) @ commons-jcs-jcache-openjpa
---
[INFO] 
1 warning
[WARNING] Javadoc Warnings
[WARNING] warning: [options] bootstrap class path not set in conjunction with -source 1.6
[JENKINS] Archiving  javadoc
[INFO] 
[INFO] --- maven-javadoc-plugin:2.10.1:jar (create-javadoc-jar) @ commons-jcs-jcache-openjpa
---
[INFO] 
1 warning
[WARNING] Javadoc Warnings
[WARNING] warning: [options] bootstrap class path not set in conjunction with -source 1.6
[INFO] Building jar: <https://builds.apache.org/job/commons-jcs/ws/commons-jcs-jcache-openjpa/target/commons-jcs-jcache-openjpa-2.0-SNAPSHOT-javadoc.jar>
[INFO] 
[INFO] --- maven-source-plugin:2.4:jar-no-fork (attach-sources) @ commons-jcs-jcache-openjpa
---
[INFO] Building jar: <https://builds.apache.org/job/commons-jcs/ws/commons-jcs-jcache-openjpa/target/commons-jcs-jcache-openjpa-2.0-SNAPSHOT-sources.jar>
[INFO] 
[INFO] --- maven-source-plugin:2.4:test-jar-no-fork (attach-test-sources) @ commons-jcs-jcache-openjpa
---
[INFO] Building jar: <https://builds.apache.org/job/commons-jcs/ws/commons-jcs-jcache-openjpa/target/commons-jcs-jcache-openjpa-2.0-SNAPSHOT-test-sources.jar>
[INFO] 
[INFO] --- maven-install-plugin:2.5.2:install (default-install) @ commons-jcs-jcache-openjpa
---
[INFO] Installing <https://builds.apache.org/job/commons-jcs/ws/commons-jcs-jcache-openjpa/target/commons-jcs-jcache-openjpa-2.0-SNAPSHOT.jar>
to /home/jenkins/jenkins-slave/maven-repositories/1/org/apache/commons/commons-jcs-jcache-openjpa/2.0-SNAPSHOT/commons-jcs-jcache-openjpa-2.0-SNAPSHOT.jar
[INFO] Installing <https://builds.apache.org/job/commons-jcs/ws/commons-jcs-jcache-openjpa/pom.xml>
to /home/jenkins/jenkins-slave/maven-repositories/1/org/apache/commons/commons-jcs-jcache-openjpa/2.0-SNAPSHOT/commons-jcs-jcache-openjpa-2.0-SNAPSHOT.pom
[INFO] Installing <https://builds.apache.org/job/commons-jcs/ws/commons-jcs-jcache-openjpa/target/commons-jcs-jcache-openjpa-2.0-SNAPSHOT-tests.jar>
to /home/jenkins/jenkins-slave/maven-repositories/1/org/apache/commons/commons-jcs-jcache-openjpa/2.0-SNAPSHOT/commons-jcs-jcache-openjpa-2.0-SNAPSHOT-tests.jar
[INFO] Installing <https://builds.apache.org/job/commons-jcs/ws/commons-jcs-jcache-openjpa/target/commons-jcs-jcache-openjpa-2.0-SNAPSHOT-javadoc.jar>
to /home/jenkins/jenkins-slave/maven-repositories/1/org/apache/commons/commons-jcs-jcache-openjpa/2.0-SNAPSHOT/commons-jcs-jcache-openjpa-2.0-SNAPSHOT-javadoc.jar
[INFO] Installing <https://builds.apache.org/job/commons-jcs/ws/commons-jcs-jcache-openjpa/target/commons-jcs-jcache-openjpa-2.0-SNAPSHOT-sources.jar>
to /home/jenkins/jenkins-slave/maven-repositories/1/org/apache/commons/commons-jcs-jcache-openjpa/2.0-SNAPSHOT/commons-jcs-jcache-openjpa-2.0-SNAPSHOT-sources.jar
[INFO] Installing <https://builds.apache.org/job/commons-jcs/ws/commons-jcs-jcache-openjpa/target/commons-jcs-jcache-openjpa-2.0-SNAPSHOT-test-sources.jar>
to /home/jenkins/jenkins-slave/maven-repositories/1/org/apache/commons/commons-jcs-jcache-openjpa/2.0-SNAPSHOT/commons-jcs-jcache-openjpa-2.0-SNAPSHOT-test-sources.jar
[INFO] ------------------------------------------------------------------------
[INFO] Reactor Summary:
[INFO] 
[INFO] Apache Commons JCS ................................ SUCCESS [6.496s]
[INFO] Apache Commons JCS :: Core ........................ SUCCESS [33.505s]
[INFO] Apache Commons JCS :: JCache ...................... SUCCESS [6.669s]
[INFO] Apache Commons JCS :: JCache TCK .................. SUCCESS [1:34.967s]
[INFO] Apache Commons JCS :: JCache Extras ............... SUCCESS [6.746s]
[INFO] Apache Commons JCS :: JCache OpenJPA .............. SUCCESS [4.595s]
[INFO] ------------------------------------------------------------------------
[INFO] BUILD SUCCESS
[INFO] ------------------------------------------------------------------------
[INFO] Total time: 2:37.096s
[INFO] Finished at: Mon Apr 06 15:36:26 UTC 2015
[INFO] Final Memory: 50M/408M
[INFO] ------------------------------------------------------------------------
Waiting for Jenkins to finish collecting data
[JENKINS] Archiving <https://builds.apache.org/job/commons-jcs/ws/commons-jcs-core/pom.xml>
to org.apache.commons/commons-jcs-core/2.0-SNAPSHOT/commons-jcs-core-2.0-SNAPSHOT.pom
[JENKINS] Archiving <https://builds.apache.org/job/commons-jcs/ws/commons-jcs-core/target/commons-jcs-core-2.0-SNAPSHOT.jar>
to org.apache.commons/commons-jcs-core/2.0-SNAPSHOT/commons-jcs-core-2.0-SNAPSHOT.jar
[JENKINS] Archiving <https://builds.apache.org/job/commons-jcs/ws/commons-jcs-core/target/commons-jcs-core-2.0-SNAPSHOT-tests.jar>
to org.apache.commons/commons-jcs-core/2.0-SNAPSHOT/commons-jcs-core-2.0-SNAPSHOT-tests.jar
[JENKINS] Archiving <https://builds.apache.org/job/commons-jcs/ws/commons-jcs-core/target/commons-jcs-core-2.0-SNAPSHOT-javadoc.jar>
to org.apache.commons/commons-jcs-core/2.0-SNAPSHOT/commons-jcs-core-2.0-SNAPSHOT-javadoc.jar
[JENKINS] Archiving <https://builds.apache.org/job/commons-jcs/ws/commons-jcs-core/target/commons-jcs-core-2.0-SNAPSHOT-sources.jar>
to org.apache.commons/commons-jcs-core/2.0-SNAPSHOT/commons-jcs-core-2.0-SNAPSHOT-sources.jar
[JENKINS] Archiving <https://builds.apache.org/job/commons-jcs/ws/commons-jcs-core/target/commons-jcs-core-2.0-SNAPSHOT-test-sources.jar>
to org.apache.commons/commons-jcs-core/2.0-SNAPSHOT/commons-jcs-core-2.0-SNAPSHOT-test-sources.jar
Sending artifact delta relative to commons-jcs » Apache Commons JCS :: Core #106
Archived 6 artifacts
Archive block size is 32768
Received 0 blocks and 3856769 bytes
Compression is 0.0%
Took 1 sec
[JENKINS] Archiving <https://builds.apache.org/job/commons-jcs/ws/commons-jcs-jcache/pom.xml>
to org.apache.commons/commons-jcs-jcache/2.0-SNAPSHOT/commons-jcs-jcache-2.0-SNAPSHOT.pom
[JENKINS] Archiving <https://builds.apache.org/job/commons-jcs/ws/commons-jcs-jcache/target/commons-jcs-jcache-2.0-SNAPSHOT.jar>
to org.apache.commons/commons-jcs-jcache/2.0-SNAPSHOT/commons-jcs-jcache-2.0-SNAPSHOT.jar
[JENKINS] Archiving <https://builds.apache.org/job/commons-jcs/ws/commons-jcs-jcache/target/commons-jcs-jcache-2.0-SNAPSHOT-tests.jar>
to org.apache.commons/commons-jcs-jcache/2.0-SNAPSHOT/commons-jcs-jcache-2.0-SNAPSHOT-tests.jar
[JENKINS] Archiving <https://builds.apache.org/job/commons-jcs/ws/commons-jcs-jcache/target/commons-jcs-jcache-2.0-SNAPSHOT-cdi.jar>
to org.apache.commons/commons-jcs-jcache/2.0-SNAPSHOT/commons-jcs-jcache-2.0-SNAPSHOT-cdi.jar
[JENKINS] Archiving <https://builds.apache.org/job/commons-jcs/ws/commons-jcs-jcache/target/commons-jcs-jcache-2.0-SNAPSHOT-nocdi.jar>
to org.apache.commons/commons-jcs-jcache/2.0-SNAPSHOT/commons-jcs-jcache-2.0-SNAPSHOT-nocdi.jar
[JENKINS] Archiving <https://builds.apache.org/job/commons-jcs/ws/commons-jcs-jcache/target/commons-jcs-jcache-2.0-SNAPSHOT-javadoc.jar>
to org.apache.commons/commons-jcs-jcache/2.0-SNAPSHOT/commons-jcs-jcache-2.0-SNAPSHOT-javadoc.jar
[JENKINS] Archiving <https://builds.apache.org/job/commons-jcs/ws/commons-jcs-jcache/target/commons-jcs-jcache-2.0-SNAPSHOT-sources.jar>
to org.apache.commons/commons-jcs-jcache/2.0-SNAPSHOT/commons-jcs-jcache-2.0-SNAPSHOT-sources.jar
[JENKINS] Archiving <https://builds.apache.org/job/commons-jcs/ws/commons-jcs-jcache/target/commons-jcs-jcache-2.0-SNAPSHOT-test-sources.jar>
to org.apache.commons/commons-jcs-jcache/2.0-SNAPSHOT/commons-jcs-jcache-2.0-SNAPSHOT-test-sources.jar
Sending artifact delta relative to commons-jcs » Apache Commons JCS :: JCache #106
Archived 8 artifacts
Archive block size is 32768
Received 0 blocks and 592835 bytes
Compression is 0.0%
Took 0.16 sec
[JENKINS] Archiving <https://builds.apache.org/job/commons-jcs/ws/pom.xml> to org.apache.commons/commons-jcs/2.0-SNAPSHOT/commons-jcs-2.0-SNAPSHOT.pom
[JENKINS] Archiving <https://builds.apache.org/job/commons-jcs/ws/target/commons-jcs-2.0-SNAPSHOT-site.xml>
to org.apache.commons/commons-jcs/2.0-SNAPSHOT/commons-jcs-2.0-SNAPSHOT-site.xml
Sending artifact delta relative to commons-jcs » Apache Commons JCS #106
Archived 2 artifacts
Archive block size is 32768
Received 0 blocks and 28177 bytes
Compression is 0.0%
Took 30 ms
[JENKINS] Archiving <https://builds.apache.org/job/commons-jcs/ws/commons-jcs-jcache-extras/pom.xml>
to org.apache.commons/commons-jcs-jcache-extras/2.0-SNAPSHOT/commons-jcs-jcache-extras-2.0-SNAPSHOT.pom
[JENKINS] Archiving <https://builds.apache.org/job/commons-jcs/ws/commons-jcs-jcache-extras/target/commons-jcs-jcache-extras-2.0-SNAPSHOT.jar>
to org.apache.commons/commons-jcs-jcache-extras/2.0-SNAPSHOT/commons-jcs-jcache-extras-2.0-SNAPSHOT.jar
[JENKINS] Archiving <https://builds.apache.org/job/commons-jcs/ws/commons-jcs-jcache-extras/target/commons-jcs-jcache-extras-2.0-SNAPSHOT-tests.jar>
to org.apache.commons/commons-jcs-jcache-extras/2.0-SNAPSHOT/commons-jcs-jcache-extras-2.0-SNAPSHOT-tests.jar
[JENKINS] Archiving <https://builds.apache.org/job/commons-jcs/ws/commons-jcs-jcache-extras/target/commons-jcs-jcache-extras-2.0-SNAPSHOT-javadoc.jar>
to org.apache.commons/commons-jcs-jcache-extras/2.0-SNAPSHOT/commons-jcs-jcache-extras-2.0-SNAPSHOT-javadoc.jar
[JENKINS] Archiving <https://builds.apache.org/job/commons-jcs/ws/commons-jcs-jcache-extras/target/commons-jcs-jcache-extras-2.0-SNAPSHOT-sources.jar>
to org.apache.commons/commons-jcs-jcache-extras/2.0-SNAPSHOT/commons-jcs-jcache-extras-2.0-SNAPSHOT-sources.jar
[JENKINS] Archiving <https://builds.apache.org/job/commons-jcs/ws/commons-jcs-jcache-extras/target/commons-jcs-jcache-extras-2.0-SNAPSHOT-test-sources.jar>
to org.apache.commons/commons-jcs-jcache-extras/2.0-SNAPSHOT/commons-jcs-jcache-extras-2.0-SNAPSHOT-test-sources.jar
Sending artifact delta relative to commons-jcs » Apache Commons JCS :: JCache Extras #106
Archived 6 artifacts
Archive block size is 32768
Received 0 blocks and 253647 bytes
Compression is 0.0%
Took 84 ms
[JENKINS] Archiving <https://builds.apache.org/job/commons-jcs/ws/commons-jcs-tck-tests/pom.xml>
to org.apache.commons/commons-jcs-jcache-tck/2.0-SNAPSHOT/commons-jcs-jcache-tck-2.0-SNAPSHOT.pom
[JENKINS] Archiving <https://builds.apache.org/job/commons-jcs/ws/commons-jcs-tck-tests/target/commons-jcs-jcache-tck-2.0-SNAPSHOT.jar>
to org.apache.commons/commons-jcs-jcache-tck/2.0-SNAPSHOT/commons-jcs-jcache-tck-2.0-SNAPSHOT.jar
Sending artifact delta relative to commons-jcs » Apache Commons JCS :: JCache TCK #106
Archived 2 artifacts
Archive block size is 32768
Received 0 blocks and 16639 bytes
Compression is 0.0%
Took 29 ms
[JENKINS] Archiving <https://builds.apache.org/job/commons-jcs/ws/commons-jcs-jcache-openjpa/pom.xml>
to org.apache.commons/commons-jcs-jcache-openjpa/2.0-SNAPSHOT/commons-jcs-jcache-openjpa-2.0-SNAPSHOT.pom
[JENKINS] Archiving <https://builds.apache.org/job/commons-jcs/ws/commons-jcs-jcache-openjpa/target/commons-jcs-jcache-openjpa-2.0-SNAPSHOT.jar>
to org.apache.commons/commons-jcs-jcache-openjpa/2.0-SNAPSHOT/commons-jcs-jcache-openjpa-2.0-SNAPSHOT.jar
[JENKINS] Archiving <https://builds.apache.org/job/commons-jcs/ws/commons-jcs-jcache-openjpa/target/commons-jcs-jcache-openjpa-2.0-SNAPSHOT-tests.jar>
to org.apache.commons/commons-jcs-jcache-openjpa/2.0-SNAPSHOT/commons-jcs-jcache-openjpa-2.0-SNAPSHOT-tests.jar
[JENKINS] Archiving <https://builds.apache.org/job/commons-jcs/ws/commons-jcs-jcache-openjpa/target/commons-jcs-jcache-openjpa-2.0-SNAPSHOT-javadoc.jar>
to org.apache.commons/commons-jcs-jcache-openjpa/2.0-SNAPSHOT/commons-jcs-jcache-openjpa-2.0-SNAPSHOT-javadoc.jar
[JENKINS] Archiving <https://builds.apache.org/job/commons-jcs/ws/commons-jcs-jcache-openjpa/target/commons-jcs-jcache-openjpa-2.0-SNAPSHOT-sources.jar>
to org.apache.commons/commons-jcs-jcache-openjpa/2.0-SNAPSHOT/commons-jcs-jcache-openjpa-2.0-SNAPSHOT-sources.jar
[JENKINS] Archiving <https://builds.apache.org/job/commons-jcs/ws/commons-jcs-jcache-openjpa/target/commons-jcs-jcache-openjpa-2.0-SNAPSHOT-test-sources.jar>
to org.apache.commons/commons-jcs-jcache-openjpa/2.0-SNAPSHOT/commons-jcs-jcache-openjpa-2.0-SNAPSHOT-test-sources.jar
Sending artifact delta relative to commons-jcs » Apache Commons JCS :: JCache OpenJPA #106
Archived 6 artifacts
Archive block size is 32768
Received 0 blocks and 112218 bytes
Compression is 0.0%
Took 50 ms
channel stopped
Maven RedeployPublisher use remote ubuntu-1 maven settings from : /home/jenkins/.m2/settings.xml
[INFO] Deployment in https://repository.apache.org/content/repositories/snapshots (id=apache.snapshots.https,uniqueVersion=true)
Deploying the main artifact commons-jcs-2.0-SNAPSHOT.pom
Downloading: https://repository.apache.org/content/repositories/snapshots/org/apache/commons/commons-jcs/2.0-SNAPSHOT/maven-metadata.xml
Downloaded: https://repository.apache.org/content/repositories/snapshots/org/apache/commons/commons-jcs/2.0-SNAPSHOT/maven-metadata.xml
(817 B at 3.9 KB/sec)
Uploading: https://repository.apache.org/content/repositories/snapshots/org/apache/commons/commons-jcs/2.0-SNAPSHOT/commons-jcs-2.0-20150406.153631-192.pom
Uploaded: https://repository.apache.org/content/repositories/snapshots/org/apache/commons/commons-jcs/2.0-SNAPSHOT/commons-jcs-2.0-20150406.153631-192.pom
(24 KB at 0.4 KB/sec)
Downloading: https://repository.apache.org/content/repositories/snapshots/org/apache/commons/commons-jcs/maven-metadata.xml
Downloaded: https://repository.apache.org/content/repositories/snapshots/org/apache/commons/commons-jcs/maven-metadata.xml
(345 B at 0.1 KB/sec)
Uploading: https://repository.apache.org/content/repositories/snapshots/org/apache/commons/commons-jcs/2.0-SNAPSHOT/maven-metadata.xml
Uploaded: https://repository.apache.org/content/repositories/snapshots/org/apache/commons/commons-jcs/2.0-SNAPSHOT/maven-metadata.xml
(817 B at 0.5 KB/sec)
Uploading: https://repository.apache.org/content/repositories/snapshots/org/apache/commons/commons-jcs/maven-metadata.xml
Uploaded: https://repository.apache.org/content/repositories/snapshots/org/apache/commons/commons-jcs/maven-metadata.xml
(345 B at 0.1 KB/sec)
Deploying the main artifact commons-jcs-2.0-SNAPSHOT-site.xml
Uploading: https://repository.apache.org/content/repositories/snapshots/org/apache/commons/commons-jcs/2.0-SNAPSHOT/commons-jcs-2.0-20150406.153631-192-site.xml
Uploaded: https://repository.apache.org/content/repositories/snapshots/org/apache/commons/commons-jcs/2.0-SNAPSHOT/commons-jcs-2.0-20150406.153631-192-site.xml
(4 KB at 0.3 KB/sec)
Uploading: https://repository.apache.org/content/repositories/snapshots/org/apache/commons/commons-jcs/2.0-SNAPSHOT/maven-metadata.xml
Uploaded: https://repository.apache.org/content/repositories/snapshots/org/apache/commons/commons-jcs/2.0-SNAPSHOT/maven-metadata.xml
(817 B at 0.0 KB/sec)
[INFO] Deployment in https://repository.apache.org/content/repositories/snapshots (id=apache.snapshots.https,uniqueVersion=true)
Deploying the main artifact commons-jcs-core-2.0-SNAPSHOT.jar
Downloading: https://repository.apache.org/content/repositories/snapshots/org/apache/commons/commons-jcs-core/2.0-SNAPSHOT/maven-metadata.xml
Downloaded: https://repository.apache.org/content/repositories/snapshots/org/apache/commons/commons-jcs-core/2.0-SNAPSHOT/maven-metadata.xml
(2 KB at 0.3 KB/sec)
Uploading: https://repository.apache.org/content/repositories/snapshots/org/apache/commons/commons-jcs-core/2.0-SNAPSHOT/commons-jcs-core-2.0-20150406.153826-134.jar
Uploaded: https://repository.apache.org/content/repositories/snapshots/org/apache/commons/commons-jcs-core/2.0-SNAPSHOT/commons-jcs-core-2.0-20150406.153826-134.jar
(533 KB at 114.4 KB/sec)
Uploading: https://repository.apache.org/content/repositories/snapshots/org/apache/commons/commons-jcs-core/2.0-SNAPSHOT/commons-jcs-core-2.0-20150406.153826-134.pom
Uploaded: https://repository.apache.org/content/repositories/snapshots/org/apache/commons/commons-jcs-core/2.0-SNAPSHOT/commons-jcs-core-2.0-20150406.153826-134.pom
(6 KB at 0.2 KB/sec)
Downloading: https://repository.apache.org/content/repositories/snapshots/org/apache/commons/commons-jcs-core/maven-metadata.xml
Downloaded: https://repository.apache.org/content/repositories/snapshots/org/apache/commons/commons-jcs-core/maven-metadata.xml
(292 B at 0.1 KB/sec)
Uploading: https://repository.apache.org/content/repositories/snapshots/org/apache/commons/commons-jcs-core/2.0-SNAPSHOT/maven-metadata.xml
Uploaded: https://repository.apache.org/content/repositories/snapshots/org/apache/commons/commons-jcs-core/2.0-SNAPSHOT/maven-metadata.xml
(2 KB at 0.1 KB/sec)
Uploading: https://repository.apache.org/content/repositories/snapshots/org/apache/commons/commons-jcs-core/maven-metadata.xml
Uploaded: https://repository.apache.org/content/repositories/snapshots/org/apache/commons/commons-jcs-core/maven-metadata.xml
(292 B at 0.2 KB/sec)
Deploying the main artifact commons-jcs-core-2.0-SNAPSHOT-tests.jar
Uploading: https://repository.apache.org/content/repositories/snapshots/org/apache/commons/commons-jcs-core/2.0-SNAPSHOT/commons-jcs-core-2.0-20150406.153826-134-tests.jar
Uploaded: https://repository.apache.org/content/repositories/snapshots/org/apache/commons/commons-jcs-core/2.0-SNAPSHOT/commons-jcs-core-2.0-20150406.153826-134-tests.jar
(417 KB at 7.0 KB/sec)
Uploading: https://repository.apache.org/content/repositories/snapshots/org/apache/commons/commons-jcs-core/2.0-SNAPSHOT/maven-metadata.xml
Uploaded: https://repository.apache.org/content/repositories/snapshots/org/apache/commons/commons-jcs-core/2.0-SNAPSHOT/maven-metadata.xml
(2 KB at 0.1 KB/sec)
Deploying the main artifact commons-jcs-core-2.0-SNAPSHOT-javadoc.jar
Uploading: https://repository.apache.org/content/repositories/snapshots/org/apache/commons/commons-jcs-core/2.0-SNAPSHOT/commons-jcs-core-2.0-20150406.153826-134-javadoc.jar
Uploaded: https://repository.apache.org/content/repositories/snapshots/org/apache/commons/commons-jcs-core/2.0-SNAPSHOT/commons-jcs-core-2.0-20150406.153826-134-javadoc.jar
(1982 KB at 93.9 KB/sec)
Uploading: https://repository.apache.org/content/repositories/snapshots/org/apache/commons/commons-jcs-core/2.0-SNAPSHOT/maven-metadata.xml
Uploaded: https://repository.apache.org/content/repositories/snapshots/org/apache/commons/commons-jcs-core/2.0-SNAPSHOT/maven-metadata.xml
(2 KB at 5.3 KB/sec)
Deploying the main artifact commons-jcs-core-2.0-SNAPSHOT-sources.jar
Uploading: https://repository.apache.org/content/repositories/snapshots/org/apache/commons/commons-jcs-core/2.0-SNAPSHOT/commons-jcs-core-2.0-20150406.153826-134-sources.jar
Uploaded: https://repository.apache.org/content/repositories/snapshots/org/apache/commons/commons-jcs-core/2.0-SNAPSHOT/commons-jcs-core-2.0-20150406.153826-134-sources.jar
(521 KB at 776.1 KB/sec)
Uploading: https://repository.apache.org/content/repositories/snapshots/org/apache/commons/commons-jcs-core/2.0-SNAPSHOT/maven-metadata.xml
Uploaded: https://repository.apache.org/content/repositories/snapshots/org/apache/commons/commons-jcs-core/2.0-SNAPSHOT/maven-metadata.xml
(2 KB at 37.3 KB/sec)
Deploying the main artifact commons-jcs-core-2.0-SNAPSHOT-test-sources.jar
Uploading: https://repository.apache.org/content/repositories/snapshots/org/apache/commons/commons-jcs-core/2.0-SNAPSHOT/commons-jcs-core-2.0-20150406.153826-134-test-sources.jar
Uploaded: https://repository.apache.org/content/repositories/snapshots/org/apache/commons/commons-jcs-core/2.0-SNAPSHOT/commons-jcs-core-2.0-20150406.153826-134-test-sources.jar
(310 KB at 5624.9 KB/sec)
Uploading: https://repository.apache.org/content/repositories/snapshots/org/apache/commons/commons-jcs-core/2.0-SNAPSHOT/maven-metadata.xml
Uploaded: https://repository.apache.org/content/repositories/snapshots/org/apache/commons/commons-jcs-core/2.0-SNAPSHOT/maven-metadata.xml
(2 KB at 1.1 KB/sec)
[INFO] Deployment in https://repository.apache.org/content/repositories/snapshots (id=apache.snapshots.https,uniqueVersion=true)
Deploying the main artifact commons-jcs-jcache-2.0-SNAPSHOT.jar
Downloading: https://repository.apache.org/content/repositories/snapshots/org/apache/commons/commons-jcs-jcache/2.0-SNAPSHOT/maven-metadata.xml
Downloaded: https://repository.apache.org/content/repositories/snapshots/org/apache/commons/commons-jcs-jcache/2.0-SNAPSHOT/maven-metadata.xml
(3 KB at 0.6 KB/sec)
Uploading: https://repository.apache.org/content/repositories/snapshots/org/apache/commons/commons-jcs-jcache/2.0-SNAPSHOT/commons-jcs-jcache-2.0-20150406.154104-134.jar
Uploading: https://repository.apache.org/content/repositories/snapshots/org/apache/commons/commons-jcs-jcache/2.0-SNAPSHOT/commons-jcs-jcache-2.0-20150406.154104-134.pom
ERROR: Failed to deploy artifacts: Could not transfer artifact org.apache.commons:commons-jcs-jcache:jar:2.0-20150406.154104-134
from/to apache.snapshots.https (https://repository.apache.org/content/repositories/snapshots):
Failed to transfer file: https://repository.apache.org/content/repositories/snapshots/org/apache/commons/commons-jcs-jcache/2.0-SNAPSHOT/commons-jcs-jcache-2.0-20150406.154104-134.jar.
Return code is: 502, ReasonPhrase: Proxy Error.
org.apache.maven.artifact.deployer.ArtifactDeploymentException: Failed to deploy artifacts:
Could not transfer artifact org.apache.commons:commons-jcs-jcache:jar:2.0-20150406.154104-134
from/to apache.snapshots.https (https://repository.apache.org/content/repositories/snapshots):
Failed to transfer file: https://repository.apache.org/content/repositories/snapshots/org/apache/commons/commons-jcs-jcache/2.0-SNAPSHOT/commons-jcs-jcache-2.0-20150406.154104-134.jar.
Return code is: 502, ReasonPhrase: Proxy Error.
	at org.apache.maven.artifact.deployer.DefaultArtifactDeployer.deploy(DefaultArtifactDeployer.java:143)
	at hudson.maven.reporters.MavenArtifactRecord.deploy(MavenArtifactRecord.java:193)
	at hudson.maven.RedeployPublisher.perform(RedeployPublisher.java:176)
	at hudson.tasks.BuildStepMonitor$1.perform(BuildStepMonitor.java:20)
	at hudson.model.AbstractBuild$AbstractBuildExecution.perform(AbstractBuild.java:756)
	at hudson.model.AbstractBuild$AbstractBuildExecution.performAllBuildSteps(AbstractBuild.java:720)
	at hudson.maven.MavenModuleSetBuild$MavenModuleSetBuildExecution.post2(MavenModuleSetBuild.java:1037)
	at hudson.model.AbstractBuild$AbstractBuildExecution.post(AbstractBuild.java:669)
	at hudson.model.Run.execute(Run.java:1731)
	at hudson.maven.MavenModuleSetBuild.run(MavenModuleSetBuild.java:529)
	at hudson.model.ResourceController.execute(ResourceController.java:88)
	at hudson.model.Executor.run(Executor.java:232)
Caused by: org.eclipse.aether.deployment.DeploymentException: Failed to deploy artifacts:
Could not transfer artifact org.apache.commons:commons-jcs-jcache:jar:2.0-20150406.154104-134
from/to apache.snapshots.https (https://repository.apache.org/content/repositories/snapshots):
Failed to transfer file: https://repository.apache.org/content/repositories/snapshots/org/apache/commons/commons-jcs-jcache/2.0-SNAPSHOT/commons-jcs-jcache-2.0-20150406.154104-134.jar.
Return code is: 502, ReasonPhrase: Proxy Error.
	at org.eclipse.aether.internal.impl.DefaultDeployer.deploy(DefaultDeployer.java:341)
	at org.eclipse.aether.internal.impl.DefaultDeployer.deploy(DefaultDeployer.java:269)
	at org.eclipse.aether.internal.impl.DefaultRepositorySystem.deploy(DefaultRepositorySystem.java:413)
	at org.apache.maven.artifact.deployer.DefaultArtifactDeployer.deploy(DefaultArtifactDeployer.java:139)
	... 11 more
Caused by: org.eclipse.aether.transfer.ArtifactTransferException: Could not transfer artifact
org.apache.commons:commons-jcs-jcache:jar:2.0-20150406.154104-134 from/to apache.snapshots.https
(https://repository.apache.org/content/repositories/snapshots): Failed to transfer file: https://repository.apache.org/content/repositories/snapshots/org/apache/commons/commons-jcs-jcache/2.0-SNAPSHOT/commons-jcs-jcache-2.0-20150406.154104-134.jar.
Return code is: 502, ReasonPhrase: Proxy Error.
	at org.eclipse.aether.connector.wagon.WagonRepositoryConnector$6.wrap(WagonRepositoryConnector.java:1016)
	at org.eclipse.aether.connector.wagon.WagonRepositoryConnector$6.wrap(WagonRepositoryConnector.java:1004)
	at org.eclipse.aether.connector.wagon.WagonRepositoryConnector$PutTask.run(WagonRepositoryConnector.java:895)
	at org.eclipse.aether.connector.wagon.WagonRepositoryConnector.put(WagonRepositoryConnector.java:522)
	at org.eclipse.aether.internal.impl.DefaultDeployer.deploy(DefaultDeployer.java:335)
	... 14 more
Caused by: org.apache.maven.wagon.TransferFailedException: Failed to transfer file: https://repository.apache.org/content/repositories/snapshots/org/apache/commons/commons-jcs-jcache/2.0-SNAPSHOT/commons-jcs-jcache-2.0-20150406.154104-134.jar.
Return code is: 502, ReasonPhrase: Proxy Error.
	at org.apache.maven.wagon.shared.http4.AbstractHttpClientWagon.put(AbstractHttpClientWagon.java:626)
	at org.apache.maven.wagon.shared.http4.AbstractHttpClientWagon.put(AbstractHttpClientWagon.java:524)
	at org.apache.maven.wagon.shared.http4.AbstractHttpClientWagon.put(AbstractHttpClientWagon.java:505)
	at org.apache.maven.wagon.shared.http4.AbstractHttpClientWagon.put(AbstractHttpClientWagon.java:485)
	at org.eclipse.aether.connector.wagon.WagonRepositoryConnector$PutTask.run(WagonRepositoryConnector.java:871)
	... 16 more
[INFO] Deployment failed after 6 min 34 sec
Build step 'Deploy artifacts to Maven repository' changed build result to FAILURE

---------------------------------------------------------------------
To unsubscribe, e-mail: dev-unsubscribe@commons.apache.org
For additional commands, e-mail: dev-help@commons.apache.org


Mime
View raw message