commons-dev mailing list archives

Site index · List index
Message view « Date » · « Thread »
Top « Date » · « Thread »
From Apache Jenkins Server <jenk...@builds.apache.org>
Subject Build failed in Jenkins: commons-jcs #56
Date Mon, 03 Nov 2014 09:33:03 GMT
See <https://builds.apache.org/job/commons-jcs/56/changes>

Changes:

[rmannibucau] creating a dist module for src/bin assembly

------------------------------------------
[...truncated 303 lines...]
[INFO] 
[INFO] --- maven-enforcer-plugin:1.3.1:enforce (enforce-maven-3) @ commons-jcs-jcache-extras
---
[INFO] 
[INFO] --- maven-antrun-plugin:1.7:run (javadoc.resources) @ commons-jcs-jcache-extras ---
[INFO] Executing tasks

main:
[INFO] Executed tasks
[INFO] 
[INFO] --- maven-remote-resources-plugin:1.5:process (default) @ commons-jcs-jcache-extras
---
[INFO] 
[INFO] --- buildnumber-maven-plugin:1.2:create (default) @ commons-jcs-jcache-extras ---
[INFO] Checking for local modifications: skipped.
[INFO] Updating project files from SCM: skipped.
[INFO] Executing: /bin/sh -c cd <https://builds.apache.org/job/commons-jcs/ws/commons-jcs-jcache-extras>
&& svn --non-interactive info
[INFO] Working directory: <https://builds.apache.org/job/commons-jcs/ws/commons-jcs-jcache-extras>
[INFO] Storing buildNumber: 1635515 at timestamp: 1415007163980
[INFO] Executing: /bin/sh -c cd <https://builds.apache.org/job/commons-jcs/ws/commons-jcs-jcache-extras>
&& svn --non-interactive info
[INFO] Working directory: <https://builds.apache.org/job/commons-jcs/ws/commons-jcs-jcache-extras>
[INFO] Storing buildScmBranch: trunk
[INFO] 
[INFO] --- maven-resources-plugin:2.6:resources (default-resources) @ commons-jcs-jcache-extras
---
[INFO] Using 'UTF-8' encoding to copy filtered resources.
[INFO] Copying 1 resource
[INFO] Copying 0 resource to META-INF
[INFO] 
[INFO] --- maven-compiler-plugin:3.1:compile (default-compile) @ commons-jcs-jcache-extras
---
[INFO] Changes detected - recompiling the module!
[INFO] Compiling 13 source files to <https://builds.apache.org/job/commons-jcs/ws/commons-jcs-jcache-extras/target/classes>
[INFO] 
[INFO] --- maven-bundle-plugin:2.4.0:manifest (bundle-manifest) @ commons-jcs-jcache-extras
---
[INFO] 
[INFO] --- maven-resources-plugin:2.6:testResources (default-testResources) @ commons-jcs-jcache-extras
---
[INFO] Using 'UTF-8' encoding to copy filtered resources.
[INFO] Copying 1 resource
[INFO] Copying 0 resource to META-INF
[INFO] 
[INFO] --- maven-compiler-plugin:3.1:testCompile (default-testCompile) @ commons-jcs-jcache-extras
---
[INFO] Changes detected - recompiling the module!
[INFO] Compiling 7 source files to <https://builds.apache.org/job/commons-jcs/ws/commons-jcs-jcache-extras/target/test-classes>
[WARNING] <https://builds.apache.org/job/commons-jcs/ws/commons-jcs-jcache-extras/src/test/java/org/apache/commons/jcs/jcache/extras/writer/CompositeCacheWriterTest.java>:
Some input files use unchecked or unsafe operations.
[WARNING] <https://builds.apache.org/job/commons-jcs/ws/commons-jcs-jcache-extras/src/test/java/org/apache/commons/jcs/jcache/extras/writer/CompositeCacheWriterTest.java>:
Recompile with -Xlint:unchecked for details.
[INFO] 
[INFO] --- maven-surefire-plugin:2.17:test (default-test) @ commons-jcs-jcache-extras ---
[JENKINS] Recording test results
[INFO] 
[INFO] --- maven-jar-plugin:2.4:jar (default-jar) @ commons-jcs-jcache-extras ---
[INFO] Building jar: <https://builds.apache.org/job/commons-jcs/ws/commons-jcs-jcache-extras/target/commons-jcs-jcache-extras-2.0-SNAPSHOT.jar>
[INFO] 
[INFO] --- maven-site-plugin:3.3:attach-descriptor (attach-descriptor) @ commons-jcs-jcache-extras
---
[INFO] 
[INFO] --- maven-install-plugin:2.5.1:install (default-install) @ commons-jcs-jcache-extras
---
[INFO] Installing <https://builds.apache.org/job/commons-jcs/ws/commons-jcs-jcache-extras/target/commons-jcs-jcache-extras-2.0-SNAPSHOT.jar>
to /home/jenkins/jenkins-slave/maven-repositories/1/org/apache/commons/commons-jcs-jcache-extras/2.0-SNAPSHOT/commons-jcs-jcache-extras-2.0-SNAPSHOT.jar
[INFO] Installing <https://builds.apache.org/job/commons-jcs/ws/commons-jcs-jcache-extras/pom.xml>
to /home/jenkins/jenkins-slave/maven-repositories/1/org/apache/commons/commons-jcs-jcache-extras/2.0-SNAPSHOT/commons-jcs-jcache-extras-2.0-SNAPSHOT.pom
[INFO]                                                                         
[INFO] ------------------------------------------------------------------------
[INFO] Building Apache Commons JCS :: JCache OpenJPA 2.0-SNAPSHOT
[INFO] ------------------------------------------------------------------------
[INFO] 
[INFO] --- maven-clean-plugin:2.5:clean (default-clean) @ commons-jcs-jcache-openjpa ---
[INFO] Deleting <https://builds.apache.org/job/commons-jcs/ws/commons-jcs-jcache-openjpa/target>
[INFO] 
[INFO] --- maven-enforcer-plugin:1.3.1:enforce (enforce-maven-3) @ commons-jcs-jcache-openjpa
---
[INFO] 
[INFO] --- maven-antrun-plugin:1.7:run (javadoc.resources) @ commons-jcs-jcache-openjpa ---
[INFO] Executing tasks

main:
[INFO] Executed tasks
[INFO] 
[INFO] --- maven-remote-resources-plugin:1.5:process (default) @ commons-jcs-jcache-openjpa
---
[INFO] 
[INFO] --- buildnumber-maven-plugin:1.2:create (default) @ commons-jcs-jcache-openjpa ---
[INFO] Checking for local modifications: skipped.
[INFO] Updating project files from SCM: skipped.
[INFO] Executing: /bin/sh -c cd <https://builds.apache.org/job/commons-jcs/ws/commons-jcs-jcache-openjpa>
&& svn --non-interactive info
[INFO] Working directory: <https://builds.apache.org/job/commons-jcs/ws/commons-jcs-jcache-openjpa>
[INFO] Storing buildNumber: 1635515 at timestamp: 1415007169282
[INFO] Executing: /bin/sh -c cd <https://builds.apache.org/job/commons-jcs/ws/commons-jcs-jcache-openjpa>
&& svn --non-interactive info
[INFO] Working directory: <https://builds.apache.org/job/commons-jcs/ws/commons-jcs-jcache-openjpa>
[INFO] Storing buildScmBranch: trunk
[INFO] 
[INFO] --- maven-resources-plugin:2.6:resources (default-resources) @ commons-jcs-jcache-openjpa
---
[INFO] Using 'UTF-8' encoding to copy filtered resources.
[INFO] Copying 1 resource
[INFO] Copying 0 resource to META-INF
[INFO] 
[INFO] --- maven-compiler-plugin:3.1:compile (default-compile) @ commons-jcs-jcache-openjpa
---
[INFO] Changes detected - recompiling the module!
[INFO] Compiling 4 source files to <https://builds.apache.org/job/commons-jcs/ws/commons-jcs-jcache-openjpa/target/classes>
[INFO] 
[INFO] --- maven-bundle-plugin:2.4.0:manifest (bundle-manifest) @ commons-jcs-jcache-openjpa
---
[INFO] 
[INFO] --- maven-resources-plugin:2.6:testResources (default-testResources) @ commons-jcs-jcache-openjpa
---
[INFO] Using 'UTF-8' encoding to copy filtered resources.
[INFO] skip non existing resourceDirectory <https://builds.apache.org/job/commons-jcs/ws/commons-jcs-jcache-openjpa/src/test/resources>
[INFO] Copying 0 resource to META-INF
[INFO] 
[INFO] --- maven-compiler-plugin:3.1:testCompile (default-testCompile) @ commons-jcs-jcache-openjpa
---
[INFO] Changes detected - recompiling the module!
[INFO] Compiling 1 source file to <https://builds.apache.org/job/commons-jcs/ws/commons-jcs-jcache-openjpa/target/test-classes>
[INFO] 
[INFO] --- maven-surefire-plugin:2.17:test (default-test) @ commons-jcs-jcache-openjpa ---
[JENKINS] Recording test results
[INFO] 
[INFO] --- maven-jar-plugin:2.4:jar (default-jar) @ commons-jcs-jcache-openjpa ---
[INFO] Building jar: <https://builds.apache.org/job/commons-jcs/ws/commons-jcs-jcache-openjpa/target/commons-jcs-jcache-openjpa-2.0-SNAPSHOT.jar>
[INFO] 
[INFO] --- maven-site-plugin:3.3:attach-descriptor (attach-descriptor) @ commons-jcs-jcache-openjpa
---
[INFO] 
[INFO] --- maven-install-plugin:2.5.1:install (default-install) @ commons-jcs-jcache-openjpa
---
[INFO] Installing <https://builds.apache.org/job/commons-jcs/ws/commons-jcs-jcache-openjpa/target/commons-jcs-jcache-openjpa-2.0-SNAPSHOT.jar>
to /home/jenkins/jenkins-slave/maven-repositories/1/org/apache/commons/commons-jcs-jcache-openjpa/2.0-SNAPSHOT/commons-jcs-jcache-openjpa-2.0-SNAPSHOT.jar
[INFO] Installing <https://builds.apache.org/job/commons-jcs/ws/commons-jcs-jcache-openjpa/pom.xml>
to /home/jenkins/jenkins-slave/maven-repositories/1/org/apache/commons/commons-jcs-jcache-openjpa/2.0-SNAPSHOT/commons-jcs-jcache-openjpa-2.0-SNAPSHOT.pom
[INFO]                                                                         
[INFO] ------------------------------------------------------------------------
[INFO] Building Apache Commons JCS :: Distribution 2.0-SNAPSHOT
[INFO] ------------------------------------------------------------------------
[INFO] ------------------------------------------------------------------------
[INFO] Reactor Summary:
[INFO] 
[INFO] Apache Commons JCS ................................ SUCCESS [7.182s]
[INFO] Apache Commons JCS :: Core ........................ SUCCESS [41.108s]
[INFO] Apache Commons JCS :: JCache ...................... SUCCESS [3.685s]
[INFO] Apache Commons JCS :: JCache TCK .................. SUCCESS [3.162s]
[INFO] Apache Commons JCS :: JCache Extras ............... SUCCESS [3.292s]
[INFO] Apache Commons JCS :: JCache OpenJPA .............. SUCCESS [3.342s]
[INFO] Apache Commons JCS :: Distribution ................ FAILURE [0.133s]
[INFO] ------------------------------------------------------------------------
[INFO] BUILD FAILURE
[INFO] ------------------------------------------------------------------------
[INFO] Total time: 1:13.466s
[INFO] Finished at: Mon Nov 03 09:32:54 UTC 2014
[INFO] Final Memory: 33M/263M
[INFO] ------------------------------------------------------------------------
Waiting for Jenkins to finish collecting data
[ERROR] Failed to execute goal on project dist: Could not resolve dependencies for project
org.apache.commons:dist:pom:2.0-SNAPSHOT: The following artifacts could not be resolved: org.apache.commons:commons-jcs-core:jar:sources:2.0-SNAPSHOT,
org.apache.commons:commons-jcs-core:jar:javadoc:2.0-SNAPSHOT, org.apache.commons:commons-jcs-jcache:jar:sources:2.0-SNAPSHOT,
org.apache.commons:commons-jcs-jcache:jar:javadoc:2.0-SNAPSHOT, org.apache.commons:commons-jcs-jcache-extras:jar:sources:2.0-SNAPSHOT,
org.apache.commons:commons-jcs-jcache-extras:jar:javadoc:2.0-SNAPSHOT, org.apache.commons:commons-jcs-jcache-openjpa:jar:sources:2.0-SNAPSHOT,
org.apache.commons:commons-jcs-jcache-openjpa:jar:javadoc:2.0-SNAPSHOT: Could not find artifact
org.apache.commons:commons-jcs-core:jar:sources:2.0-SNAPSHOT -> [Help 1]
org.apache.maven.lifecycle.LifecycleExecutionException: Failed to execute goal on project
dist: Could not resolve dependencies for project org.apache.commons:dist:pom:2.0-SNAPSHOT:
The following artifacts could not be resolved: org.apache.commons:commons-jcs-core:jar:sources:2.0-SNAPSHOT,
org.apache.commons:commons-jcs-core:jar:javadoc:2.0-SNAPSHOT, org.apache.commons:commons-jcs-jcache:jar:sources:2.0-SNAPSHOT,
org.apache.commons:commons-jcs-jcache:jar:javadoc:2.0-SNAPSHOT, org.apache.commons:commons-jcs-jcache-extras:jar:sources:2.0-SNAPSHOT,
org.apache.commons:commons-jcs-jcache-extras:jar:javadoc:2.0-SNAPSHOT, org.apache.commons:commons-jcs-jcache-openjpa:jar:sources:2.0-SNAPSHOT,
org.apache.commons:commons-jcs-jcache-openjpa:jar:javadoc:2.0-SNAPSHOT: Could not find artifact
org.apache.commons:commons-jcs-core:jar:sources:2.0-SNAPSHOT
	at org.apache.maven.lifecycle.internal.LifecycleDependencyResolver.getDependencies(LifecycleDependencyResolver.java:210)
	at org.apache.maven.lifecycle.internal.LifecycleDependencyResolver.resolveProjectDependencies(LifecycleDependencyResolver.java:117)
	at org.apache.maven.lifecycle.internal.MojoExecutor.ensureDependenciesAreResolved(MojoExecutor.java:258)
	at org.apache.maven.lifecycle.internal.MojoExecutor.execute(MojoExecutor.java:201)
	at org.apache.maven.lifecycle.internal.MojoExecutor.execute(MojoExecutor.java:153)
	at org.apache.maven.lifecycle.internal.MojoExecutor.execute(MojoExecutor.java:145)
	at org.apache.maven.lifecycle.internal.LifecycleModuleBuilder.buildProject(LifecycleModuleBuilder.java:84)
	at org.apache.maven.lifecycle.internal.LifecycleModuleBuilder.buildProject(LifecycleModuleBuilder.java:59)
	at org.apache.maven.lifecycle.internal.LifecycleStarter.singleThreadedBuild(LifecycleStarter.java:183)
	at org.apache.maven.lifecycle.internal.LifecycleStarter.execute(LifecycleStarter.java:161)
	at org.apache.maven.DefaultMaven.doExecute(DefaultMaven.java:320)
	at org.apache.maven.DefaultMaven.execute(DefaultMaven.java:156)
	at org.jvnet.hudson.maven3.launcher.Maven3Launcher.main(Maven3Launcher.java:117)
	at sun.reflect.NativeMethodAccessorImpl.invoke0(Native Method)
	at sun.reflect.NativeMethodAccessorImpl.invoke(NativeMethodAccessorImpl.java:57)
	at sun.reflect.DelegatingMethodAccessorImpl.invoke(DelegatingMethodAccessorImpl.java:43)
	at java.lang.reflect.Method.invoke(Method.java:606)
	at org.codehaus.plexus.classworlds.launcher.Launcher.launchStandard(Launcher.java:329)
	at org.codehaus.plexus.classworlds.launcher.Launcher.launch(Launcher.java:239)
	at org.jvnet.hudson.maven3.agent.Maven3Main.launch(Maven3Main.java:178)
	at sun.reflect.NativeMethodAccessorImpl.invoke0(Native Method)
	at sun.reflect.NativeMethodAccessorImpl.invoke(NativeMethodAccessorImpl.java:57)
	at sun.reflect.DelegatingMethodAccessorImpl.invoke(DelegatingMethodAccessorImpl.java:43)
	at java.lang.reflect.Method.invoke(Method.java:606)
	at hudson.maven.Maven3Builder.call(Maven3Builder.java:134)
	at hudson.maven.Maven3Builder.call(Maven3Builder.java:69)
	at hudson.remoting.UserRequest.perform(UserRequest.java:118)
	at hudson.remoting.UserRequest.perform(UserRequest.java:48)
	at hudson.remoting.Request$2.run(Request.java:328)
	at hudson.remoting.InterceptingExecutorService$1.call(InterceptingExecutorService.java:72)
	at java.util.concurrent.FutureTask$Sync.innerRun(FutureTask.java:334)
	at java.util.concurrent.FutureTask.run(FutureTask.java:166)
	at java.util.concurrent.ThreadPoolExecutor.runWorker(ThreadPoolExecutor.java:1145)
	at java.util.concurrent.ThreadPoolExecutor$Worker.run(ThreadPoolExecutor.java:615)
	at java.lang.Thread.run(Thread.java:724)
Caused by: org.apache.maven.project.DependencyResolutionException: Could not resolve dependencies
for project org.apache.commons:dist:pom:2.0-SNAPSHOT: The following artifacts could not be
resolved: org.apache.commons:commons-jcs-core:jar:sources:2.0-SNAPSHOT, org.apache.commons:commons-jcs-core:jar:javadoc:2.0-SNAPSHOT,
org.apache.commons:commons-jcs-jcache:jar:sources:2.0-SNAPSHOT, org.apache.commons:commons-jcs-jcache:jar:javadoc:2.0-SNAPSHOT,
org.apache.commons:commons-jcs-jcache-extras:jar:sources:2.0-SNAPSHOT, org.apache.commons:commons-jcs-jcache-extras:jar:javadoc:2.0-SNAPSHOT,
org.apache.commons:commons-jcs-jcache-openjpa:jar:sources:2.0-SNAPSHOT, org.apache.commons:commons-jcs-jcache-openjpa:jar:javadoc:2.0-SNAPSHOT:
Could not find artifact org.apache.commons:commons-jcs-core:jar:sources:2.0-SNAPSHOT
	at org.apache.maven.project.DefaultProjectDependenciesResolver.resolve(DefaultProjectDependenciesResolver.java:189)
	at org.apache.maven.lifecycle.internal.LifecycleDependencyResolver.getDependencies(LifecycleDependencyResolver.java:185)
	... 34 more
Caused by: org.sonatype.aether.resolution.DependencyResolutionException: The following artifacts
could not be resolved: org.apache.commons:commons-jcs-core:jar:sources:2.0-SNAPSHOT, org.apache.commons:commons-jcs-core:jar:javadoc:2.0-SNAPSHOT,
org.apache.commons:commons-jcs-jcache:jar:sources:2.0-SNAPSHOT, org.apache.commons:commons-jcs-jcache:jar:javadoc:2.0-SNAPSHOT,
org.apache.commons:commons-jcs-jcache-extras:jar:sources:2.0-SNAPSHOT, org.apache.commons:commons-jcs-jcache-extras:jar:javadoc:2.0-SNAPSHOT,
org.apache.commons:commons-jcs-jcache-openjpa:jar:sources:2.0-SNAPSHOT, org.apache.commons:commons-jcs-jcache-openjpa:jar:javadoc:2.0-SNAPSHOT:
Could not find artifact org.apache.commons:commons-jcs-core:jar:sources:2.0-SNAPSHOT
	at org.sonatype.aether.impl.internal.DefaultRepositorySystem.resolveDependencies(DefaultRepositorySystem.java:375)
	at org.apache.maven.project.DefaultProjectDependenciesResolver.resolve(DefaultProjectDependenciesResolver.java:183)
	... 35 more
Caused by: org.sonatype.aether.resolution.ArtifactResolutionException: The following artifacts
could not be resolved: org.apache.commons:commons-jcs-core:jar:sources:2.0-SNAPSHOT, org.apache.commons:commons-jcs-core:jar:javadoc:2.0-SNAPSHOT,
org.apache.commons:commons-jcs-jcache:jar:sources:2.0-SNAPSHOT, org.apache.commons:commons-jcs-jcache:jar:javadoc:2.0-SNAPSHOT,
org.apache.commons:commons-jcs-jcache-extras:jar:sources:2.0-SNAPSHOT, org.apache.commons:commons-jcs-jcache-extras:jar:javadoc:2.0-SNAPSHOT,
org.apache.commons:commons-jcs-jcache-openjpa:jar:sources:2.0-SNAPSHOT, org.apache.commons:commons-jcs-jcache-openjpa:jar:javadoc:2.0-SNAPSHOT:
Could not find artifact org.apache.commons:commons-jcs-core:jar:sources:2.0-SNAPSHOT
	at org.sonatype.aether.impl.internal.DefaultArtifactResolver.resolve(DefaultArtifactResolver.java:538)
	at org.sonatype.aether.impl.internal.DefaultArtifactResolver.resolveArtifacts(DefaultArtifactResolver.java:216)
	at org.sonatype.aether.impl.internal.DefaultRepositorySystem.resolveDependencies(DefaultRepositorySystem.java:358)
	... 36 more
Caused by: org.sonatype.aether.transfer.ArtifactNotFoundException: Could not find artifact
org.apache.commons:commons-jcs-core:jar:sources:2.0-SNAPSHOT
	at org.sonatype.aether.impl.internal.DefaultArtifactResolver.resolve(DefaultArtifactResolver.java:528)
	... 38 more
[ERROR] 
[ERROR] Re-run Maven using the -X switch to enable full debug logging.
[ERROR] 
[ERROR] For more information about the errors and possible solutions, please read the following
articles:
[ERROR] [Help 1] http://cwiki.apache.org/confluence/display/MAVEN/DependencyResolutionException
[ERROR] 
[ERROR] After correcting the problems, you can resume the build with the command
[ERROR]   mvn <goals> -rf :dist
[JENKINS] Archiving <https://builds.apache.org/job/commons-jcs/ws/commons-jcs-core/pom.xml>
to org.apache.commons/commons-jcs-core/2.0-SNAPSHOT/commons-jcs-core-2.0-SNAPSHOT.pom
[JENKINS] Archiving <https://builds.apache.org/job/commons-jcs/ws/commons-jcs-core/target/commons-jcs-core-2.0-SNAPSHOT.jar>
to org.apache.commons/commons-jcs-core/2.0-SNAPSHOT/commons-jcs-core-2.0-SNAPSHOT.jar
[JENKINS] Archiving <https://builds.apache.org/job/commons-jcs/ws/commons-jcs-core/target/commons-jcs-core-2.0-SNAPSHOT-tests.jar>
to org.apache.commons/commons-jcs-core/2.0-SNAPSHOT/commons-jcs-core-2.0-SNAPSHOT-tests.jar
Sending artifact delta relative to commons-jcs » Apache Commons JCS :: Core #55
Archived 3 artifacts
Archive block size is 32768
Received 0 blocks and 973703 bytes
Compression is 0.0%
Took 0.76 sec
[JENKINS] Archiving <https://builds.apache.org/job/commons-jcs/ws/commons-jcs-jcache/pom.xml>
to org.apache.commons/commons-jcs-jcache/2.0-SNAPSHOT/commons-jcs-jcache-2.0-SNAPSHOT.pom
[JENKINS] Archiving <https://builds.apache.org/job/commons-jcs/ws/commons-jcs-jcache/target/commons-jcs-jcache-2.0-SNAPSHOT.jar>
to org.apache.commons/commons-jcs-jcache/2.0-SNAPSHOT/commons-jcs-jcache-2.0-SNAPSHOT.jar
Sending artifact delta relative to commons-jcs » Apache Commons JCS :: JCache #55
Archived 2 artifacts
Archive block size is 32768
Received 0 blocks and 90600 bytes
Compression is 0.0%
Took 1.4 sec
[JENKINS] Archiving <https://builds.apache.org/job/commons-jcs/ws/pom.xml> to org.apache.commons/commons-jcs/2.0-SNAPSHOT/commons-jcs-2.0-SNAPSHOT.pom
[JENKINS] Archiving <https://builds.apache.org/job/commons-jcs/ws/target/commons-jcs-2.0-SNAPSHOT-site.xml>
to org.apache.commons/commons-jcs/2.0-SNAPSHOT/commons-jcs-2.0-SNAPSHOT-site.xml
Sending artifact delta relative to commons-jcs » Apache Commons JCS #55
Archived 2 artifacts
Archive block size is 32768
Received 0 blocks and 20541 bytes
Compression is 0.0%
Took 0.24 sec
[JENKINS] Archiving <https://builds.apache.org/job/commons-jcs/ws/commons-jcs-jcache-extras/pom.xml>
to org.apache.commons/commons-jcs-jcache-extras/2.0-SNAPSHOT/commons-jcs-jcache-extras-2.0-SNAPSHOT.pom
[JENKINS] Archiving <https://builds.apache.org/job/commons-jcs/ws/commons-jcs-jcache-extras/target/commons-jcs-jcache-extras-2.0-SNAPSHOT.jar>
to org.apache.commons/commons-jcs-jcache-extras/2.0-SNAPSHOT/commons-jcs-jcache-extras-2.0-SNAPSHOT.jar
Sending artifact delta relative to commons-jcs » Apache Commons JCS :: JCache Extras #55
Archived 2 artifacts
Archive block size is 32768
Received 0 blocks and 37683 bytes
Compression is 0.0%
Took 0.12 sec
[JENKINS] Archiving <https://builds.apache.org/job/commons-jcs/ws/commons-jcs-tck-tests/pom.xml>
to org.apache.commons/commons-jcs-jcache-tck/2.0-SNAPSHOT/commons-jcs-jcache-tck-2.0-SNAPSHOT.pom
[JENKINS] Archiving <https://builds.apache.org/job/commons-jcs/ws/commons-jcs-tck-tests/target/commons-jcs-jcache-tck-2.0-SNAPSHOT.jar>
to org.apache.commons/commons-jcs-jcache-tck/2.0-SNAPSHOT/commons-jcs-jcache-tck-2.0-SNAPSHOT.jar
Sending artifact delta relative to commons-jcs » Apache Commons JCS :: JCache TCK #55
Archived 2 artifacts
Archive block size is 32768
Received 0 blocks and 11447 bytes
Compression is 0.0%
Took 86 ms
[JENKINS] Archiving <https://builds.apache.org/job/commons-jcs/ws/commons-jcs-dist/pom.xml>
to org.apache.commons/dist/2.0-SNAPSHOT/dist-2.0-SNAPSHOT.pom
No prior successful build to compare, so performing full copy of artifacts
[JENKINS] Archiving <https://builds.apache.org/job/commons-jcs/ws/commons-jcs-jcache-openjpa/pom.xml>
to org.apache.commons/commons-jcs-jcache-openjpa/2.0-SNAPSHOT/commons-jcs-jcache-openjpa-2.0-SNAPSHOT.pom
[JENKINS] Archiving <https://builds.apache.org/job/commons-jcs/ws/commons-jcs-jcache-openjpa/target/commons-jcs-jcache-openjpa-2.0-SNAPSHOT.jar>
to org.apache.commons/commons-jcs-jcache-openjpa/2.0-SNAPSHOT/commons-jcs-jcache-openjpa-2.0-SNAPSHOT.jar
Sending artifact delta relative to commons-jcs » Apache Commons JCS :: JCache OpenJPA #55
Archived 2 artifacts
Archive block size is 32768
Received 0 blocks and 14750 bytes
Compression is 0.0%
Took 89 ms
Sending e-mails to: dev@commons.apache.org
channel stopped

---------------------------------------------------------------------
To unsubscribe, e-mail: dev-unsubscribe@commons.apache.org
For additional commands, e-mail: dev-help@commons.apache.org


Mime
View raw message