commons-dev mailing list archives

Site index · List index
Message view « Date » · « Thread »
Top « Date » · « Thread »
From Schalk Cronjé <ysb...@gmail.com>
Subject [VFS] CustomRamProviderTest failure
Date Mon, 20 Oct 2014 01:35:39 GMT
When building from the Git repo of VFS I get the below error. I am sure 
this was a previous issue that has been fixed. Is the Git repo in sync 
with the SVN repo?

    Tests run: 9, Failures: 0, Errors: 1, Skipped: 0, Time elapsed:
    0.018 sec <<< FAILURE! - in
    org.apache.commons.vfs2.provider.ram.test.CustomRamProviderTest
    testSmallFS(org.apache.commons.vfs2.provider.ram.test.CustomRamProviderTest)
    Time elapsed: 0.009 sec  <<< ERROR!
    java.lang.IllegalArgumentException: Self-suppression not permitted
         at java.lang.Throwable.addSuppressed(Throwable.java:1043)
         at java.io.FilterOutputStream.close(FilterOutputStream.java:159)
         at
    org.apache.commons.vfs2.util.MonitorOutputStream.close(MonitorOutputStream.java:54)
         at
    org.apache.commons.vfs2.provider.DefaultFileContent$FileContentOutputStream.close(DefaultFileContent.java:711)
         at
    org.apache.commons.vfs2.provider.ram.test.CustomRamProviderTest.testSmallFS(CustomRamProviderTest.java:264)
         at sun.reflect.NativeMethodAccessorImpl.invoke0(Native Method)
         at
    sun.reflect.NativeMethodAccessorImpl.invoke(NativeMethodAccessorImpl.java:62)
         at
    sun.reflect.DelegatingMethodAccessorImpl.invoke(DelegatingMethodAccessorImpl.java:43)
         at java.lang.reflect.Method.invoke(Method.java:483)
         at
    org.junit.runners.model.FrameworkMethod$1.runReflectiveCall(FrameworkMethod.java:47)
         at
    org.junit.internal.runners.model.ReflectiveCallable.run(ReflectiveCallable.java:12)
         at
    org.junit.runners.model.FrameworkMethod.invokeExplosively(FrameworkMethod.java:44)
         at
    org.junit.internal.runners.statements.InvokeMethod.evaluate(InvokeMethod.java:17)
         at
    org.junit.internal.runners.statements.RunBefores.evaluate(RunBefores.java:26)
         at
    org.junit.internal.runners.statements.RunAfters.evaluate(RunAfters.java:27)
         at org.junit.runners.ParentRunner.runLeaf(ParentRunner.java:271)
         at
    org.junit.runners.BlockJUnit4ClassRunner.runChild(BlockJUnit4ClassRunner.java:70)
         at
    org.junit.runners.BlockJUnit4ClassRunner.runChild(BlockJUnit4ClassRunner.java:50)
         at org.junit.runners.ParentRunner$3.run(ParentRunner.java:238)
         at org.junit.runners.ParentRunner$1.schedule(ParentRunner.java:63)
         at
    org.junit.runners.ParentRunner.runChildren(ParentRunner.java:236)
         at org.junit.runners.ParentRunner.access$000(ParentRunner.java:53)
         at org.junit.runners.ParentRunner$2.evaluate(ParentRunner.java:229)
         at org.junit.runners.ParentRunner.run(ParentRunner.java:309)
         at
    org.apache.maven.surefire.junit4.JUnit4Provider.execute(JUnit4Provider.java:264)
         at
    org.apache.maven.surefire.junit4.JUnit4Provider.executeTestSet(JUnit4Provider.java:153)
         at
    org.apache.maven.surefire.junit4.JUnit4Provider.invoke(JUnit4Provider.java:124)
         at
    org.apache.maven.surefire.booter.ForkedBooter.invokeProviderInSameClassLoader(ForkedBooter.java:200)
         at
    org.apache.maven.surefire.booter.ForkedBooter.runSuitesInProcess(ForkedBooter.java:153)
         at
    org.apache.maven.surefire.booter.ForkedBooter.main(ForkedBooter.java:103)
    Caused by: java.io.IOException: FileSystem capacity (10) exceeded.
         at
    org.apache.commons.vfs2.provider.ram.RamFileObject.resize(RamFileObject.java:277)
         at
    org.apache.commons.vfs2.provider.ram.RamFileOutputStream.write(RamFileOutputStream.java:68)
         at
    java.io.BufferedOutputStream.flushBuffer(BufferedOutputStream.java:82)
         at
    java.io.BufferedOutputStream.flush(BufferedOutputStream.java:140)
         at
    org.apache.commons.vfs2.util.MonitorOutputStream.flush(MonitorOutputStream.java:114)
         at java.io.FilterOutputStream.close(FilterOutputStream.java:158)
         ... 28 more





-- 
Schalk W. Cronjé
@ysb33r


Mime
  • Unnamed multipart/alternative (inline, None, 0 bytes)
View raw message