commons-dev mailing list archives

Site index · List index
Message view « Date » · « Thread »
Top « Date » · « Thread »
From Apache Continuum <...@continuum.apache.org>
Subject [continuum] BUILD FAILURE: Apache Commons Math - Apache Commons (Group (shared) Maven 3 Build Definition (Java 1.7))
Date Sat, 19 Jul 2014 06:25:57 GMT
Online report : https://continuum-ci.apache.org/continuum/buildResult.action?buildId=34253&projectId=97

Build statistics:
  State: Failed
  Previous Build: No previous build.
  Started at: Sat 19 Jul 2014 06:20:25 +0000
  Finished at: Sat 19 Jul 2014 06:25:55 +0000
  Total time: 5m 30s
  Build Trigger: Schedule
  Build Number: 1451
  Exit code: 1
  Building machine hostname: continuum-vm
  Operating system : Linux(unknown)
  Java Home version : 
          java version "1.7.0_55"
          OpenJDK Runtime Environment (IcedTea 2.4.7) (7u55-2.4.7-1ubuntu1~0.12.04.2)
          OpenJDK 64-Bit Server VM (build 24.51-b03, mixed mode)
        
  Builder version :
          Apache Maven 3.0.5 (r01de14724cdef164cd33c7c8c2fe155faf9602da; 2013-02-19 13:51:28+0000)
          Maven home: /opt/apache-maven-3.0.5
          Java version: 1.7.0_55, vendor: Oracle Corporation
          Java home: /usr/lib/jvm/java-7-openjdk-amd64/jre
          Default locale: en_US, platform encoding: ANSI_X3.4-1968
          OS name: "linux", version: "3.2.0-64-generic", arch: "amd64", family: "unix"
    
****************************************************************************
SCM Changes:
****************************************************************************
No files changed

****************************************************************************
Dependencies Changes:
****************************************************************************
No dependencies changed


****************************************************************************
Build Definition:
****************************************************************************
POM filename: pom.xml
Goals: clean deploy   
Arguments: --batch-mode -Pjava-1.7 -Dgpg.skip -Prelease
Build Fresh: false
Always Build: false
Default Build Definition: false
Schedule: COMMONS_SCHEDULE
Profile Name: Maven 3.0.5 with Java 7
Description: Group (shared) Maven 3 Build Definition (Java 1.7)

****************************************************************************
Test Summary:
****************************************************************************
Tests: 6087
Failures: 1
Errors: 0
Success Rate: 99
Total time: 253.01414

****************************************************************************
Test Failures:
****************************************************************************

CorrelatedRandomVectorGeneratorTest
    testSampleWithZeroCovariance :
  java.lang.AssertionError
  java.lang.AssertionError: Array comparison failure
 Elements at index 2 differ.  expected = 0.023006616 observed = 0.024197611731378105
	at org.junit.Assert.fail(Assert.java:88)
	at org.apache.commons.math3.TestUtils.assertEquals(TestUtils.java:365)
	at org.apache.commons.math3.TestUtils.assertEquals(TestUtils.java:102)
	at org.apache.commons.math3.random.CorrelatedRandomVectorGeneratorTest.testSampler(CorrelatedRandomVectorGeneratorTest.java:193)
	at org.apache.commons.math3.random.CorrelatedRandomVectorGeneratorTest.testSampleWithZeroCovariance(CorrelatedRandomVectorGeneratorTest.java:168)


  


---------------------------------------------------------------------
To unsubscribe, e-mail: dev-unsubscribe@commons.apache.org
For additional commands, e-mail: dev-help@commons.apache.org


Mime
View raw message