commons-dev mailing list archives

Site index · List index
Message view « Date » · « Thread »
Top « Date » · « Thread »
From Apache Continuum <...@continuum.apache.org>
Subject [continuum] BUILD FAILURE: Apache Commons Math - Apache Commons (Group (shared) Maven 3 Build Definition (Java 1.7))
Date Mon, 21 Jul 2014 17:34:09 GMT
Online report : https://continuum-ci.apache.org/continuum/buildResult.action?buildId=34384&projectId=97

Build statistics:
  State: Failed
  Previous State: Failed
  Started at: Mon 21 Jul 2014 17:28:42 +0000
  Finished at: Mon 21 Jul 2014 17:34:06 +0000
  Total time: 5m 24s
  Build Trigger: Schedule
  Build Number: 1451
  Exit code: 1
  Building machine hostname: continuum-vm
  Operating system : Linux(unknown)
  Java Home version : 
          java version "1.7.0_55"
          OpenJDK Runtime Environment (IcedTea 2.4.7) (7u55-2.4.7-1ubuntu1~0.12.04.2)
          OpenJDK 64-Bit Server VM (build 24.51-b03, mixed mode)
        
  Builder version :
          Apache Maven 3.0.5 (r01de14724cdef164cd33c7c8c2fe155faf9602da; 2013-02-19 13:51:28+0000)
          Maven home: /opt/apache-maven-3.0.5
          Java version: 1.7.0_55, vendor: Oracle Corporation
          Java home: /usr/lib/jvm/java-7-openjdk-amd64/jre
          Default locale: en_US, platform encoding: ANSI_X3.4-1968
          OS name: "linux", version: "3.2.0-64-generic", arch: "amd64", family: "unix"
    
****************************************************************************
SCM Changes:
****************************************************************************
Changed: luc @ Mon 21 Jul 2014 16:38:45 +0000
Comment: Refactored removeAndSlice, replaceAndSlice.

Thansk to Venkatesha Murthy TS for the patch.

JIRA: MATH-1120
Files changed:
  /commons/proper/math/trunk/src/main/java/org/apache/commons/math3/stat/descriptive/rank/Percentile.java
( 1612346 )
  /commons/proper/math/trunk/src/test/java/org/apache/commons/math3/stat/descriptive/rank/PercentileTest.java
( 1612346 )

****************************************************************************
Dependencies Changes:
****************************************************************************
No dependencies changed


****************************************************************************
Build Definition:
****************************************************************************
POM filename: pom.xml
Goals: clean deploy   
Arguments: --batch-mode -Pjava-1.7 -Dgpg.skip -Prelease
Build Fresh: false
Always Build: false
Default Build Definition: false
Schedule: COMMONS_SCHEDULE
Profile Name: Maven 3.0.5 with Java 7
Description: Group (shared) Maven 3 Build Definition (Java 1.7)

****************************************************************************
Test Summary:
****************************************************************************
Tests: 6087
Failures: 1
Errors: 0
Success Rate: 99
Total time: 255.66605

****************************************************************************
Test Failures:
****************************************************************************

KohonenTrainingTaskTest
    testTravellerSalesmanSquareTourParallelSolver :
  java.lang.AssertionError
  java.lang.AssertionError: expected:<1.0> but was:<0.8686291501015241>
	at org.junit.Assert.fail(Assert.java:88)
	at org.junit.Assert.failNotEquals(Assert.java:743)
	at org.junit.Assert.assertEquals(Assert.java:494)
	at org.junit.Assert.assertEquals(Assert.java:592)
	at org.apache.commons.math3.ml.neuralnet.sofm.KohonenTrainingTaskTest.testTravellerSalesmanSquareTourParallelSolver(KohonenTrainingTaskTest.java:127)


  


---------------------------------------------------------------------
To unsubscribe, e-mail: dev-unsubscribe@commons.apache.org
For additional commands, e-mail: dev-help@commons.apache.org


Mime
View raw message