commons-dev mailing list archives

Site index · List index
Message view « Date » · « Thread »
Top « Date » · « Thread »
From Apache Continuum <...@continuum.apache.org>
Subject [continuum] BUILD FAILURE: Apache Commons JCS - Apache Commons (Group (shared) Maven 3 Build Definition (Java 1.6))
Date Sun, 29 Jun 2014 13:26:04 GMT
Online report : https://continuum-ci.apache.org/continuum/buildResult.action?buildId=33244&projectId=286

Build statistics:
  State: Failed
  Previous State: Failed
  Started at: Sun 29 Jun 2014 13:22:18 +0000
  Finished at: Sun 29 Jun 2014 13:25:59 +0000
  Total time: 3m 40s
  Build Trigger: Schedule
  Build Number: 1
  Exit code: 1
  Building machine hostname: continuum-vm
  Operating system : Linux(unknown)
  Java Home version : 
          java version "1.6.0_31"
          OpenJDK Runtime Environment (IcedTea6 1.13.3) (6b31-1.13.3-1ubuntu1~0.12.04.2)
          OpenJDK 64-Bit Server VM (build 23.25-b01, mixed mode)
        
  Builder version :
          Apache Maven 3.0.5 (r01de14724cdef164cd33c7c8c2fe155faf9602da; 2013-02-19 13:51:28+0000)
          Maven home: /opt/apache-maven-3.0.5
          Java version: 1.6.0_31, vendor: Sun Microsystems Inc.
          Java home: /usr/lib/jvm/java-6-openjdk-amd64/jre
          Default locale: en_US, platform encoding: ANSI_X3.4-1968
          OS name: "linux", version: "3.2.0-64-generic", arch: "amd64", family: "unix"
    
****************************************************************************
SCM Changes:
****************************************************************************
Changed: tv @ Sun 29 Jun 2014 12:26:15 +0000
Comment: Remove KeyGeneratorUtil and AddressUtil as they are not used. Fixes JCS-131
Files changed:
  /commons/proper/jcs/trunk/commons-jcs-core/src/main/java/org/apache/commons/jcs/utils/key/KeyGeneratorUtil.java
( 1606496 )
  /commons/proper/jcs/trunk/commons-jcs-core/src/main/java/org/apache/commons/jcs/utils/net/AddressUtil.java
( 1606496 )
  /commons/proper/jcs/trunk/commons-jcs-core/src/test/java/org/apache/commons/jcs/utils/key/KeyGeneratorUtilUnitTest.java
( 1606496 )
  /commons/proper/jcs/trunk/commons-jcs-core/src/test/java/org/apache/commons/jcs/utils/net/AddressUtilUnitTest.java
( 1606496 )
  /commons/proper/jcs/trunk/src/changes/changes.xml ( 1606496 )

Changed: tv @ Sun 29 Jun 2014 12:28:36 +0000
Comment: Remove KeyGeneratorUtil and AddressUtil as they are not used. Fixes JCS-131
Files changed:
  /commons/proper/jcs/trunk/commons-jcs-core/src/main/java/org/apache/commons/jcs/utils/key
( 1606498 )

Changed: tv @ Sun 29 Jun 2014 12:29:01 +0000
Comment: Remove KeyGeneratorUtil and AddressUtil as they are not used. Fixes JCS-131
Files changed:
  /commons/proper/jcs/trunk/commons-jcs-core/src/test/java/org/apache/commons/jcs/utils/key
( 1606499 )

****************************************************************************
Dependencies Changes:
****************************************************************************
No dependencies changed


****************************************************************************
Build Definition:
****************************************************************************
POM filename: pom.xml
Goals: clean deploy   
Arguments: --batch-mode -Pjava-1.6 -Dgpg.skip -Prelease
Build Fresh: false
Always Build: false
Default Build Definition: true
Schedule: COMMONS_SCHEDULE
Profile Name: Maven 3.0.5
Description: Group (shared) Maven 3 Build Definition (Java 1.6)

****************************************************************************
Test Summary:
****************************************************************************
Tests: 368
Failures: 4
Errors: 0
Success Rate: 98
Total time: 130.19998

****************************************************************************
Test Failures:
****************************************************************************

BasicRemoteCacheClientServerUnitTest
    test1SinglePut :
  java.lang.AssertionError
  java.lang.AssertionError: Cache is alive expected:<ALIVE> but was:<ERROR>
	at org.junit.Assert.fail(Assert.java:88)
	at org.junit.Assert.failNotEquals(Assert.java:743)
	at org.junit.Assert.assertEquals(Assert.java:118)
	at org.apache.commons.jcs.auxiliary.remote.server.BasicRemoteCacheClientServerUnitTest.test1SinglePut(BasicRemoteCacheClientServerUnitTest.java:118)


    test2PutRemove :
  java.lang.AssertionError
  java.lang.AssertionError: Cache is alive expected:<ALIVE> but was:<ERROR>
	at org.junit.Assert.fail(Assert.java:88)
	at org.junit.Assert.failNotEquals(Assert.java:743)
	at org.junit.Assert.assertEquals(Assert.java:118)
	at org.apache.commons.jcs.auxiliary.remote.server.BasicRemoteCacheClientServerUnitTest.test2PutRemove(BasicRemoteCacheClientServerUnitTest.java:168)


    test3PutAndListen :
  java.lang.AssertionError
  java.lang.AssertionError: Cache is alive expected:<ALIVE> but was:<ERROR>
	at org.junit.Assert.fail(Assert.java:88)
	at org.junit.Assert.failNotEquals(Assert.java:743)
	at org.junit.Assert.assertEquals(Assert.java:118)
	at org.apache.commons.jcs.auxiliary.remote.server.BasicRemoteCacheClientServerUnitTest.test3PutAndListen(BasicRemoteCacheClientServerUnitTest.java:226)


    test4PutaMultipleAndListen :
  java.lang.AssertionError
  java.lang.AssertionError: Cache is alive expected:<ALIVE> but was:<ERROR>
	at org.junit.Assert.fail(Assert.java:88)
	at org.junit.Assert.failNotEquals(Assert.java:743)
	at org.junit.Assert.assertEquals(Assert.java:118)
	at org.apache.commons.jcs.auxiliary.remote.server.BasicRemoteCacheClientServerUnitTest.test4PutaMultipleAndListen(BasicRemoteCacheClientServerUnitTest.java:280)


  


---------------------------------------------------------------------
To unsubscribe, e-mail: dev-unsubscribe@commons.apache.org
For additional commands, e-mail: dev-help@commons.apache.org


Mime
View raw message