commons-dev mailing list archives

Site index · List index
Message view « Date » · « Thread »
Top « Date » · « Thread »
From Apache Continuum <...@continuum.apache.org>
Subject [continuum] BUILD FAILURE: Apache Commons Email - Apache Commons (Group (shared) Maven 3 Build Definition (Java 1.6))
Date Mon, 30 Jun 2014 06:21:40 GMT
Online report : https://continuum-ci.apache.org/continuum/buildResult.action?buildId=33280&projectId=79

Build statistics:
  State: Failed
  Previous State: Failed
  Started at: Mon 30 Jun 2014 06:20:48 +0000
  Finished at: Mon 30 Jun 2014 06:21:39 +0000
  Total time: 50s
  Build Trigger: Schedule
  Build Number: 105
  Exit code: 1
  Building machine hostname: continuum-vm
  Operating system : Linux(unknown)
  Java Home version : 
          java version "1.6.0_31"
          OpenJDK Runtime Environment (IcedTea6 1.13.3) (6b31-1.13.3-1ubuntu1~0.12.04.2)
          OpenJDK 64-Bit Server VM (build 23.25-b01, mixed mode)
        
  Builder version :
          Apache Maven 3.0.5 (r01de14724cdef164cd33c7c8c2fe155faf9602da; 2013-02-19 13:51:28+0000)
          Maven home: /opt/apache-maven-3.0.5
          Java version: 1.6.0_31, vendor: Sun Microsystems Inc.
          Java home: /usr/lib/jvm/java-6-openjdk-amd64/jre
          Default locale: en_US, platform encoding: ANSI_X3.4-1968
          OS name: "linux", version: "3.2.0-64-generic", arch: "amd64", family: "unix"
    
****************************************************************************
SCM Changes:
****************************************************************************
Changed: tn @ Mon 30 Jun 2014 06:10:47 +0000
Comment: Remove personal email address from live test.
Files changed:
  /commons/proper/email/trunk/src/test/java/org/apache/commons/mail/EmailLiveTest.java ( 1606629
)

****************************************************************************
Dependencies Changes:
****************************************************************************
No dependencies changed


****************************************************************************
Build Definition:
****************************************************************************
POM filename: pom.xml
Goals: clean deploy   
Arguments: --batch-mode -Pjava-1.6 -Dgpg.skip -Prelease
Build Fresh: false
Always Build: false
Default Build Definition: true
Schedule: COMMONS_SCHEDULE
Profile Name: Maven 3.0.5
Description: Group (shared) Maven 3 Build Definition (Java 1.6)

****************************************************************************
Test Summary:
****************************************************************************
Tests: 173
Failures: 1
Errors: 0
Success Rate: 99
Total time: 19.688

****************************************************************************
Test Failures:
****************************************************************************

SimpleEmailTest
    testDefaultMimeCharset :
  java.lang.AssertionError:
  java.lang.AssertionError: null
	at org.junit.Assert.fail(Assert.java:86)
	at org.junit.Assert.assertTrue(Assert.java:41)
	at org.junit.Assert.assertTrue(Assert.java:52)
	at org.apache.commons.mail.SimpleEmailTest.testDefaultMimeCharset(SimpleEmailTest.java:158)


  


---------------------------------------------------------------------
To unsubscribe, e-mail: dev-unsubscribe@commons.apache.org
For additional commands, e-mail: dev-help@commons.apache.org


Mime
View raw message